{
  "name": "viscrapable",
  "version": "0.1.0",
  "description": "The Scrapable visual editor",
  "repository": {
    "type": "git",
    "url": "gitlab.com/scrapable/viscrapable"
  },
  "author": "Scrapable Team"
}
