%YAML 1.1
%TAG !u! tag:unity3d.com,2011:
--- !u!1001 &100100000
Prefab:
  m_ObjectHideFlags: 1
  serializedVersion: 2
  m_Modification:
    m_TransformParent: {fileID: 0}
    m_Modifications: []
    m_RemovedComponents: []
  m_SourcePrefab: {fileID: 0}
  m_RootGameObject: {fileID: 1703449354581436}
  m_IsPrefabAsset: 1
--- !u!1 &1703449354581436
GameObject:
  m_ObjectHideFlags: 0
  m_CorrespondingSourceObject: {fileID: 0}
  m_PrefabInternal: {fileID: 100100000}
  serializedVersion: 6
  m_Component:
  - component: {fileID: 4322518649862358}
  - component: {fileID: 114733528440236636}
  m_Layer: 0
  m_Name: DesignInspector
  m_TagString: Untagged
  m_Icon: {fileID: 0}
  m_NavMeshLayer: 0
  m_StaticEditorFlags: 0
  m_IsActive: 1
--- !u!4 &4322518649862358
Transform:
  m_ObjectHideFlags: 1
  m_CorrespondingSourceObject: {fileID: 0}
  m_PrefabInternal: {fileID: 100100000}
  m_GameObject: {fileID: 1703449354581436}
  m_LocalRotation: {x: -0, y: -0, z: -0, w: 1}
  m_LocalPosition: {x: 0, y: 0, z: 0}
  m_LocalScale: {x: 1, y: 1, z: 1}
  m_Children: []
  m_Father: {fileID: 0}
  m_RootOrder: 0
  m_LocalEulerAnglesHint: {x: 0, y: 0, z: 0}
--- !u!114 &114733528440236636
MonoBehaviour:
  m_ObjectHideFlags: 1
  m_CorrespondingSourceObject: {fileID: 0}
  m_PrefabInternal: {fileID: 100100000}
  m_GameObject: {fileID: 1703449354581436}
  m_Enabled: 1
  m_EditorHideFlags: 0
  m_Script: {fileID: 11500000, guid: 82f92f67f1715894db4a85bd2b3eaedc, type: 3}
  m_Name: 
  m_EditorClassIdentifier: 
  objectLabelPrefab: {fileID: 114296612744752628, guid: 26f325485cf38e440aa5c99da124f958,
    type: 2}
  behaviourLabelPrefab: {fileID: 114416405924034542, guid: 0aa78bf5d31f5244cad0e3939133c074,
    type: 2}
  sliderPrefab: {fileID: 114027483388167140, guid: 295cefef354eb4e40bc867dbad7dbda2,
    type: 2}
  togglePrefab: {fileID: 114586489642201814, guid: 05dc2a106f06bfe409f4b16d458fc616,
    type: 2}
  contentLocation: {fileID: 0}
  objectsToDisplay:
  - {fileID: 0}
