mode: count
gitlab.com/scostanzo.dev/gitlab-ci/main.go:19.156,21.2 1 0
gitlab.com/scostanzo.dev/gitlab-ci/main.go:23.33,26.16 3 1
gitlab.com/scostanzo.dev/gitlab-ci/main.go:29.2,29.20 1 1
gitlab.com/scostanzo.dev/gitlab-ci/main.go:26.16,28.3 1 0
gitlab.com/scostanzo.dev/gitlab-ci/main.go:32.13,37.2 2 0
