Style,Standard
Append Mode,1
Fill Mode,1
Capacity,100000
Count,421
Base Time Seconds,1653331596
Base Time Fractional,.674693520
Base Time,05/23/2022 18:46:36.674693520
Index,Reading,Unit,Range Digits,Disp Digits,Math,Start Group,Limit1 High,Limit1 Low,Limit2 High,Limit2 Low,Terminal,Questionable,Origin,Value,Unit,Digits,Output,Sense,Source Limit,Overtemp,Date,Time,Fractional Seconds
1,-2.17529452784e-10,Amp DC,.00000001,5.5,F,F,F,F,F,F,Front,F,Main,-0.0020286755171,Volt DC,100,T,2W,F,F,05/23/2022,18:46:36,.674693520
2,4.518323049041e-09,Amp DC,.00000001,5.5,F,F,F,F,F,F,Front,F,Main,0.4976680874825,Volt DC,100,T,2W,F,F,05/23/2022,18:46:37,.069565100
3,4.480547488583e-09,Amp DC,.00000001,5.5,F,F,F,F,F,F,Front,F,Main,0.9978913664818,Volt DC,100,T,2W,F,F,05/23/2022,18:46:37,.464409140
4,4.636317552098e-09,Amp DC,.00000001,5.5,F,F,F,F,F,F,Front,F,Main,1.4977715015411,Volt DC,100,T,2W,F,F,05/23/2022,18:46:37,.859256400
5,4.608141424001e-09,Amp DC,.00000001,5.5,F,F,F,F,F,F,Front,F,Main,1.9977319240570,Volt DC,100,T,2W,F,F,05/23/2022,18:46:38,.254102920
6,4.49914727696e-09,Amp DC,.00000001,5.5,F,F,F,F,F,F,Front,F,Main,2.4980921745300,Volt DC,100,T,2W,F,F,05/23/2022,18:46:38,.648956400
7,4.40180292216e-09,Amp DC,.00000001,5.5,F,F,F,F,F,F,Front,F,Main,2.9980065822601,Volt DC,100,T,2W,F,F,05/23/2022,18:46:39,.043806440
8,4.646937945552e-09,Amp DC,.00000001,5.5,F,F,F,F,F,F,Front,F,Main,3.4980123043060,Volt DC,100,T,2W,F,F,05/23/2022,18:46:39,.438640340
9,4.567722200477e-09,Amp DC,.00000001,5.5,F,F,F,F,F,F,Front,F,Main,3.9977538585663,Volt DC,100,T,2W,F,F,05/23/2022,18:46:39,.833496840
10,4.450286361646e-09,Amp DC,.00000001,5.5,F,F,F,F,F,F,Front,F,Main,4.4979205131531,Volt DC,100,T,2W,F,F,05/23/2022,18:46:40,.228354100
11,4.455830371342e-09,Amp DC,.00000001,5.5,F,F,F,F,F,F,Front,F,Main,4.9981760978699,Volt DC,100,T,2W,F,F,05/23/2022,18:46:40,.623192080
12,4.560556821076e-09,Amp DC,.00000001,5.5,F,F,F,F,F,F,Front,F,Main,5.4981722831726,Volt DC,100,T,2W,F,F,05/23/2022,18:46:41,.018030860
13,4.573354583925e-09,Amp DC,.00000001,5.5,F,F,F,F,F,F,Front,F,Main,5.9984402656555,Volt DC,100,T,2W,F,F,05/23/2022,18:46:41,.412914920
14,4.451935708971e-09,Amp DC,.00000001,5.5,F,F,F,F,F,F,Front,F,Main,6.4983334541321,Volt DC,100,T,2W,F,F,05/23/2022,18:46:41,.807749440
15,4.446111034895e-09,Amp DC,.00000001,5.5,F,F,F,F,F,F,Front,F,Main,6.9982700347900,Volt DC,100,T,2W,F,F,05/23/2022,18:46:42,.202611140
16,4.553513122119e-09,Amp DC,.00000001,5.5,F,F,F,F,F,F,Front,F,Main,7.4983553886414,Volt DC,100,T,2W,F,F,05/23/2022,18:46:42,.597432640
17,4.550923637936e-09,Amp DC,.00000001,5.5,F,F,F,F,F,F,Front,F,Main,7.9982371330261,Volt DC,100,T,2W,F,F,05/23/2022,18:46:42,.992297980
18,4.456281565979e-09,Amp DC,.00000001,5.5,F,F,F,F,F,F,Front,F,Main,8.4983043670654,Volt DC,100,T,2W,F,F,05/23/2022,18:46:43,.387179180
19,4.439286716007e-09,Amp DC,.00000001,5.5,F,F,F,F,F,F,Front,F,Main,8.9980745315552,Volt DC,100,T,2W,F,F,05/23/2022,18:46:43,.782064700
20,4.588366575575e-09,Amp DC,.00000001,5.5,F,F,F,F,F,F,Front,F,Main,9.4983310699463,Volt DC,100,T,2W,F,F,05/23/2022,18:46:44,.176929320
21,4.562251465501e-09,Amp DC,.00000001,5.5,F,F,F,F,F,F,Front,F,Main,9.9981651306152,Volt DC,100,T,2W,F,F,05/23/2022,18:46:44,.571771760
22,4.471550685281e-09,Amp DC,.00000001,5.5,F,F,F,F,F,F,Front,F,Main,10.4980344772339,Volt DC,100,T,2W,F,F,05/23/2022,18:46:44,.966624300
23,4.458093894044e-09,Amp DC,.00000001,5.5,F,F,F,F,F,F,Front,F,Main,10.9981613159180,Volt DC,100,T,2W,F,F,05/23/2022,18:46:45,.361475580
24,4.581378387769e-09,Amp DC,.00000001,5.5,F,F,F,F,F,F,Front,F,Main,11.4980859756470,Volt DC,100,T,2W,F,F,05/23/2022,18:46:45,.756334440
25,4.535220199386e-09,Amp DC,.00000001,5.5,F,F,F,F,F,F,Front,F,Main,11.9985675811768,Volt DC,100,T,2W,F,F,05/23/2022,18:46:46,.151206680
26,4.412888721106e-09,Amp DC,.00000001,5.5,F,F,F,F,F,F,Front,F,Main,12.4985752105713,Volt DC,100,T,2W,F,F,05/23/2022,18:46:46,.546073620
27,4.419494104013e-09,Amp DC,.00000001,5.5,F,F,F,F,F,F,Front,F,Main,12.9987907409668,Volt DC,100,T,2W,F,F,05/23/2022,18:46:46,.940933620
28,4.572088929677e-09,Amp DC,.00000001,5.5,F,F,F,F,F,F,Front,F,Main,13.4987440109253,Volt DC,100,T,2W,F,F,05/23/2022,18:46:47,.335822240
29,4.554674415402e-09,Amp DC,.00000001,5.5,F,F,F,F,F,F,Front,F,Main,13.9987297058105,Volt DC,100,T,2W,F,F,05/23/2022,18:46:47,.730662560
30,4.420087851287e-09,Amp DC,.00000001,5.5,F,F,F,F,F,F,Front,F,Main,14.4986619949341,Volt DC,100,T,2W,F,F,05/23/2022,18:46:48,.125535560
31,4.472660020127e-09,Amp DC,.00000001,5.5,F,F,F,F,F,F,Front,F,Main,14.9986133575439,Volt DC,100,T,2W,F,F,05/23/2022,18:46:48,.520398020
32,4.531484965042e-09,Amp DC,.00000001,5.5,F,F,F,F,F,F,Front,F,Main,15.4987535476685,Volt DC,100,T,2W,F,F,05/23/2022,18:46:48,.915286140
33,4.564770783588e-09,Amp DC,.00000001,5.5,F,F,F,F,F,F,Front,F,Main,15.9987659454346,Volt DC,100,T,2W,F,F,05/23/2022,18:46:49,.310172160
34,4.419465682304e-09,Amp DC,.00000001,5.5,F,F,F,F,F,F,Front,F,Main,16.4987621307373,Volt DC,100,T,2W,F,F,05/23/2022,18:46:49,.705039620
35,4.455237956336e-09,Amp DC,.00000001,5.5,F,F,F,F,F,F,Front,F,Main,16.9987583160400,Volt DC,100,T,2W,F,F,05/23/2022,18:46:50,.099919940
36,4.557223043378e-09,Amp DC,.00000001,5.5,F,F,F,F,F,F,Front,F,Main,17.4985370635986,Volt DC,100,T,2W,F,F,05/23/2022,18:46:50,.494788600
37,4.541218068255e-09,Amp DC,.00000001,5.5,F,F,F,F,F,F,Front,F,Main,17.9985752105713,Volt DC,100,T,2W,F,F,05/23/2022,18:46:50,.889670560
38,4.436522704765e-09,Amp DC,.00000001,5.5,F,F,F,F,F,F,Front,F,Main,18.4985389709473,Volt DC,100,T,2W,F,F,05/23/2022,18:46:51,.284528400
39,4.463745817418e-09,Amp DC,.00000001,5.5,F,F,F,F,F,F,Front,F,Main,18.9988746643066,Volt DC,100,T,2W,F,F,05/23/2022,18:46:51,.679395140
40,4.568663225513e-09,Amp DC,.00000001,5.5,F,F,F,F,F,F,Front,F,Main,19.4991455078125,Volt DC,100,T,2W,F,F,05/23/2022,18:46:52,.074266340
41,4.54911752712e-09,Amp DC,.00000001,5.5,F,F,F,F,F,F,Front,F,Main,19.9989624023438,Volt DC,100,T,2W,F,F,05/23/2022,18:46:52,.469115420
42,4.438803991036e-09,Amp DC,.00000001,5.5,F,F,F,F,F,F,Front,F,Main,20.4989814758301,Volt DC,100,T,2W,F,F,05/23/2022,18:46:52,.863982960
43,4.467769709748e-09,Amp DC,.00000001,5.5,F,F,F,F,F,F,Front,F,Main,20.9989299774170,Volt DC,100,T,2W,F,F,05/23/2022,18:46:53,.258857980
44,4.576952150614e-09,Amp DC,.00000001,5.5,F,F,F,F,F,F,Front,F,Main,21.4988441467285,Volt DC,100,T,2W,F,F,05/23/2022,18:46:53,.653714360
45,4.550201548881e-09,Amp DC,.00000001,5.5,F,F,F,F,F,F,Front,F,Main,21.9988822937012,Volt DC,100,T,2W,F,F,05/23/2022,18:46:54,.048592920
46,4.437176848171e-09,Amp DC,.00000001,5.5,F,F,F,F,F,F,Front,F,Main,22.4989070892334,Volt DC,100,T,2W,F,F,05/23/2022,18:46:54,.443448960
47,4.478861725943e-09,Amp DC,.00000001,5.5,F,F,F,F,F,F,Front,F,Main,22.9988613128662,Volt DC,100,T,2W,F,F,05/23/2022,18:46:54,.838319180
48,4.582997981117e-09,Amp DC,.00000001,5.5,F,F,F,F,F,F,Front,F,Main,23.4988441467285,Volt DC,100,T,2W,F,F,05/23/2022,18:46:55,.233170140
49,4.550753107679e-09,Amp DC,.00000001,5.5,F,F,F,F,F,F,Front,F,Main,23.9988021850586,Volt DC,100,T,2W,F,F,05/23/2022,18:46:55,.628038040
50,4.445900980699e-09,Amp DC,.00000001,5.5,F,F,F,F,F,F,Front,F,Main,24.4989833831787,Volt DC,100,T,2W,F,F,05/23/2022,18:46:56,.022915020
51,4.490853466876e-09,Amp DC,.00000001,5.5,F,F,F,F,F,F,Front,F,Main,24.9986896514893,Volt DC,100,T,2W,F,F,05/23/2022,18:46:56,.417772180
52,4.591643953944e-09,Amp DC,.00000001,5.5,F,F,F,F,F,F,Front,F,Main,25.4984836578369,Volt DC,100,T,2W,F,F,05/23/2022,18:46:56,.812646520
53,4.555910315673e-09,Amp DC,.00000001,5.5,F,F,F,F,F,F,Front,F,Main,25.9981307983398,Volt DC,100,T,2W,F,F,05/23/2022,18:46:57,.207508900
54,4.454820956568e-09,Amp DC,.00000001,5.5,F,F,F,F,F,F,Front,F,Main,26.4985389709473,Volt DC,100,T,2W,F,F,05/23/2022,18:46:57,.602370460
55,4.504523420934e-09,Amp DC,.00000001,5.5,F,F,F,F,F,F,Front,F,Main,26.9984855651855,Volt DC,100,T,2W,F,F,05/23/2022,18:46:57,.997219640
56,4.598736946804e-09,Amp DC,.00000001,5.5,F,F,F,F,F,F,Front,F,Main,27.4983139038086,Volt DC,100,T,2W,F,F,05/23/2022,18:46:58,.392101280
57,4.557332733413e-09,Amp DC,.00000001,5.5,F,F,F,F,F,F,Front,F,Main,27.9984474182129,Volt DC,100,T,2W,F,F,05/23/2022,18:46:58,.786990860
58,4.450923185573e-09,Amp DC,.00000001,5.5,F,F,F,F,F,F,Front,F,Main,28.4982795715332,Volt DC,100,T,2W,F,F,05/23/2022,18:46:59,.181855920
59,4.515073204203e-09,Amp DC,.00000001,5.5,F,F,F,F,F,F,Front,F,Main,28.9983043670654,Volt DC,100,T,2W,F,F,05/23/2022,18:46:59,.576732540
60,4.604990611057e-09,Amp DC,.00000001,5.5,F,F,F,F,F,F,Front,F,Main,29.4983005523682,Volt DC,100,T,2W,F,F,05/23/2022,18:46:59,.971595880
61,4.556972132974e-09,Amp DC,.00000001,5.5,F,F,F,F,F,F,Front,F,Main,29.9983196258545,Volt DC,100,T,2W,F,F,05/23/2022,18:47:00,.366460380
62,4.4619685724e-09,Amp DC,.00000001,5.5,F,F,F,F,F,F,Front,F,Main,30.4984188079834,Volt DC,100,T,2W,F,F,05/23/2022,18:47:00,.761343700
63,4.525218422202e-09,Amp DC,.00000001,5.5,F,F,F,F,F,F,Front,F,Main,30.9982204437256,Volt DC,100,T,2W,F,F,05/23/2022,18:47:01,.156201700
64,4.617469073764e-09,Amp DC,.00000001,5.5,F,F,F,F,F,F,Front,F,Main,31.4981765747070,Volt DC,100,T,2W,F,F,05/23/2022,18:47:01,.551065560
65,4.556460986294e-09,Amp DC,.00000001,5.5,F,F,F,F,F,F,Front,F,Main,31.9981193542480,Volt DC,100,T,2W,F,F,05/23/2022,18:47:01,.945917840
66,4.47052839192e-09,Amp DC,.00000001,5.5,F,F,F,F,F,F,Front,F,Main,32.4987258911133,Volt DC,100,T,2W,F,F,05/23/2022,18:47:02,.340804960
67,4.536561792889e-09,Amp DC,.00000001,5.5,F,F,F,F,F,F,Front,F,Main,32.9988212585449,Volt DC,100,T,2W,F,F,05/23/2022,18:47:02,.735681840
68,4.625472449504e-09,Amp DC,.00000001,5.5,F,F,F,F,F,F,Front,F,Main,33.4986686706543,Volt DC,100,T,2W,F,F,05/23/2022,18:47:03,.130549460
69,4.56490445444e-09,Amp DC,.00000001,5.5,F,F,F,F,F,F,Front,F,Main,33.9985084533691,Volt DC,100,T,2W,F,F,05/23/2022,18:47:03,.525414060
70,4.474664638821e-09,Amp DC,.00000001,5.5,F,F,F,F,F,F,Front,F,Main,34.4985351562500,Volt DC,100,T,2W,F,F,05/23/2022,18:47:03,.920268180
71,4.545951171053e-09,Amp DC,.00000001,5.5,F,F,F,F,F,F,Front,F,Main,34.9985885620117,Volt DC,100,T,2W,F,F,05/23/2022,18:47:04,.315137480
72,4.6494958994e-09,Amp DC,.00000001,5.5,F,F,F,F,F,F,Front,F,Main,35.4986038208008,Volt DC,100,T,2W,F,F,05/23/2022,18:47:04,.710017620
73,4.573945222575e-09,Amp DC,.00000001,5.5,F,F,F,F,F,F,Front,F,Main,35.9983787536621,Volt DC,100,T,2W,F,F,05/23/2022,18:47:05,.104869920
74,4.486339744147e-09,Amp DC,.00000001,5.5,F,F,F,F,F,F,Front,F,Main,36.4987258911133,Volt DC,100,T,2W,F,F,05/23/2022,18:47:05,.499727420
75,4.544752130187e-09,Amp DC,.00000001,5.5,F,F,F,F,F,F,Front,F,Main,36.9983100891113,Volt DC,100,T,2W,F,F,05/23/2022,18:47:05,.894585780
76,4.639697959163e-09,Amp DC,.00000001,5.5,F,F,F,F,F,F,Front,F,Main,37.4982910156250,Volt DC,100,T,2W,F,F,05/23/2022,18:47:06,.289447760
77,4.579108203728e-09,Amp DC,.00000001,5.5,F,F,F,F,F,F,Front,F,Main,37.9984130859375,Volt DC,100,T,2W,F,F,05/23/2022,18:47:06,.684303900
78,4.49051995588e-09,Amp DC,.00000001,5.5,F,F,F,F,F,F,Front,F,Main,38.4982147216797,Volt DC,100,T,2W,F,F,05/23/2022,18:47:07,.079183500
79,4.555798849282e-09,Amp DC,.00000001,5.5,F,F,F,F,F,F,Front,F,Main,38.9981193542480,Volt DC,100,T,2W,F,F,05/23/2022,18:47:07,.474069180
80,4.643114337455e-09,Amp DC,.00000001,5.5,F,F,F,F,F,F,Front,F,Main,39.4979743957520,Volt DC,100,T,2W,F,F,05/23/2022,18:47:07,.868931240
81,4.58717774876e-09,Amp DC,.00000001,5.5,F,F,F,F,F,F,Front,F,Main,39.9980506896973,Volt DC,100,T,2W,F,F,05/23/2022,18:47:08,.263811220
82,4.499660199997e-09,Amp DC,.00000001,5.5,F,F,F,F,F,F,Front,F,Main,40.4982223510742,Volt DC,100,T,2W,F,F,05/23/2022,18:47:08,.658664880
83,4.564964406484e-09,Amp DC,.00000001,5.5,F,F,F,F,F,F,Front,F,Main,40.9980506896973,Volt DC,100,T,2W,F,F,05/23/2022,18:47:09,.053523020
84,4.65493066315e-09,Amp DC,.00000001,5.5,F,F,F,F,F,F,Front,F,Main,41.4982376098633,Volt DC,100,T,2W,F,F,05/23/2022,18:47:09,.448397220
85,4.5927817105e-09,Amp DC,.00000001,5.5,F,F,F,F,F,F,Front,F,Main,41.9978637695313,Volt DC,100,T,2W,F,F,05/23/2022,18:47:09,.843276080
86,4.505966266777e-09,Amp DC,.00000001,5.5,F,F,F,F,F,F,Front,F,Main,42.4980506896973,Volt DC,100,T,2W,F,F,05/23/2022,18:47:10,.238147980
87,4.559090882594e-09,Amp DC,.00000001,5.5,F,F,F,F,F,F,Front,F,Main,42.9978332519531,Volt DC,100,T,2W,F,F,05/23/2022,18:47:10,.633019180
88,4.661115493576e-09,Amp DC,.00000001,5.5,F,F,F,F,F,F,Front,F,Main,43.4981956481934,Volt DC,100,T,2W,F,F,05/23/2022,18:47:11,.027889040
89,4.607162207293e-09,Amp DC,.00000001,5.5,F,F,F,F,F,F,Front,F,Main,43.9979972839355,Volt DC,100,T,2W,F,F,05/23/2022,18:47:11,.422758500
90,4.511721662936e-09,Amp DC,.00000001,5.5,F,F,F,F,F,F,Front,F,Main,44.4978904724121,Volt DC,100,T,2W,F,F,05/23/2022,18:47:11,.817608260
91,4.567335398775e-09,Amp DC,.00000001,5.5,F,F,F,F,F,F,Front,F,Main,44.9981307983398,Volt DC,100,T,2W,F,F,05/23/2022,18:47:12,.212496940
92,4.660540842139e-09,Amp DC,.00000001,5.5,F,F,F,F,F,F,Front,F,Main,45.4977149963379,Volt DC,100,T,2W,F,F,05/23/2022,18:47:12,.607342840
93,4.624129079644e-09,Amp DC,.00000001,5.5,F,F,F,F,F,F,Front,F,Main,45.9981536865234,Volt DC,100,T,2W,F,F,05/23/2022,18:47:13,.002209400
94,4.521284679981e-09,Amp DC,.00000001,5.5,F,F,F,F,F,F,Front,F,Main,46.4984474182129,Volt DC,100,T,2W,F,F,05/23/2022,18:47:13,.397087780
95,4.567311417958e-09,Amp DC,.00000001,5.5,F,F,F,F,F,F,Front,F,Main,46.9981803894043,Volt DC,100,T,2W,F,F,05/23/2022,18:47:13,.791966580
96,4.673319509152e-09,Amp DC,.00000001,5.5,F,F,F,F,F,F,Front,F,Main,47.4982566833496,Volt DC,100,T,2W,F,F,05/23/2022,18:47:14,.186846280
97,4.619029159159e-09,Amp DC,.00000001,5.5,F,F,F,F,F,F,Front,F,Main,47.9979095458984,Volt DC,100,T,2W,F,F,05/23/2022,18:47:14,.581703800
98,4.526581776076e-09,Amp DC,.00000001,5.5,F,F,F,F,F,F,Front,F,Main,48.4984016418457,Volt DC,100,T,2W,F,F,05/23/2022,18:47:14,.976572340
99,4.579977730401e-09,Amp DC,.00000001,5.5,F,F,F,F,F,F,Front,F,Main,48.9981651306152,Volt DC,100,T,2W,F,F,05/23/2022,18:47:15,.371414560
100,4.676155462846e-09,Amp DC,.00000001,5.5,F,F,F,F,F,F,Front,F,Main,49.4980964660645,Volt DC,100,T,2W,F,F,05/23/2022,18:47:15,.766292820
101,4.626556915355e-09,Amp DC,.00000001,5.5,F,F,F,F,F,F,Front,F,Main,49.9980659484863,Volt DC,100,T,2W,F,F,05/23/2022,18:47:16,.161182380
102,4.531150565867e-09,Amp DC,.00000001,5.5,F,F,F,F,F,F,Front,F,Main,50.4981346130371,Volt DC,100,T,2W,F,F,05/23/2022,18:47:16,.556024920
103,4.584130408603e-09,Amp DC,.00000001,5.5,F,F,F,F,F,F,Front,F,Main,50.9978485107422,Volt DC,100,T,2W,F,F,05/23/2022,18:47:16,.950896760
104,4.681090182146e-09,Amp DC,.00000001,5.5,F,F,F,F,F,F,Front,F,Main,51.4977493286133,Volt DC,100,T,2W,F,F,05/23/2022,18:47:17,.345760860
105,4.63351756963e-09,Amp DC,.00000001,5.5,F,F,F,F,F,F,Front,F,Main,51.9978866577148,Volt DC,100,T,2W,F,F,05/23/2022,18:47:17,.740615760
106,4.532040076555e-09,Amp DC,.00000001,5.5,F,F,F,F,F,F,Front,F,Main,52.4978103637695,Volt DC,100,T,2W,F,F,05/23/2022,18:47:18,.135466860
107,4.593430524835e-09,Amp DC,.00000001,5.5,F,F,F,F,F,F,Front,F,Main,52.9974632263184,Volt DC,100,T,2W,F,F,05/23/2022,18:47:18,.530342420
108,4.689406640779e-09,Amp DC,.00000001,5.5,F,F,F,F,F,F,Front,F,Main,53.4976119995117,Volt DC,100,T,2W,F,F,05/23/2022,18:47:18,.925235960
109,4.634221451028e-09,Amp DC,.00000001,5.5,F,F,F,F,F,F,Front,F,Main,53.9974784851074,Volt DC,100,T,2W,F,F,05/23/2022,18:47:19,.320092200
110,4.541185649742e-09,Amp DC,.00000001,5.5,F,F,F,F,F,F,Front,F,Main,54.4976310729980,Volt DC,100,T,2W,F,F,05/23/2022,18:47:19,.714967180
111,4.604470138503e-09,Amp DC,.00000001,5.5,F,F,F,F,F,F,Front,F,Main,54.9974250793457,Volt DC,100,T,2W,F,F,05/23/2022,18:47:20,.109839400
112,4.694846733599e-09,Amp DC,.00000001,5.5,F,F,F,F,F,F,Front,F,Main,55.4973716735840,Volt DC,100,T,2W,F,F,05/23/2022,18:47:20,.504688980
113,4.639157502595e-09,Amp DC,.00000001,5.5,F,F,F,F,F,F,Front,F,Main,55.9974479675293,Volt DC,100,T,2W,F,F,05/23/2022,18:47:20,.899540160
114,4.54592496979e-09,Amp DC,.00000001,5.5,F,F,F,F,F,F,Front,F,Main,56.4975242614746,Volt DC,100,T,2W,F,F,05/23/2022,18:47:21,.294410720
115,4.616440119065e-09,Amp DC,.00000001,5.5,F,F,F,F,F,F,Front,F,Main,56.9973907470703,Volt DC,100,T,2W,F,F,05/23/2022,18:47:21,.689292360
116,4.700898781351e-09,Amp DC,.00000001,5.5,F,F,F,F,F,F,Front,F,Main,57.4976730346680,Volt DC,100,T,2W,F,F,05/23/2022,18:47:22,.084172820
117,4.628871508316e-09,Amp DC,.00000001,5.5,F,F,F,F,F,F,Front,F,Main,57.9970245361328,Volt DC,100,T,2W,F,F,05/23/2022,18:47:22,.479049240
118,4.553460719592e-09,Amp DC,.00000001,5.5,F,F,F,F,F,F,Front,F,Main,58.4973640441895,Volt DC,100,T,2W,F,F,05/23/2022,18:47:22,.873897000
119,4.627348726416e-09,Amp DC,.00000001,5.5,F,F,F,F,F,F,Front,F,Main,58.9971160888672,Volt DC,100,T,2W,F,F,05/23/2022,18:47:23,.268767980
120,4.71400030122e-09,Amp DC,.00000001,5.5,F,F,F,F,F,F,Front,F,Main,59.4975852966309,Volt DC,100,T,2W,F,F,05/23/2022,18:47:23,.663632340
121,4.633929240327e-09,Amp DC,.00000001,5.5,F,F,F,F,F,F,Front,F,Main,59.9975051879883,Volt DC,100,T,2W,F,F,05/23/2022,18:47:24,.058507160
122,4.56393234316e-09,Amp DC,.00000001,5.5,F,F,F,F,F,F,Front,F,Main,60.4977684020996,Volt DC,100,T,2W,F,F,05/23/2022,18:47:24,.453363880
123,4.640388517885e-09,Amp DC,.00000001,5.5,F,F,F,F,F,F,Front,F,Main,60.9975585937500,Volt DC,100,T,2W,F,F,05/23/2022,18:47:24,.848235240
124,4.709270307046e-09,Amp DC,.00000001,5.5,F,F,F,F,F,F,Front,F,Main,61.4972763061523,Volt DC,100,T,2W,F,F,05/23/2022,18:47:25,.243117940
125,4.657298546817e-09,Amp DC,.00000001,5.5,F,F,F,F,F,F,Front,F,Main,62.0007781982422,Volt DC,100,T,2W,F,F,05/23/2022,18:47:25,.637980920
126,4.562398459029e-09,Amp DC,.00000001,5.5,F,F,F,F,F,F,Front,F,Main,62.5007019042969,Volt DC,100,T,2W,F,F,05/23/2022,18:47:26,.032837880
127,4.665246855495e-09,Amp DC,.00000001,5.5,F,F,F,F,F,F,Front,F,Main,63.0010223388672,Volt DC,100,T,2W,F,F,05/23/2022,18:47:26,.427711260
128,4.720611901377e-09,Amp DC,.00000001,5.5,F,F,F,F,F,F,Front,F,Main,63.5008163452148,Volt DC,100,T,2W,F,F,05/23/2022,18:47:26,.822596560
129,4.618714743998e-09,Amp DC,.00000001,5.5,F,F,F,F,F,F,Front,F,Main,64.0006408691406,Volt DC,100,T,2W,F,F,05/23/2022,18:47:27,.217465360
130,4.572247913615e-09,Amp DC,.00000001,5.5,F,F,F,F,F,F,Front,F,Main,64.5008010864258,Volt DC,100,T,2W,F,F,05/23/2022,18:47:27,.612347900
131,4.673789355536e-09,Amp DC,.00000001,5.5,F,F,F,F,F,F,Front,F,Main,65.0007629394531,Volt DC,100,T,2W,F,F,05/23/2022,18:47:28,.007195160
132,4.723951008145e-09,Amp DC,.00000001,5.5,F,F,F,F,F,F,Front,F,Main,65.5006790161133,Volt DC,100,T,2W,F,F,05/23/2022,18:47:28,.402059240
133,4.617530358075e-09,Amp DC,.00000001,5.5,F,F,F,F,F,F,Front,F,Main,66.0004959106445,Volt DC,100,T,2W,F,F,05/23/2022,18:47:28,.796930280
134,4.576085288477e-09,Amp DC,.00000001,5.5,F,F,F,F,F,F,Front,F,Main,66.5001602172852,Volt DC,100,T,2W,F,F,05/23/2022,18:47:29,.191816020
135,4.693852861948e-09,Amp DC,.00000001,5.5,F,F,F,F,F,F,Front,F,Main,67.0004577636719,Volt DC,100,T,2W,F,F,05/23/2022,18:47:29,.586669240
136,4.7215822363e-09,Amp DC,.00000001,5.5,F,F,F,F,F,F,Front,F,Main,67.4999618530273,Volt DC,100,T,2W,F,F,05/23/2022,18:47:29,.981539880
137,4.617117799199e-09,Amp DC,.00000001,5.5,F,F,F,F,F,F,Front,F,Main,68.0002288818359,Volt DC,100,T,2W,F,F,05/23/2022,18:47:30,.376408500
138,4.592833224848e-09,Amp DC,.00000001,5.5,F,F,F,F,F,F,Front,F,Main,68.5001144409180,Volt DC,100,T,2W,F,F,05/23/2022,18:47:30,.771264200
139,4.697928712716e-09,Amp DC,.00000001,5.5,F,F,F,F,F,F,Front,F,Main,69.0002441406250,Volt DC,100,T,2W,F,F,05/23/2022,18:47:31,.166143160
140,4.722469082452e-09,Amp DC,.00000001,5.5,F,F,F,F,F,F,Front,F,Main,69.4999923706055,Volt DC,100,T,2W,F,F,05/23/2022,18:47:31,.561004200
141,4.611927284515e-09,Amp DC,.00000001,5.5,F,F,F,F,F,F,Front,F,Main,70.0001525878906,Volt DC,100,T,2W,F,F,05/23/2022,18:47:31,.955869680
142,4.592514368795e-09,Amp DC,.00000001,5.5,F,F,F,F,F,F,Front,F,Main,70.4998626708984,Volt DC,100,T,2W,F,F,05/23/2022,18:47:32,.350742920
143,4.705158485052e-09,Amp DC,.00000001,5.5,F,F,F,F,F,F,Front,F,Main,71.0001678466797,Volt DC,100,T,2W,F,F,05/23/2022,18:47:32,.745604980
144,4.733469616269e-09,Amp DC,.00000001,5.5,F,F,F,F,F,F,Front,F,Main,71.4998779296875,Volt DC,100,T,2W,F,F,05/23/2022,18:47:33,.140471420
145,4.618720961247e-09,Amp DC,.00000001,5.5,F,F,F,F,F,F,Front,F,Main,71.9999847412109,Volt DC,100,T,2W,F,F,05/23/2022,18:47:33,.535331620
146,4.617954463271e-09,Amp DC,.00000001,5.5,F,F,F,F,F,F,Front,F,Main,72.4997863769531,Volt DC,100,T,2W,F,F,05/23/2022,18:47:33,.930208480
147,4.725899671598e-09,Amp DC,.00000001,5.5,F,F,F,F,F,F,Front,F,Main,73.0003662109375,Volt DC,100,T,2W,F,F,05/23/2022,18:47:34,.325074820
148,4.719565627198e-09,Amp DC,.00000001,5.5,F,F,F,F,F,F,Front,F,Main,73.5003356933594,Volt DC,100,T,2W,F,F,05/23/2022,18:47:34,.719933860
149,4.61172167121e-09,Amp DC,.00000001,5.5,F,F,F,F,F,F,Front,F,Main,74.0004119873047,Volt DC,100,T,2W,F,F,05/23/2022,18:47:35,.114827040
150,4.620253957199e-09,Amp DC,.00000001,5.5,F,F,F,F,F,F,Front,F,Main,74.5002975463867,Volt DC,100,T,2W,F,F,05/23/2022,18:47:35,.509687780
151,4.734041603172e-09,Amp DC,.00000001,5.5,F,F,F,F,F,F,Front,F,Main,75.0001678466797,Volt DC,100,T,2W,F,F,05/23/2022,18:47:35,.904558460
152,4.744426629344e-09,Amp DC,.00000001,5.5,F,F,F,F,F,F,Front,F,Main,75.5002746582031,Volt DC,100,T,2W,F,F,05/23/2022,18:47:36,.299430320
153,4.616792281809e-09,Amp DC,.00000001,5.5,F,F,F,F,F,F,Front,F,Main,76.0000991821289,Volt DC,100,T,2W,F,F,05/23/2022,18:47:36,.694301400
154,4.643675222127e-09,Amp DC,.00000001,5.5,F,F,F,F,F,F,Front,F,Main,76.5000228881836,Volt DC,100,T,2W,F,F,05/23/2022,18:47:37,.089183920
155,4.763960781418e-09,Amp DC,.00000001,5.5,F,F,F,F,F,F,Front,F,Main,77.0007781982422,Volt DC,100,T,2W,F,F,05/23/2022,18:47:37,.484070240
156,4.724090896246e-09,Amp DC,.00000001,5.5,F,F,F,F,F,F,Front,F,Main,77.4999618530273,Volt DC,100,T,2W,F,F,05/23/2022,18:47:37,.878936340
157,4.633403882792e-09,Amp DC,.00000001,5.5,F,F,F,F,F,F,Front,F,Main,77.9999923706055,Volt DC,100,T,2W,F,F,05/23/2022,18:47:38,.273774820
158,4.673855524828e-09,Amp DC,.00000001,5.5,F,F,F,F,F,F,Front,F,Main,78.4995422363281,Volt DC,100,T,2W,F,F,05/23/2022,18:47:38,.668639280
159,4.784863172347e-09,Amp DC,.00000001,5.5,F,F,F,F,F,F,Front,F,Main,78.9999465942383,Volt DC,100,T,2W,F,F,05/23/2022,18:47:39,.063523060
160,4.735781100607e-09,Amp DC,.00000001,5.5,F,F,F,F,F,F,Front,F,Main,79.4999008178711,Volt DC,100,T,2W,F,F,05/23/2022,18:47:39,.458375200
161,4.639933770534e-09,Amp DC,.00000001,5.5,F,F,F,F,F,F,Front,F,Main,79.9998474121094,Volt DC,100,T,2W,F,F,05/23/2022,18:47:39,.853250940
162,4.694595823196e-09,Amp DC,.00000001,5.5,F,F,F,F,F,F,Front,F,Main,80.5000762939453,Volt DC,100,T,2W,F,F,05/23/2022,18:47:40,.248098300
163,4.783913709616e-09,Amp DC,.00000001,5.5,F,F,F,F,F,F,Front,F,Main,80.9999618530273,Volt DC,100,T,2W,F,F,05/23/2022,18:47:40,.642944220
164,4.7164006034e-09,Amp DC,.00000001,5.5,F,F,F,F,F,F,Front,F,Main,81.4996795654297,Volt DC,100,T,2W,F,F,05/23/2022,18:47:41,.037797160
165,4.631047989534e-09,Amp DC,.00000001,5.5,F,F,F,F,F,F,Front,F,Main,81.9996566772461,Volt DC,100,T,2W,F,F,05/23/2022,18:47:41,.432680740
166,4.710244194683e-09,Amp DC,.00000001,5.5,F,F,F,F,F,F,Front,F,Main,82.4998855590820,Volt DC,100,T,2W,F,F,05/23/2022,18:47:41,.827563000
167,4.788355933982e-09,Amp DC,.00000001,5.5,F,F,F,F,F,F,Front,F,Main,82.9999084472656,Volt DC,100,T,2W,F,F,05/23/2022,18:47:42,.222421960
168,4.710668299879e-09,Amp DC,.00000001,5.5,F,F,F,F,F,F,Front,F,Main,83.4993820190430,Volt DC,100,T,2W,F,F,05/23/2022,18:47:42,.617295340
169,4.653248009134e-09,Amp DC,.00000001,5.5,F,F,F,F,F,F,Front,F,Main,83.9996795654297,Volt DC,100,T,2W,F,F,05/23/2022,18:47:43,.012154940
170,4.731510738765e-09,Amp DC,.00000001,5.5,F,F,F,F,F,F,Front,F,Main,84.4994659423828,Volt DC,100,T,2W,F,F,05/23/2022,18:47:43,.407017920
171,4.805503550642e-09,Amp DC,.00000001,5.5,F,F,F,F,F,F,Front,F,Main,84.9997253417969,Volt DC,100,T,2W,F,F,05/23/2022,18:47:43,.801883500
172,4.708617939997e-09,Amp DC,.00000001,5.5,F,F,F,F,F,F,Front,F,Main,85.4995193481445,Volt DC,100,T,2W,F,F,05/23/2022,18:47:44,.196765400
173,4.649830742665e-09,Amp DC,.00000001,5.5,F,F,F,F,F,F,Front,F,Main,85.9993820190430,Volt DC,100,T,2W,F,F,05/23/2022,18:47:44,.591636700
174,4.750378312934e-09,Amp DC,.00000001,5.5,F,F,F,F,F,F,Front,F,Main,86.4997787475586,Volt DC,100,T,2W,F,F,05/23/2022,18:47:44,.986500320
175,4.801260722331e-09,Amp DC,.00000001,5.5,F,F,F,F,F,F,Front,F,Main,86.9996337890625,Volt DC,100,T,2W,F,F,05/23/2022,18:47:45,.381368840
176,4.701085742909e-09,Amp DC,.00000001,5.5,F,F,F,F,F,F,Front,F,Main,87.4996032714844,Volt DC,100,T,2W,F,F,05/23/2022,18:47:45,.776239080
177,4.663294639329e-09,Amp DC,.00000001,5.5,F,F,F,F,F,F,Front,F,Main,87.9999618530273,Volt DC,100,T,2W,F,F,05/23/2022,18:47:46,.171097740
178,4.76460026988e-09,Amp DC,.00000001,5.5,F,F,F,F,F,F,Front,F,Main,88.4995498657227,Volt DC,100,T,2W,F,F,05/23/2022,18:47:46,.565951940
179,4.807556575059e-09,Amp DC,.00000001,5.5,F,F,F,F,F,F,Front,F,Main,88.9997940063477,Volt DC,100,T,2W,F,F,05/23/2022,18:47:46,.960810380
180,4.690193566859e-09,Amp DC,.00000001,5.5,F,F,F,F,F,F,Front,F,Main,89.4998168945313,Volt DC,100,T,2W,F,F,05/23/2022,18:47:47,.355670620
181,4.666400599262e-09,Amp DC,.00000001,5.5,F,F,F,F,F,F,Front,F,Main,89.9993743896484,Volt DC,100,T,2W,F,F,05/23/2022,18:47:47,.750526100
182,4.782537921244e-09,Amp DC,.00000001,5.5,F,F,F,F,F,F,Front,F,Main,90.4992599487305,Volt DC,100,T,2W,F,F,05/23/2022,18:47:48,.145375520
183,4.802506836654e-09,Amp DC,.00000001,5.5,F,F,F,F,F,F,Front,F,Main,90.9997253417969,Volt DC,100,T,2W,F,F,05/23/2022,18:47:48,.540254540
184,4.67851402064e-09,Amp DC,.00000001,5.5,F,F,F,F,F,F,Front,F,Main,91.4993362426758,Volt DC,100,T,2W,F,F,05/23/2022,18:47:48,.935118840
185,4.692040089793e-09,Amp DC,.00000001,5.5,F,F,F,F,F,F,Front,F,Main,91.9992294311523,Volt DC,100,T,2W,F,F,05/23/2022,18:47:49,.330007840
186,4.803302644518e-09,Amp DC,.00000001,5.5,F,F,F,F,F,F,Front,F,Main,92.4991607666016,Volt DC,100,T,2W,F,F,05/23/2022,18:47:49,.724861480
187,4.794776575778e-09,Amp DC,.00000001,5.5,F,F,F,F,F,F,Front,F,Main,92.9997177124023,Volt DC,100,T,2W,F,F,05/23/2022,18:47:50,.119733340
188,4.66452476644e-09,Amp DC,.00000001,5.5,F,F,F,F,F,F,Front,F,Main,93.4993438720703,Volt DC,100,T,2W,F,F,05/23/2022,18:47:50,.514616500
189,4.716713242203e-09,Amp DC,.00000001,5.5,F,F,F,F,F,F,Front,F,Main,93.9994277954102,Volt DC,100,T,2W,F,F,05/23/2022,18:47:50,.909462940
190,4.816734566759e-09,Amp DC,.00000001,5.5,F,F,F,F,F,F,Front,F,Main,94.4990463256836,Volt DC,100,T,2W,F,F,05/23/2022,18:47:51,.304329580
191,4.78359662992e-09,Amp DC,.00000001,5.5,F,F,F,F,F,F,Front,F,Main,94.9994277954102,Volt DC,100,T,2W,F,F,05/23/2022,18:47:51,.699179740
192,4.671502740194e-09,Amp DC,.00000001,5.5,F,F,F,F,F,F,Front,F,Main,95.4988021850586,Volt DC,100,T,2W,F,F,05/23/2022,18:47:52,.094047080
193,4.742995329821e-09,Amp DC,.00000001,5.5,F,F,F,F,F,F,Front,F,Main,95.9991531372070,Volt DC,100,T,2W,F,F,05/23/2022,18:47:52,.488913580
194,4.835867262187e-09,Amp DC,.00000001,5.5,F,F,F,F,F,F,Front,F,Main,96.4995117187500,Volt DC,100,T,2W,F,F,05/23/2022,18:47:52,.883758440
195,4.753824445203e-09,Amp DC,.00000001,5.5,F,F,F,F,F,F,Front,F,Main,96.9991531372070,Volt DC,100,T,2W,F,F,05/23/2022,18:47:53,.278633860
196,4.682020104951e-09,Amp DC,.00000001,5.5,F,F,F,F,F,F,Front,F,Main,97.4991378784180,Volt DC,100,T,2W,F,F,05/23/2022,18:47:53,.673495100
197,4.769618033862e-09,Amp DC,.00000001,5.5,F,F,F,F,F,F,Front,F,Main,97.9988784790039,Volt DC,100,T,2W,F,F,05/23/2022,18:47:54,.068356520
198,4.836966827071e-09,Amp DC,.00000001,5.5,F,F,F,F,F,F,Front,F,Main,98.4988098144531,Volt DC,100,T,2W,F,F,05/23/2022,18:47:54,.463221820
199,4.740713155371e-09,Amp DC,.00000001,5.5,F,F,F,F,F,F,Front,F,Main,98.9990005493164,Volt DC,100,T,2W,F,F,05/23/2022,18:47:54,.858073080
200,4.691792288014e-09,Amp DC,.00000001,5.5,F,F,F,F,F,F,Front,F,Main,99.4985427856445,Volt DC,100,T,2W,F,F,05/23/2022,18:47:55,.252932980
201,4.810503106967e-09,Amp DC,.00000001,5.5,F,F,F,F,F,F,Front,F,Main,99.9995803833008,Volt DC,100,T,2W,F,F,05/23/2022,18:47:55,.647788600
202,4.828905275645e-09,Amp DC,.00000001,5.5,F,F,F,F,F,F,Front,F,Main,100.4990615844727,Volt DC,100,T,2W,F,F,05/23/2022,18:47:56,.042668680
203,4.729314273533e-09,Amp DC,.00000001,5.5,F,F,F,F,F,F,Front,F,Main,100.9994049072266,Volt DC,100,T,2W,F,F,05/23/2022,18:47:56,.437523580
204,4.71647920719e-09,Amp DC,.00000001,5.5,F,F,F,F,F,F,Front,F,Main,101.4990310668945,Volt DC,100,T,2W,F,F,05/23/2022,18:47:56,.832387560
205,4.831182565113e-09,Amp DC,.00000001,5.5,F,F,F,F,F,F,Front,F,Main,101.9993438720703,Volt DC,100,T,2W,F,F,05/23/2022,18:47:57,.227262100
206,4.815396081881e-09,Amp DC,.00000001,5.5,F,F,F,F,F,F,Front,F,Main,102.4987640380859,Volt DC,100,T,2W,F,F,05/23/2022,18:47:57,.622125900
207,4.70560346244e-09,Amp DC,.00000001,5.5,F,F,F,F,F,F,Front,F,Main,102.9990539550781,Volt DC,100,T,2W,F,F,05/23/2022,18:47:58,.017016000
208,4.742413572956e-09,Amp DC,.00000001,5.5,F,F,F,F,F,F,Front,F,Main,103.4988937377930,Volt DC,100,T,2W,F,F,05/23/2022,18:47:58,.411869980
209,4.844848078278e-09,Amp DC,.00000001,5.5,F,F,F,F,F,F,Front,F,Main,103.9985961914063,Volt DC,100,T,2W,F,F,05/23/2022,18:47:58,.806727760
210,4.803466069347e-09,Amp DC,.00000001,5.5,F,F,F,F,F,F,Front,F,Main,104.4986953735352,Volt DC,100,T,2W,F,F,05/23/2022,18:47:59,.201588240
211,4.707498835188e-09,Amp DC,.00000001,5.5,F,F,F,F,F,F,Front,F,Main,104.9992065429688,Volt DC,100,T,2W,F,F,05/23/2022,18:47:59,.596448420
212,4.76979922226e-09,Amp DC,.00000001,5.5,F,F,F,F,F,F,Front,F,Main,105.4986953735352,Volt DC,100,T,2W,F,F,05/23/2022,18:47:59,.991324260
213,4.862695579533e-09,Amp DC,.00000001,5.5,F,F,F,F,F,F,Front,F,Main,105.9988555908203,Volt DC,100,T,2W,F,F,05/23/2022,18:48:00,.386174060
214,4.805674969077e-09,Amp DC,.00000001,5.5,F,F,F,F,F,F,Front,F,Main,106.4984970092773,Volt DC,100,T,2W,F,F,05/23/2022,18:48:00,.781047220
215,4.722945146085e-09,Amp DC,.00000001,5.5,F,F,F,F,F,F,Front,F,Main,106.9987258911133,Volt DC,100,T,2W,F,F,05/23/2022,18:48:01,.175899340
216,4.811437026575e-09,Amp DC,.00000001,5.5,F,F,F,F,F,F,Front,F,Main,107.4986801147461,Volt DC,100,T,2W,F,F,05/23/2022,18:48:01,.570769920
217,4.855180257834e-09,Amp DC,.00000001,5.5,F,F,F,F,F,F,Front,F,Main,107.9984741210938,Volt DC,100,T,2W,F,F,05/23/2022,18:48:01,.965612240
218,4.744236115073e-09,Amp DC,.00000001,5.5,F,F,F,F,F,F,Front,F,Main,108.4985046386719,Volt DC,100,T,2W,F,F,05/23/2022,18:48:02,.360478740
219,4.718726742681e-09,Amp DC,.00000001,5.5,F,F,F,F,F,F,Front,F,Main,108.9987945556641,Volt DC,100,T,2W,F,F,05/23/2022,18:48:02,.755355060
220,4.807947817653e-09,Amp DC,.00000001,5.5,F,F,F,F,F,F,Front,F,Main,109.4982604980469,Volt DC,100,T,2W,F,F,05/23/2022,18:48:03,.150216120
221,4.861114621946e-09,Amp DC,.00000001,5.5,F,F,F,F,F,F,Front,F,Main,109.9985961914063,Volt DC,100,T,2W,F,F,05/23/2022,18:48:03,.545080200
222,4.742657377932e-09,Amp DC,.00000001,5.5,F,F,F,F,F,F,Front,F,Main,110.4982070922852,Volt DC,100,T,2W,F,F,05/23/2022,18:48:03,.939934100
223,4.749196147458e-09,Amp DC,.00000001,5.5,F,F,F,F,F,F,Front,F,Main,110.9985580444336,Volt DC,100,T,2W,F,F,05/23/2022,18:48:04,.334794220
224,4.846348211629e-09,Amp DC,.00000001,5.5,F,F,F,F,F,F,Front,F,Main,111.4980316162109,Volt DC,100,T,2W,F,F,05/23/2022,18:48:04,.729643020
225,4.832688915712e-09,Amp DC,.00000001,5.5,F,F,F,F,F,F,Front,F,Main,111.9980773925781,Volt DC,100,T,2W,F,F,05/23/2022,18:48:05,.124508500
226,4.716129708981e-09,Amp DC,.00000001,5.5,F,F,F,F,F,F,Front,F,Main,112.4980621337891,Volt DC,100,T,2W,F,F,05/23/2022,18:48:05,.519389040
227,4.764963090764e-09,Amp DC,.00000001,5.5,F,F,F,F,F,F,Front,F,Main,112.9987411499023,Volt DC,100,T,2W,F,F,05/23/2022,18:48:05,.914243700
228,4.866956615501e-09,Amp DC,.00000001,5.5,F,F,F,F,F,F,Front,F,Main,113.4989242553711,Volt DC,100,T,2W,F,F,05/23/2022,18:48:06,.309105760
229,4.810973841529e-09,Amp DC,.00000001,5.5,F,F,F,F,F,F,Front,F,Main,113.9982604980469,Volt DC,100,T,2W,F,F,05/23/2022,18:48:06,.703969460
230,4.722476187879e-09,Amp DC,.00000001,5.5,F,F,F,F,F,F,Front,F,Main,114.4986190795898,Volt DC,100,T,2W,F,F,05/23/2022,18:48:07,.098832360
231,4.785227325499e-09,Amp DC,.00000001,5.5,F,F,F,F,F,F,Front,F,Main,114.9984512329102,Volt DC,100,T,2W,F,F,05/23/2022,18:48:07,.493693920
232,4.872660053223e-09,Amp DC,.00000001,5.5,F,F,F,F,F,F,Front,F,Main,115.4981307983398,Volt DC,100,T,2W,F,F,05/23/2022,18:48:07,.888549960
233,4.807441111865e-09,Amp DC,.00000001,5.5,F,F,F,F,F,F,Front,F,Main,115.9988632202148,Volt DC,100,T,2W,F,F,05/23/2022,18:48:08,.283413460
234,4.711514289824e-09,Amp DC,.00000001,5.5,F,F,F,F,F,F,Front,F,Main,116.4982070922852,Volt DC,100,T,2W,F,F,05/23/2022,18:48:08,.678278040
235,4.8248161022e-09,Amp DC,.00000001,5.5,F,F,F,F,F,F,Front,F,Main,116.9987945556641,Volt DC,100,T,2W,F,F,05/23/2022,18:48:09,.073143560
236,4.872665826383e-09,Amp DC,.00000001,5.5,F,F,F,F,F,F,Front,F,Main,117.4978866577148,Volt DC,100,T,2W,F,F,05/23/2022,18:48:09,.468019600
237,4.774468376212e-09,Amp DC,.00000001,5.5,F,F,F,F,F,F,Front,F,Main,117.9984130859375,Volt DC,100,T,2W,F,F,05/23/2022,18:48:09,.862889500
238,4.735632330721e-09,Amp DC,.00000001,5.5,F,F,F,F,F,F,Front,F,Main,118.4981613159180,Volt DC,100,T,2W,F,F,05/23/2022,18:48:10,.257753160
239,4.845852163982e-09,Amp DC,.00000001,5.5,F,F,F,F,F,F,Front,F,Main,118.9981689453125,Volt DC,100,T,2W,F,F,05/23/2022,18:48:10,.652602220
240,4.878786707962e-09,Amp DC,.00000001,5.5,F,F,F,F,F,F,Front,F,Main,119.4982223510742,Volt DC,100,T,2W,F,F,05/23/2022,18:48:11,.047470140
241,4.776702589027e-09,Amp DC,.00000001,5.5,F,F,F,F,F,F,Front,F,Main,119.9982833862305,Volt DC,100,T,2W,F,F,05/23/2022,18:48:11,.442339660
242,4.748033521906e-09,Amp DC,.00000001,5.5,F,F,F,F,F,F,Front,F,Main,120.4980239868164,Volt DC,100,T,2W,F,F,05/23/2022,18:48:11,.837194620
243,4.856816726573e-09,Amp DC,.00000001,5.5,F,F,F,F,F,F,Front,F,Main,120.9980697631836,Volt DC,100,T,2W,F,F,05/23/2022,18:48:12,.232052580
244,4.867517944263e-09,Amp DC,.00000001,5.5,F,F,F,F,F,F,Front,F,Main,121.4983062744141,Volt DC,100,T,2W,F,F,05/23/2022,18:48:12,.626919500
245,4.750763338279e-09,Amp DC,.00000001,5.5,F,F,F,F,F,F,Front,F,Main,121.9980163574219,Volt DC,100,T,2W,F,F,05/23/2022,18:48:13,.021783180
246,4.758182736708e-09,Amp DC,.00000001,5.5,F,F,F,F,F,F,Front,F,Main,122.4974441528320,Volt DC,100,T,2W,F,F,05/23/2022,18:48:13,.416633380
247,4.880741144575e-09,Amp DC,.00000001,5.5,F,F,F,F,F,F,Front,F,Main,122.9978713989258,Volt DC,100,T,2W,F,F,05/23/2022,18:48:13,.811509900
248,4.855309043705e-09,Amp DC,.00000001,5.5,F,F,F,F,F,F,Front,F,Main,123.4976272583008,Volt DC,100,T,2W,F,F,05/23/2022,18:48:14,.206348800
249,4.750140725207e-09,Amp DC,.00000001,5.5,F,F,F,F,F,F,Front,F,Main,123.9977416992188,Volt DC,100,T,2W,F,F,05/23/2022,18:48:14,.601219020
250,4.78643524815e-09,Amp DC,.00000001,5.5,F,F,F,F,F,F,Front,F,Main,124.4976272583008,Volt DC,100,T,2W,F,F,05/23/2022,18:48:14,.996094920
251,4.896498762008e-09,Amp DC,.00000001,5.5,F,F,F,F,F,F,Front,F,Main,124.9980316162109,Volt DC,100,T,2W,F,F,05/23/2022,18:48:15,.390944080
252,4.850851276217e-09,Amp DC,.00000001,5.5,F,F,F,F,F,F,Front,F,Main,125.4973602294922,Volt DC,100,T,2W,F,F,05/23/2022,18:48:15,.785802280
253,4.730669633801e-09,Amp DC,.00000001,5.5,F,F,F,F,F,F,Front,F,Main,125.9972915649414,Volt DC,100,T,2W,F,F,05/23/2022,18:48:16,.180673620
254,4.790435603752e-09,Amp DC,.00000001,5.5,F,F,F,F,F,F,Front,F,Main,126.4972152709961,Volt DC,100,T,2W,F,F,05/23/2022,18:48:16,.575547740
255,4.892420246705e-09,Amp DC,.00000001,5.5,F,F,F,F,F,F,Front,F,Main,126.9980697631836,Volt DC,100,T,2W,F,F,05/23/2022,18:48:16,.970398880
256,4.814307175138e-09,Amp DC,.00000001,5.5,F,F,F,F,F,F,Front,F,Main,127.4974365234375,Volt DC,100,T,2W,F,F,05/23/2022,18:48:17,.365270560
257,4.736623093748e-09,Amp DC,.00000001,5.5,F,F,F,F,F,F,Front,F,Main,127.9978561401367,Volt DC,100,T,2W,F,F,05/23/2022,18:48:17,.760146120
258,4.81403095165e-09,Amp DC,.00000001,5.5,F,F,F,F,F,F,Front,F,Main,128.4978790283203,Volt DC,100,T,2W,F,F,05/23/2022,18:48:18,.155032840
259,4.910532869218e-09,Amp DC,.00000001,5.5,F,F,F,F,F,F,Front,F,Main,128.9978942871094,Volt DC,100,T,2W,F,F,05/23/2022,18:48:18,.549909820
260,4.819208587747e-09,Amp DC,.00000001,5.5,F,F,F,F,F,F,Front,F,Main,129.4976043701172,Volt DC,100,T,2W,F,F,05/23/2022,18:48:18,.944771280
261,4.70919525597e-09,Amp DC,.00000001,5.5,F,F,F,F,F,F,Front,F,Main,129.9976959228516,Volt DC,100,T,2W,F,F,05/23/2022,18:48:19,.339632020
262,4.842473533273e-09,Amp DC,.00000001,5.5,F,F,F,F,F,F,Front,F,Main,130.4977264404297,Volt DC,100,T,2W,F,F,05/23/2022,18:48:19,.734492400
263,4.893657479244e-09,Amp DC,.00000001,5.5,F,F,F,F,F,F,Front,F,Main,130.9975738525391,Volt DC,100,T,2W,F,F,05/23/2022,18:48:20,.129346060
264,4.786851803829e-09,Amp DC,.00000001,5.5,F,F,F,F,F,F,Front,F,Main,131.4972076416016,Volt DC,100,T,2W,F,F,05/23/2022,18:48:20,.524200660
265,4.754026061704e-09,Amp DC,.00000001,5.5,F,F,F,F,F,F,Front,F,Main,131.9976654052734,Volt DC,100,T,2W,F,F,05/23/2022,18:48:20,.919067880
266,4.859331159679e-09,Amp DC,.00000001,5.5,F,F,F,F,F,F,Front,F,Main,132.4974670410156,Volt DC,100,T,2W,F,F,05/23/2022,18:48:21,.313935700
267,4.881537840618e-09,Amp DC,.00000001,5.5,F,F,F,F,F,F,Front,F,Main,132.9980163574219,Volt DC,100,T,2W,F,F,05/23/2022,18:48:21,.708794520
268,4.760329463949e-09,Amp DC,.00000001,5.5,F,F,F,F,F,F,Front,F,Main,133.4972991943359,Volt DC,100,T,2W,F,F,05/23/2022,18:48:22,.103661260
269,4.782078733001e-09,Amp DC,.00000001,5.5,F,F,F,F,F,F,Front,F,Main,133.9976806640625,Volt DC,100,T,2W,F,F,05/23/2022,18:48:22,.498525220
270,4.86795803667e-09,Amp DC,.00000001,5.5,F,F,F,F,F,F,Front,F,Main,134.4967193603516,Volt DC,100,T,2W,F,F,05/23/2022,18:48:22,.893375500
271,4.860799318607e-09,Amp DC,.00000001,5.5,F,F,F,F,F,F,Front,F,Main,134.9972991943359,Volt DC,100,T,2W,F,F,05/23/2022,18:48:23,.288239820
272,5.274310321823e-09,Amp DC,.00000001,5.5,F,F,F,F,F,F,Front,F,Main,135.4974517822266,Volt DC,100,T,2W,F,F,05/23/2022,18:48:23,.683101740
273,4.739565184764e-09,Amp DC,.00000001,5.5,F,F,F,F,F,F,Front,F,Main,135.9968872070313,Volt DC,100,T,2W,F,F,05/23/2022,18:48:24,.077954680
274,4.880753134984e-09,Amp DC,.00000001,5.5,F,F,F,F,F,F,Front,F,Main,136.4970855712891,Volt DC,100,T,2W,F,F,05/23/2022,18:48:24,.472837660
275,4.844216139333e-09,Amp DC,.00000001,5.5,F,F,F,F,F,F,Front,F,Main,136.9973754882813,Volt DC,100,T,2W,F,F,05/23/2022,18:48:24,.867697560
276,4.754657112471e-09,Amp DC,.00000001,5.5,F,F,F,F,F,F,Front,F,Main,137.4970550537109,Volt DC,100,T,2W,F,F,05/23/2022,18:48:25,.262567880
277,4.806858022732e-09,Amp DC,.00000001,5.5,F,F,F,F,F,F,Front,F,Main,137.9969329833984,Volt DC,100,T,2W,F,F,05/23/2022,18:48:25,.657429360
278,4.89287277361e-09,Amp DC,.00000001,5.5,F,F,F,F,F,F,Front,F,Main,138.4967041015625,Volt DC,100,T,2W,F,F,05/23/2022,18:48:26,.052302340
279,4.841222978058e-09,Amp DC,.00000001,5.5,F,F,F,F,F,F,Front,F,Main,138.9969482421875,Volt DC,100,T,2W,F,F,05/23/2022,18:48:26,.447174260
280,4.738437198171e-09,Amp DC,.00000001,5.5,F,F,F,F,F,F,Front,F,Main,139.4965209960938,Volt DC,100,T,2W,F,F,05/23/2022,18:48:26,.842059640
281,4.838534461982e-09,Amp DC,.00000001,5.5,F,F,F,F,F,F,Front,F,Main,139.9965820312500,Volt DC,100,T,2W,F,F,05/23/2022,18:48:27,.236921680
282,4.899394223656e-09,Amp DC,.00000001,5.5,F,F,F,F,F,F,Front,F,Main,140.4965820312500,Volt DC,100,T,2W,F,F,05/23/2022,18:48:27,.631774000
283,4.811404163974e-09,Amp DC,.00000001,5.5,F,F,F,F,F,F,Front,F,Main,140.9977569580078,Volt DC,100,T,2W,F,F,05/23/2022,18:48:28,.026637420
284,4.754141968988e-09,Amp DC,.00000001,5.5,F,F,F,F,F,F,Front,F,Main,141.4970855712891,Volt DC,100,T,2W,F,F,05/23/2022,18:48:28,.421489000
285,4.857686253246e-09,Amp DC,.00000001,5.5,F,F,F,F,F,F,Front,F,Main,141.9969024658203,Volt DC,100,T,2W,F,F,05/23/2022,18:48:28,.816357880
286,4.889225913018e-09,Amp DC,.00000001,5.5,F,F,F,F,F,F,Front,F,Main,142.4967498779297,Volt DC,100,T,2W,F,F,05/23/2022,18:48:29,.211221440
287,4.809773468395e-09,Amp DC,.00000001,5.5,F,F,F,F,F,F,Front,F,Main,142.9969329833984,Volt DC,100,T,2W,F,F,05/23/2022,18:48:29,.606081180
288,4.773778705669e-09,Amp DC,.00000001,5.5,F,F,F,F,F,F,Front,F,Main,143.4967803955078,Volt DC,100,T,2W,F,F,05/23/2022,18:48:30,.000957260
289,4.924921359617e-09,Amp DC,.00000001,5.5,F,F,F,F,F,F,Front,F,Main,143.9971771240234,Volt DC,100,T,2W,F,F,05/23/2022,18:48:30,.395821680
290,4.957638299885e-09,Amp DC,.00000001,5.5,F,F,F,F,F,F,Front,F,Main,144.4966735839844,Volt DC,100,T,2W,F,F,05/23/2022,18:48:30,.790677720
291,4.818250243233e-09,Amp DC,.00000001,5.5,F,F,F,F,F,F,Front,F,Main,144.9971771240234,Volt DC,100,T,2W,F,F,05/23/2022,18:48:31,.185550340
292,4.840875256207e-09,Amp DC,.00000001,5.5,F,F,F,F,F,F,Front,F,Main,145.4966278076172,Volt DC,100,T,2W,F,F,05/23/2022,18:48:31,.580416160
293,4.950234000489e-09,Amp DC,.00000001,5.5,F,F,F,F,F,F,Front,F,Main,145.9966278076172,Volt DC,100,T,2W,F,F,05/23/2022,18:48:31,.975290600
294,4.877314108143e-09,Amp DC,.00000001,5.5,F,F,F,F,F,F,Front,F,Main,146.4968261718750,Volt DC,100,T,2W,F,F,05/23/2022,18:48:32,.370154480
295,4.815369880617e-09,Amp DC,.00000001,5.5,F,F,F,F,F,F,Front,F,Main,146.9967803955078,Volt DC,100,T,2W,F,F,05/23/2022,18:48:32,.765015740
296,4.862912739156e-09,Amp DC,.00000001,5.5,F,F,F,F,F,F,Front,F,Main,147.4965667724609,Volt DC,100,T,2W,F,F,05/23/2022,18:48:33,.159902600
297,4.97088814555e-09,Amp DC,.00000001,5.5,F,F,F,F,F,F,Front,F,Main,147.9965667724609,Volt DC,100,T,2W,F,F,05/23/2022,18:48:33,.554755820
298,4.874748160688e-09,Amp DC,.00000001,5.5,F,F,F,F,F,F,Front,F,Main,148.4962463378906,Volt DC,100,T,2W,F,F,05/23/2022,18:48:33,.949632160
299,4.850003509915e-09,Amp DC,.00000001,5.5,F,F,F,F,F,F,Front,F,Main,148.9969787597656,Volt DC,100,T,2W,F,F,05/23/2022,18:48:34,.344508720
300,4.846590240248e-09,Amp DC,.00000001,5.5,F,F,F,F,F,F,Front,F,Main,149.4962463378906,Volt DC,100,T,2W,F,F,05/23/2022,18:48:34,.739395860
301,4.935726938271e-09,Amp DC,.00000001,5.5,F,F,F,F,F,F,Front,F,Main,149.9965972900391,Volt DC,100,T,2W,F,F,05/23/2022,18:48:35,.134286020
302,4.859830315951e-09,Amp DC,.00000001,5.5,F,F,F,F,F,F,Front,F,Main,150.4960632324219,Volt DC,100,T,2W,F,F,05/23/2022,18:48:35,.529176580
303,4.885468030125e-09,Amp DC,.00000001,5.5,F,F,F,F,F,F,Front,F,Main,150.9964141845703,Volt DC,100,T,2W,F,F,05/23/2022,18:48:35,.924046720
304,4.810684739454e-09,Amp DC,.00000001,5.5,F,F,F,F,F,F,Front,F,Main,151.4959869384766,Volt DC,100,T,2W,F,F,05/23/2022,18:48:36,.318904360
305,4.938647268915e-09,Amp DC,.00000001,5.5,F,F,F,F,F,F,Front,F,Main,151.9963378906250,Volt DC,100,T,2W,F,F,05/23/2022,18:48:36,.713787560
306,4.888358606792e-09,Amp DC,.00000001,5.5,F,F,F,F,F,F,Front,F,Main,152.4962768554688,Volt DC,100,T,2W,F,F,05/23/2022,18:48:37,.108650340
307,4.904053163557e-09,Amp DC,.00000001,5.5,F,F,F,F,F,F,Front,F,Main,152.9989013671875,Volt DC,100,T,2W,F,F,05/23/2022,18:48:37,.503514360
308,4.883343507345e-09,Amp DC,.00000001,5.5,F,F,F,F,F,F,Front,F,Main,153.5001831054688,Volt DC,100,T,2W,F,F,05/23/2022,18:48:37,.898382500
309,4.915826856688e-09,Amp DC,.00000001,5.5,F,F,F,F,F,F,Front,F,Main,153.9993133544922,Volt DC,100,T,2W,F,F,05/23/2022,18:48:38,.293232840
310,4.826954391746e-09,Amp DC,.00000001,5.5,F,F,F,F,F,F,Front,F,Main,154.4999084472656,Volt DC,100,T,2W,F,F,05/23/2022,18:48:38,.688083100
311,4.962213751014e-09,Amp DC,.00000001,5.5,F,F,F,F,F,F,Front,F,Main,154.9999542236328,Volt DC,100,T,2W,F,F,05/23/2022,18:48:39,.082933580
312,4.992763535938e-09,Amp DC,.00000001,5.5,F,F,F,F,F,F,Front,F,Main,155.4997863769531,Volt DC,100,T,2W,F,F,05/23/2022,18:48:39,.477789320
313,4.957911414749e-09,Amp DC,.00000001,5.5,F,F,F,F,F,F,Front,F,Main,155.9995422363281,Volt DC,100,T,2W,F,F,05/23/2022,18:48:39,.872673620
314,4.847628520821e-09,Amp DC,.00000001,5.5,F,F,F,F,F,F,Front,F,Main,156.4992523193359,Volt DC,100,T,2W,F,F,05/23/2022,18:48:40,.267537560
315,4.905998718385e-09,Amp DC,.00000001,5.5,F,F,F,F,F,F,Front,F,Main,156.9995117187500,Volt DC,100,T,2W,F,F,05/23/2022,18:48:40,.662419700
316,5.00089525346e-09,Amp DC,.00000001,5.5,F,F,F,F,F,F,Front,F,Main,157.5003662109375,Volt DC,100,T,2W,F,F,05/23/2022,18:48:41,.057276700
317,4.927028562918e-09,Amp DC,.00000001,5.5,F,F,F,F,F,F,Front,F,Main,157.9993133544922,Volt DC,100,T,2W,F,F,05/23/2022,18:48:41,.452143440
318,4.841107070774e-09,Amp DC,.00000001,5.5,F,F,F,F,F,F,Front,F,Main,158.4994354248047,Volt DC,100,T,2W,F,F,05/23/2022,18:48:41,.847013500
319,4.914427975677e-09,Amp DC,.00000001,5.5,F,F,F,F,F,F,Front,F,Main,158.9994659423828,Volt DC,100,T,2W,F,F,05/23/2022,18:48:42,.241868840
320,5.009372916476e-09,Amp DC,.00000001,5.5,F,F,F,F,F,F,Front,F,Main,159.4992980957031,Volt DC,100,T,2W,F,F,05/23/2022,18:48:42,.636728760
321,4.923502494592e-09,Amp DC,.00000001,5.5,F,F,F,F,F,F,Front,F,Main,159.9989929199219,Volt DC,100,T,2W,F,F,05/23/2022,18:48:43,.031576040
322,4.871398395778e-09,Amp DC,.00000001,5.5,F,F,F,F,F,F,Front,F,Main,160.4997406005859,Volt DC,100,T,2W,F,F,05/23/2022,18:48:43,.426436380
323,4.956935306666e-09,Amp DC,.00000001,5.5,F,F,F,F,F,F,Front,F,Main,160.9995727539063,Volt DC,100,T,2W,F,F,05/23/2022,18:48:43,.821318440
324,5.010192705157e-09,Amp DC,.00000001,5.5,F,F,F,F,F,F,Front,F,Main,161.4996643066406,Volt DC,100,T,2W,F,F,05/23/2022,18:48:44,.216195760
325,4.899875172271e-09,Amp DC,.00000001,5.5,F,F,F,F,F,F,Front,F,Main,161.9992370605469,Volt DC,100,T,2W,F,F,05/23/2022,18:48:44,.611067980
326,4.87129625526e-09,Amp DC,.00000001,5.5,F,F,F,F,F,F,Front,F,Main,162.4993286132813,Volt DC,100,T,2W,F,F,05/23/2022,18:48:45,.005918700
327,4.977550371876e-09,Amp DC,.00000001,5.5,F,F,F,F,F,F,Front,F,Main,162.9989471435547,Volt DC,100,T,2W,F,F,05/23/2022,18:48:45,.400790340
328,5.006735914748e-09,Amp DC,.00000001,5.5,F,F,F,F,F,F,Front,F,Main,163.4995117187500,Volt DC,100,T,2W,F,F,05/23/2022,18:48:45,.795662740
329,4.881007154012e-09,Amp DC,.00000001,5.5,F,F,F,F,F,F,Front,F,Main,163.9989318847656,Volt DC,100,T,2W,F,F,05/23/2022,18:48:46,.190549380
330,4.887040105928e-09,Amp DC,.00000001,5.5,F,F,F,F,F,F,Front,F,Main,164.4991607666016,Volt DC,100,T,2W,F,F,05/23/2022,18:48:46,.585422660
331,4.993641056217e-09,Amp DC,.00000001,5.5,F,F,F,F,F,F,Front,F,Main,164.9987030029297,Volt DC,100,T,2W,F,F,05/23/2022,18:48:46,.980282940
332,4.991397517529e-09,Amp DC,.00000001,5.5,F,F,F,F,F,F,Front,F,Main,165.4991149902344,Volt DC,100,T,2W,F,F,05/23/2022,18:48:47,.375140300
333,4.869387115747e-09,Amp DC,.00000001,5.5,F,F,F,F,F,F,Front,F,Main,165.9996337890625,Volt DC,100,T,2W,F,F,05/23/2022,18:48:47,.770018240
334,4.886546278726e-09,Amp DC,.00000001,5.5,F,F,F,F,F,F,Front,F,Main,166.4985351562500,Volt DC,100,T,2W,F,F,05/23/2022,18:48:48,.164903780
335,5.003728986708e-09,Amp DC,.00000001,5.5,F,F,F,F,F,F,Front,F,Main,166.9987945556641,Volt DC,100,T,2W,F,F,05/23/2022,18:48:48,.559760200
336,4.961068889031e-09,Amp DC,.00000001,5.5,F,F,F,F,F,F,Front,F,Main,167.4991607666016,Volt DC,100,T,2W,F,F,05/23/2022,18:48:48,.954634980
337,4.843951906253e-09,Amp DC,.00000001,5.5,F,F,F,F,F,F,Front,F,Main,167.9990997314453,Volt DC,100,T,2W,F,F,05/23/2022,18:48:49,.349500060
338,4.909508355411e-09,Amp DC,.00000001,5.5,F,F,F,F,F,F,Front,F,Main,168.4992828369141,Volt DC,100,T,2W,F,F,05/23/2022,18:48:49,.744361880
339,5.005167835748e-09,Amp DC,.00000001,5.5,F,F,F,F,F,F,Front,F,Main,168.9990844726563,Volt DC,100,T,2W,F,F,05/23/2022,18:48:50,.139206500
340,4.946224763103e-09,Amp DC,.00000001,5.5,F,F,F,F,F,F,Front,F,Main,169.4998779296875,Volt DC,100,T,2W,F,F,05/23/2022,18:48:50,.534068920
341,4.852273693956e-09,Amp DC,.00000001,5.5,F,F,F,F,F,F,Front,F,Main,169.9987945556641,Volt DC,100,T,2W,F,F,05/23/2022,18:48:50,.928921480
342,4.964266331342e-09,Amp DC,.00000001,5.5,F,F,F,F,F,F,Front,F,Main,170.4989929199219,Volt DC,100,T,2W,F,F,05/23/2022,18:48:51,.323786540
343,5.001728808907e-09,Amp DC,.00000001,5.5,F,F,F,F,F,F,Front,F,Main,170.9990081787109,Volt DC,100,T,2W,F,F,05/23/2022,18:48:51,.718634420
344,4.886505866608e-09,Amp DC,.00000001,5.5,F,F,F,F,F,F,Front,F,Main,171.4995269775391,Volt DC,100,T,2W,F,F,05/23/2022,18:48:52,.113516420
345,4.869670000573e-09,Amp DC,.00000001,5.5,F,F,F,F,F,F,Front,F,Main,171.9988555908203,Volt DC,100,T,2W,F,F,05/23/2022,18:48:52,.508357260
346,4.993205848791e-09,Amp DC,.00000001,5.5,F,F,F,F,F,F,Front,F,Main,172.4987335205078,Volt DC,100,T,2W,F,F,05/23/2022,18:48:52,.903210660
347,5.006985936973e-09,Amp DC,.00000001,5.5,F,F,F,F,F,F,Front,F,Main,172.9990386962891,Volt DC,100,T,2W,F,F,05/23/2022,18:48:53,.298088100
348,4.891260729778e-09,Amp DC,.00000001,5.5,F,F,F,F,F,F,Front,F,Main,173.4989471435547,Volt DC,100,T,2W,F,F,05/23/2022,18:48:53,.692944480
349,4.918430107637e-09,Amp DC,.00000001,5.5,F,F,F,F,F,F,Front,F,Main,173.9988555908203,Volt DC,100,T,2W,F,F,05/23/2022,18:48:54,.087822800
350,5.015016402155e-09,Amp DC,.00000001,5.5,F,F,F,F,F,F,Front,F,Main,174.4994049072266,Volt DC,100,T,2W,F,F,05/23/2022,18:48:54,.482689300
351,4.977171119691e-09,Amp DC,.00000001,5.5,F,F,F,F,F,F,Front,F,Main,174.9984588623047,Volt DC,100,T,2W,F,F,05/23/2022,18:48:54,.877565460
352,4.878334181058e-09,Amp DC,.00000001,5.5,F,F,F,F,F,F,Front,F,Main,175.4989318847656,Volt DC,100,T,2W,F,F,05/23/2022,18:48:55,.272447020
353,4.935411634932e-09,Amp DC,.00000001,5.5,F,F,F,F,F,F,Front,F,Main,175.9982910156250,Volt DC,100,T,2W,F,F,05/23/2022,18:48:55,.667295660
354,5.022157800738e-09,Amp DC,.00000001,5.5,F,F,F,F,F,F,Front,F,Main,176.4985809326172,Volt DC,100,T,2W,F,F,05/23/2022,18:48:56,.062172840
355,4.946582254917e-09,Amp DC,.00000001,5.5,F,F,F,F,F,F,Front,F,Main,176.9984893798828,Volt DC,100,T,2W,F,F,05/23/2022,18:48:56,.457026900
356,4.895882366185e-09,Amp DC,.00000001,5.5,F,F,F,F,F,F,Front,F,Main,177.4989166259766,Volt DC,100,T,2W,F,F,05/23/2022,18:48:56,.851891280
357,4.996966840309e-09,Amp DC,.00000001,5.5,F,F,F,F,F,F,Front,F,Main,177.9983825683594,Volt DC,100,T,2W,F,F,05/23/2022,18:48:57,.246757380
358,5.033025107792e-09,Amp DC,.00000001,5.5,F,F,F,F,F,F,Front,F,Main,178.4987335205078,Volt DC,100,T,2W,F,F,05/23/2022,18:48:57,.641607020
359,4.921945961911e-09,Amp DC,.00000001,5.5,F,F,F,F,F,F,Front,F,Main,178.9979858398438,Volt DC,100,T,2W,F,F,05/23/2022,18:48:58,.036439520
360,4.924780139248e-09,Amp DC,.00000001,5.5,F,F,F,F,F,F,Front,F,Main,179.4986419677734,Volt DC,100,T,2W,F,F,05/23/2022,18:48:58,.431294540
361,5.031635108566e-09,Amp DC,.00000001,5.5,F,F,F,F,F,F,Front,F,Main,179.9981689453125,Volt DC,100,T,2W,F,F,05/23/2022,18:48:58,.826139520
362,5.01949282139e-09,Amp DC,.00000001,5.5,F,F,F,F,F,F,Front,F,Main,180.4982910156250,Volt DC,100,T,2W,F,F,05/23/2022,18:48:59,.220998520
363,4.897422023475e-09,Amp DC,.00000001,5.5,F,F,F,F,F,F,Front,F,Main,180.9982452392578,Volt DC,100,T,2W,F,F,05/23/2022,18:48:59,.615872480
364,4.952211529741e-09,Amp DC,.00000001,5.5,F,F,F,F,F,F,Front,F,Main,181.4989776611328,Volt DC,100,T,2W,F,F,05/23/2022,18:49:00,.010751800
365,5.05114083893e-09,Amp DC,.00000001,5.5,F,F,F,F,F,F,Front,F,Main,181.9985504150391,Volt DC,100,T,2W,F,F,05/23/2022,18:49:00,.405600760
366,5.000828195989e-09,Amp DC,.00000001,5.5,F,F,F,F,F,F,Front,F,Main,182.4986267089844,Volt DC,100,T,2W,F,F,05/23/2022,18:49:00,.800449100
367,4.896856697911e-09,Amp DC,.00000001,5.5,F,F,F,F,F,F,Front,F,Main,182.9985504150391,Volt DC,100,T,2W,F,F,05/23/2022,18:49:01,.195309760
368,4.988755630819e-09,Amp DC,.00000001,5.5,F,F,F,F,F,F,Front,F,Main,183.4985046386719,Volt DC,100,T,2W,F,F,05/23/2022,18:49:01,.590165220
369,5.065198038778e-09,Amp DC,.00000001,5.5,F,F,F,F,F,F,Front,F,Main,183.9983673095703,Volt DC,100,T,2W,F,F,05/23/2022,18:49:01,.985034780
370,5.000457381499e-09,Amp DC,.00000001,5.5,F,F,F,F,F,F,Front,F,Main,184.4985961914063,Volt DC,100,T,2W,F,F,05/23/2022,18:49:02,.379895720
371,4.911742124136e-09,Amp DC,.00000001,5.5,F,F,F,F,F,F,Front,F,Main,184.9982757568359,Volt DC,100,T,2W,F,F,05/23/2022,18:49:02,.774776200
372,5.028538030416e-09,Amp DC,.00000001,5.5,F,F,F,F,F,F,Front,F,Main,185.4996490478516,Volt DC,100,T,2W,F,F,05/23/2022,18:49:03,.169646140
373,5.063288899265e-09,Amp DC,.00000001,5.5,F,F,F,F,F,F,Front,F,Main,185.9980773925781,Volt DC,100,T,2W,F,F,05/23/2022,18:49:03,.564507360
374,4.971873135418e-09,Amp DC,.00000001,5.5,F,F,F,F,F,F,Front,F,Main,186.4983215332031,Volt DC,100,T,2W,F,F,05/23/2022,18:49:03,.959361660
375,4.934366248932e-09,Amp DC,.00000001,5.5,F,F,F,F,F,F,Front,F,Main,186.9979095458984,Volt DC,100,T,2W,F,F,05/23/2022,18:49:04,.354227080
376,5.054358709344e-09,Amp DC,.00000001,5.5,F,F,F,F,F,F,Front,F,Main,187.4985656738281,Volt DC,100,T,2W,F,F,05/23/2022,18:49:04,.749089600
377,5.071616016039e-09,Amp DC,.00000001,5.5,F,F,F,F,F,F,Front,F,Main,187.9985351562500,Volt DC,100,T,2W,F,F,05/23/2022,18:49:05,.143948920
378,4.946669296402e-09,Amp DC,.00000001,5.5,F,F,F,F,F,F,Front,F,Main,188.4978790283203,Volt DC,100,T,2W,F,F,05/23/2022,18:49:05,.538813840
379,4.960775346063e-09,Amp DC,.00000001,5.5,F,F,F,F,F,F,Front,F,Main,188.9980468750000,Volt DC,100,T,2W,F,F,05/23/2022,18:49:05,.933699020
380,5.074664244376e-09,Amp DC,.00000001,5.5,F,F,F,F,F,F,Front,F,Main,189.4982299804688,Volt DC,100,T,2W,F,F,05/23/2022,18:49:06,.328550160
381,5.033927941156e-09,Amp DC,.00000001,5.5,F,F,F,F,F,F,Front,F,Main,189.9976806640625,Volt DC,100,T,2W,F,F,05/23/2022,18:49:06,.723418220
382,4.922518836992e-09,Amp DC,.00000001,5.5,F,F,F,F,F,F,Front,F,Main,190.4976501464844,Volt DC,100,T,2W,F,F,05/23/2022,18:49:07,.118279640
383,4.990438284835e-09,Amp DC,.00000001,5.5,F,F,F,F,F,F,Front,F,Main,190.9980316162109,Volt DC,100,T,2W,F,F,05/23/2022,18:49:07,.513146360
384,5.11719600027e-09,Amp DC,.00000001,5.5,F,F,F,F,F,F,Front,F,Main,191.4982147216797,Volt DC,100,T,2W,F,F,05/23/2022,18:49:07,.908002900
385,5.040135420131e-09,Amp DC,.00000001,5.5,F,F,F,F,F,F,Front,F,Main,191.9972686767578,Volt DC,100,T,2W,F,F,05/23/2022,18:49:08,.302883000
386,4.965445832283e-09,Amp DC,.00000001,5.5,F,F,F,F,F,F,Front,F,Main,192.4980163574219,Volt DC,100,T,2W,F,F,05/23/2022,18:49:08,.697753580
387,5.052639195924e-09,Amp DC,.00000001,5.5,F,F,F,F,F,F,Front,F,Main,192.9976043701172,Volt DC,100,T,2W,F,F,05/23/2022,18:49:09,.092601680
388,5.150910808993e-09,Amp DC,.00000001,5.5,F,F,F,F,F,F,Front,F,Main,193.4980163574219,Volt DC,100,T,2W,F,F,05/23/2022,18:49:09,.487446260
389,5.042487316587e-09,Amp DC,.00000001,5.5,F,F,F,F,F,F,Front,F,Main,193.9977722167969,Volt DC,100,T,2W,F,F,05/23/2022,18:49:09,.882291260
390,4.99760721695e-09,Amp DC,.00000001,5.5,F,F,F,F,F,F,Front,F,Main,194.4976348876953,Volt DC,100,T,2W,F,F,05/23/2022,18:49:10,.277151900
391,5.131997937724e-09,Amp DC,.00000001,5.5,F,F,F,F,F,F,Front,F,Main,194.9979400634766,Volt DC,100,T,2W,F,F,05/23/2022,18:49:10,.672020520
392,5.188151686042e-09,Amp DC,.00000001,5.5,F,F,F,F,F,F,Front,F,Main,195.4978179931641,Volt DC,100,T,2W,F,F,05/23/2022,18:49:11,.066880100
393,5.093548249846e-09,Amp DC,.00000001,5.5,F,F,F,F,F,F,Front,F,Main,195.9976196289063,Volt DC,100,T,2W,F,F,05/23/2022,18:49:11,.461762740
394,5.110494250005e-09,Amp DC,.00000001,5.5,F,F,F,F,F,F,Front,F,Main,196.4981994628906,Volt DC,100,T,2W,F,F,05/23/2022,18:49:11,.856601980
395,5.252377199838e-09,Amp DC,.00000001,5.5,F,F,F,F,F,F,Front,F,Main,196.9974670410156,Volt DC,100,T,2W,F,F,05/23/2022,18:49:12,.251476380
396,5.313019801889e-09,Amp DC,.00000001,5.5,F,F,F,F,F,F,Front,F,Main,197.4980773925781,Volt DC,100,T,2W,F,F,05/23/2022,18:49:12,.646344680
397,5.231233668468e-09,Amp DC,.00000001,5.5,F,F,F,F,F,F,Front,F,Main,197.9981689453125,Volt DC,100,T,2W,F,F,05/23/2022,18:49:13,.041187120
398,5.241728828764e-09,Amp DC,.00000001,5.5,F,F,F,F,F,F,Front,F,Main,198.4976348876953,Volt DC,100,T,2W,F,F,05/23/2022,18:49:13,.436046060
399,5.381439738272e-09,Amp DC,.00000001,5.5,F,F,F,F,F,F,Front,F,Main,198.9974060058594,Volt DC,100,T,2W,F,F,05/23/2022,18:49:13,.830893760
400,5.441688433194e-09,Amp DC,.00000001,5.5,F,F,F,F,F,F,Front,F,Main,199.4980010986328,Volt DC,100,T,2W,F,F,05/23/2022,18:49:14,.225771960
401,5.350151432992e-09,Amp DC,.00000001,5.5,F,F,F,F,F,F,Front,F,Main,199.9975891113281,Volt DC,100,T,2W,F,F,05/23/2022,18:49:14,.620631120
402,5.452378992743e-09,Amp DC,.00000001,5.5,F,F,F,F,F,F,Front,F,Main,200.4974212646484,Volt DC,100,T,2W,F,F,05/23/2022,18:49:15,.015501900
403,5.59289992097e-09,Amp DC,.00000001,5.5,F,F,F,F,F,F,Front,F,Main,200.9974517822266,Volt DC,100,T,2W,F,F,05/23/2022,18:49:15,.410358140
404,5.663877811202e-09,Amp DC,.00000001,5.5,F,F,F,F,F,F,Front,F,Main,201.4986572265625,Volt DC,100,T,2W,F,F,05/23/2022,18:49:15,.805208140
405,5.613442599639e-09,Amp DC,.00000001,5.5,F,F,F,F,F,F,Front,F,Main,201.9972076416016,Volt DC,100,T,2W,F,F,05/23/2022,18:49:16,.200099300
406,5.777475386992e-09,Amp DC,.00000001,5.5,F,F,F,F,F,F,Front,F,Main,202.4973754882813,Volt DC,100,T,2W,F,F,05/23/2022,18:49:16,.594954920
407,5.890737675429e-09,Amp DC,.00000001,5.5,F,F,F,F,F,F,Front,F,Main,202.9967346191406,Volt DC,100,T,2W,F,F,05/23/2022,18:49:16,.989815260
408,5.877103692598e-09,Amp DC,.00000001,5.5,F,F,F,F,F,F,Front,F,Main,203.4975128173828,Volt DC,100,T,2W,F,F,05/23/2022,18:49:17,.384668140
409,5.98687854847e-09,Amp DC,.00000001,5.5,F,F,F,F,F,F,Front,F,Main,203.9964141845703,Volt DC,100,T,2W,F,F,05/23/2022,18:49:17,.779540640
410,6.17619289045e-09,Amp DC,.00000001,5.5,F,F,F,F,F,F,Front,F,Main,204.4966888427734,Volt DC,100,T,2W,F,F,05/23/2022,18:49:18,.174387280
411,6.311128064596e-09,Amp DC,.00000001,5.5,F,F,F,F,F,F,Front,F,Main,204.9976654052734,Volt DC,100,T,2W,F,F,05/23/2022,18:49:18,.569248400
412,6.2797416156e-09,Amp DC,.00000001,5.5,F,F,F,F,F,F,Front,F,Main,205.4969940185547,Volt DC,100,T,2W,F,F,05/23/2022,18:49:18,.964136280
413,6.50083942233e-09,Amp DC,.00000001,5.5,F,F,F,F,F,F,Front,F,Main,205.9968414306641,Volt DC,100,T,2W,F,F,05/23/2022,18:49:19,.359014500
414,6.796966101064e-09,Amp DC,.00000001,5.5,F,F,F,F,F,F,Front,F,Main,206.4967498779297,Volt DC,100,T,2W,F,F,05/23/2022,18:49:19,.753891720
415,6.85440770809e-09,Amp DC,.00000001,5.5,F,F,F,F,F,F,Front,F,Main,206.9964752197266,Volt DC,100,T,2W,F,F,05/23/2022,18:49:20,.148748480
416,6.820913167616e-09,Amp DC,.00000001,5.5,F,F,F,F,F,F,Front,F,Main,207.4968872070313,Volt DC,100,T,2W,F,F,05/23/2022,18:49:20,.543607660
417,7.090982023783e-09,Amp DC,.00000001,5.5,F,F,F,F,F,F,Front,F,Main,207.9963836669922,Volt DC,100,T,2W,F,F,05/23/2022,18:49:20,.938452520
418,7.599826545857e-09,Amp DC,.00000001,5.5,F,F,F,F,F,F,Front,F,Main,208.4974822998047,Volt DC,100,T,2W,F,F,05/23/2022,18:49:21,.333315980
419,7.918204758539e-09,Amp DC,.00000001,5.5,F,F,F,F,F,F,Front,F,Main,208.9968872070313,Volt DC,100,T,2W,F,F,05/23/2022,18:49:21,.728189480
420,8.333429057927e-09,Amp DC,.00000001,5.5,F,F,F,F,F,F,Front,F,Main,209.4974975585938,Volt DC,100,T,2W,F,F,05/23/2022,18:49:22,.123060240
421,8.688478381202e-09,Amp DC,.00000001,5.5,F,F,F,F,F,F,Front,F,Main,209.9967956542969,Volt DC,100,T,2W,F,F,05/23/2022,18:49:22,.517931300
