Style,Standard
Append Mode,1
Fill Mode,1
Capacity,100000
Count,421
Base Time Seconds,1653327669
Base Time Fractional,.964391400
Base Time,05/23/2022 17:41:09.964391400
Index,Reading,Unit,Range Digits,Disp Digits,Math,Start Group,Limit1 High,Limit1 Low,Limit2 High,Limit2 Low,Terminal,Questionable,Origin,Value,Unit,Digits,Output,Sense,Source Limit,Overtemp,Date,Time,Fractional Seconds
1,-9.565056524607e-10,Amp DC,.00000001,5.5,F,F,F,F,F,F,Front,F,Main,-0.0024064872414,Volt DC,100,T,2W,F,F,05/23/2022,17:41:09,.964391400
2,5.168335093231e-09,Amp DC,.00000001,5.5,F,F,F,F,F,F,Front,F,Main,0.4973383545876,Volt DC,100,T,2W,F,F,05/23/2022,17:41:10,.359266800
3,5.446609829818e-09,Amp DC,.00000001,5.5,F,F,F,F,F,F,Front,F,Main,0.9976106286049,Volt DC,100,T,2W,F,F,05/23/2022,17:41:10,.754137500
4,5.69909008874e-09,Amp DC,.00000001,5.5,F,F,F,F,F,F,Front,F,Main,1.4974583387375,Volt DC,100,T,2W,F,F,05/23/2022,17:41:11,.148986120
5,5.439587447142e-09,Amp DC,.00000001,5.5,F,F,F,F,F,F,Front,F,Main,1.9974894523621,Volt DC,100,T,2W,F,F,05/23/2022,17:41:11,.543808840
6,5.188871110562e-09,Amp DC,.00000001,5.5,F,F,F,F,F,F,Front,F,Main,2.4977960586548,Volt DC,100,T,2W,F,F,05/23/2022,17:41:11,.938655220
7,5.461101348914e-09,Amp DC,.00000001,5.5,F,F,F,F,F,F,Front,F,Main,2.9977459907532,Volt DC,100,T,2W,F,F,05/23/2022,17:41:12,.333519240
8,5.644519518455e-09,Amp DC,.00000001,5.5,F,F,F,F,F,F,Front,F,Main,3.4977200031281,Volt DC,100,T,2W,F,F,05/23/2022,17:41:12,.728363960
9,5.324206409085e-09,Amp DC,.00000001,5.5,F,F,F,F,F,F,Front,F,Main,3.9975235462189,Volt DC,100,T,2W,F,F,05/23/2022,17:41:13,.123231720
10,5.179690454327e-09,Amp DC,.00000001,5.5,F,F,F,F,F,F,Front,F,Main,4.4977149963379,Volt DC,100,T,2W,F,F,05/23/2022,17:41:13,.518071980
11,5.523204560376e-09,Amp DC,.00000001,5.5,F,F,F,F,F,F,Front,F,Main,4.9979748725891,Volt DC,100,T,2W,F,F,05/23/2022,17:41:13,.912908900
12,5.614283704602e-09,Amp DC,.00000001,5.5,F,F,F,F,F,F,Front,F,Main,5.4979605674744,Volt DC,100,T,2W,F,F,05/23/2022,17:41:14,.307761420
13,5.262642766013e-09,Amp DC,.00000001,5.5,F,F,F,F,F,F,Front,F,Main,5.9982299804688,Volt DC,100,T,2W,F,F,05/23/2022,17:41:14,.702592420
14,5.22597209951e-09,Amp DC,.00000001,5.5,F,F,F,F,F,F,Front,F,Main,6.4979195594788,Volt DC,100,T,2W,F,F,05/23/2022,17:41:15,.097442480
15,5.56538859442e-09,Amp DC,.00000001,5.5,F,F,F,F,F,F,Front,F,Main,6.9980325698853,Volt DC,100,T,2W,F,F,05/23/2022,17:41:15,.492298380
16,5.556981541588e-09,Amp DC,.00000001,5.5,F,F,F,F,F,F,Front,F,Main,7.4980349540710,Volt DC,100,T,2W,F,F,05/23/2022,17:41:15,.887141280
17,5.206355790932e-09,Amp DC,.00000001,5.5,F,F,F,F,F,F,Front,F,Main,7.9979672431946,Volt DC,100,T,2W,F,F,05/23/2022,17:41:16,.281989860
18,5.270481828745e-09,Amp DC,.00000001,5.5,F,F,F,F,F,F,Front,F,Main,8.4979953765869,Volt DC,100,T,2W,F,F,05/23/2022,17:41:16,.676834260
19,5.594956498101e-09,Amp DC,.00000001,5.5,F,F,F,F,F,F,Front,F,Main,8.9978456497192,Volt DC,100,T,2W,F,F,05/23/2022,17:41:17,.071689240
20,5.522784896073e-09,Amp DC,.00000001,5.5,F,F,F,F,F,F,Front,F,Main,9.4980821609497,Volt DC,100,T,2W,F,F,05/23/2022,17:41:17,.466536900
21,5.17021847557e-09,Amp DC,.00000001,5.5,F,F,F,F,F,F,Front,F,Main,9.9978981018066,Volt DC,100,T,2W,F,F,05/23/2022,17:41:17,.861406840
22,5.31212585031e-09,Amp DC,.00000001,5.5,F,F,F,F,F,F,Front,F,Main,10.4978599548340,Volt DC,100,T,2W,F,F,05/23/2022,17:41:18,.256228400
23,5.613613573985e-09,Amp DC,.00000001,5.5,F,F,F,F,F,F,Front,F,Main,10.9979801177979,Volt DC,100,T,2W,F,F,05/23/2022,17:41:18,.651072400
24,5.461258112405e-09,Amp DC,.00000001,5.5,F,F,F,F,F,F,Front,F,Main,11.4978170394897,Volt DC,100,T,2W,F,F,05/23/2022,17:41:19,.045926760
25,5.160827321049e-09,Amp DC,.00000001,5.5,F,F,F,F,F,F,Front,F,Main,11.9983081817627,Volt DC,100,T,2W,F,F,05/23/2022,17:41:19,.440768600
26,5.379221512669e-09,Amp DC,.00000001,5.5,F,F,F,F,F,F,Front,F,Main,12.4983034133911,Volt DC,100,T,2W,F,F,05/23/2022,17:41:19,.835621160
27,5.641424216662e-09,Amp DC,.00000001,5.5,F,F,F,F,F,F,Front,F,Main,12.9985523223877,Volt DC,100,T,2W,F,F,05/23/2022,17:41:20,.230473240
28,5.40170796981e-09,Amp DC,.00000001,5.5,F,F,F,F,F,F,Front,F,Main,13.4984264373779,Volt DC,100,T,2W,F,F,05/23/2022,17:41:20,.625337140
29,5.161060023795e-09,Amp DC,.00000001,5.5,F,F,F,F,F,F,Front,F,Main,13.9983301162720,Volt DC,100,T,2W,F,F,05/23/2022,17:41:21,.020185720
30,5.440973449566e-09,Amp DC,.00000001,5.5,F,F,F,F,F,F,Front,F,Main,14.4983692169189,Volt DC,100,T,2W,F,F,05/23/2022,17:41:21,.415017360
31,5.633363109325e-09,Amp DC,.00000001,5.5,F,F,F,F,F,F,Front,F,Main,14.9982175827026,Volt DC,100,T,2W,F,F,05/23/2022,17:41:21,.809870980
32,5.350179854702e-09,Amp DC,.00000001,5.5,F,F,F,F,F,F,Front,F,Main,15.4984207153320,Volt DC,100,T,2W,F,F,05/23/2022,17:41:22,.204712020
33,5.191986840458e-09,Amp DC,.00000001,5.5,F,F,F,F,F,F,Front,F,Main,15.9984264373779,Volt DC,100,T,2W,F,F,05/23/2022,17:41:22,.599549120
34,5.499823263477e-09,Amp DC,.00000001,5.5,F,F,F,F,F,F,Front,F,Main,16.4984855651855,Volt DC,100,T,2W,F,F,05/23/2022,17:41:22,.994403300
35,5.619949838831e-09,Amp DC,.00000001,5.5,F,F,F,F,F,F,Front,F,Main,16.9984130859375,Volt DC,100,T,2W,F,F,05/23/2022,17:41:23,.389247880
36,5.285824222767e-09,Amp DC,.00000001,5.5,F,F,F,F,F,F,Front,F,Main,17.4982223510742,Volt DC,100,T,2W,F,F,05/23/2022,17:41:23,.784103260
37,5.235430311501e-09,Amp DC,.00000001,5.5,F,F,F,F,F,F,Front,F,Main,17.9982662200928,Volt DC,100,T,2W,F,F,05/23/2022,17:41:24,.178947020
38,5.557325266636e-09,Amp DC,.00000001,5.5,F,F,F,F,F,F,Front,F,Main,18.4982738494873,Volt DC,100,T,2W,F,F,05/23/2022,17:41:24,.573782440
39,5.58598145517e-09,Amp DC,.00000001,5.5,F,F,F,F,F,F,Front,F,Main,18.9985065460205,Volt DC,100,T,2W,F,F,05/23/2022,17:41:24,.968644960
40,5.247398959796e-09,Amp DC,.00000001,5.5,F,F,F,F,F,F,Front,F,Main,19.4988498687744,Volt DC,100,T,2W,F,F,05/23/2022,17:41:25,.363508800
41,5.268432801131e-09,Amp DC,.00000001,5.5,F,F,F,F,F,F,Front,F,Main,19.9986801147461,Volt DC,100,T,2W,F,F,05/23/2022,17:41:25,.758380660
42,5.60375257308e-09,Amp DC,.00000001,5.5,F,F,F,F,F,F,Front,F,Main,20.4986610412598,Volt DC,100,T,2W,F,F,05/23/2022,17:41:26,.153246540
43,5.559462668003e-09,Amp DC,.00000001,5.5,F,F,F,F,F,F,Front,F,Main,20.9985580444336,Volt DC,100,T,2W,F,F,05/23/2022,17:41:26,.548088500
44,5.218224075065e-09,Amp DC,.00000001,5.5,F,F,F,F,F,F,Front,F,Main,21.4985198974609,Volt DC,100,T,2W,F,F,05/23/2022,17:41:26,.942933660
45,5.317415396888e-09,Amp DC,.00000001,5.5,F,F,F,F,F,F,Front,F,Main,21.9986896514893,Volt DC,100,T,2W,F,F,05/23/2022,17:41:27,.337769200
46,5.626179522267e-09,Amp DC,.00000001,5.5,F,F,F,F,F,F,Front,F,Main,22.4984951019287,Volt DC,100,T,2W,F,F,05/23/2022,17:41:27,.732632060
47,5.525331747691e-09,Amp DC,.00000001,5.5,F,F,F,F,F,F,Front,F,Main,22.9985809326172,Volt DC,100,T,2W,F,F,05/23/2022,17:41:28,.127503180
48,5.195557761795e-09,Amp DC,.00000001,5.5,F,F,F,F,F,F,Front,F,Main,23.4985580444336,Volt DC,100,T,2W,F,F,05/23/2022,17:41:28,.522341580
49,5.362651656071e-09,Amp DC,.00000001,5.5,F,F,F,F,F,F,Front,F,Main,23.9985752105713,Volt DC,100,T,2W,F,F,05/23/2022,17:41:28,.917186900
50,5.648089995702e-09,Amp DC,.00000001,5.5,F,F,F,F,F,F,Front,F,Main,24.4985885620117,Volt DC,100,T,2W,F,F,05/23/2022,17:41:29,.312041040
51,5.476848308206e-09,Amp DC,.00000001,5.5,F,F,F,F,F,F,Front,F,Main,24.9984169006348,Volt DC,100,T,2W,F,F,05/23/2022,17:41:29,.706880740
52,5.180925466419e-09,Amp DC,.00000001,5.5,F,F,F,F,F,F,Front,F,Main,25.4982891082764,Volt DC,100,T,2W,F,F,05/23/2022,17:41:30,.101739440
53,5.414638071244e-09,Amp DC,.00000001,5.5,F,F,F,F,F,F,Front,F,Main,25.9979724884033,Volt DC,100,T,2W,F,F,05/23/2022,17:41:30,.496598140
54,5.670591107787e-09,Amp DC,.00000001,5.5,F,F,F,F,F,F,Front,F,Main,26.4982814788818,Volt DC,100,T,2W,F,F,05/23/2022,17:41:30,.891460920
55,5.44356248966e-09,Amp DC,.00000001,5.5,F,F,F,F,F,F,Front,F,Main,26.9983291625977,Volt DC,100,T,2W,F,F,05/23/2022,17:41:31,.286335300
56,5.184865869978e-09,Amp DC,.00000001,5.5,F,F,F,F,F,F,Front,F,Main,27.4980583190918,Volt DC,100,T,2W,F,F,05/23/2022,17:41:31,.681180900
57,5.458998142416e-09,Amp DC,.00000001,5.5,F,F,F,F,F,F,Front,F,Main,27.9982318878174,Volt DC,100,T,2W,F,F,05/23/2022,17:41:32,.076026780
58,5.671671576835e-09,Amp DC,.00000001,5.5,F,F,F,F,F,F,Front,F,Main,28.4979839324951,Volt DC,100,T,2W,F,F,05/23/2022,17:41:32,.470861920
59,5.404649616736e-09,Amp DC,.00000001,5.5,F,F,F,F,F,F,Front,F,Main,28.9981117248535,Volt DC,100,T,2W,F,F,05/23/2022,17:41:32,.865748480
60,5.200465391653e-09,Amp DC,.00000001,5.5,F,F,F,F,F,F,Front,F,Main,29.4979953765869,Volt DC,100,T,2W,F,F,05/23/2022,17:41:33,.260608400
61,5.499886324145e-09,Amp DC,.00000001,5.5,F,F,F,F,F,F,Front,F,Main,29.9979114532471,Volt DC,100,T,2W,F,F,05/23/2022,17:41:33,.655480080
62,5.676178638225e-09,Amp DC,.00000001,5.5,F,F,F,F,F,F,Front,F,Main,30.4980430603027,Volt DC,100,T,2W,F,F,05/23/2022,17:41:34,.050321680
63,5.373310685286e-09,Amp DC,.00000001,5.5,F,F,F,F,F,F,Front,F,Main,30.9978599548340,Volt DC,100,T,2W,F,F,05/23/2022,17:41:34,.445170280
64,5.222182686282e-09,Amp DC,.00000001,5.5,F,F,F,F,F,F,Front,F,Main,31.4978713989258,Volt DC,100,T,2W,F,F,05/23/2022,17:41:34,.840024880
65,5.535848668359e-09,Amp DC,.00000001,5.5,F,F,F,F,F,F,Front,F,Main,31.9977302551270,Volt DC,100,T,2W,F,F,05/23/2022,17:41:35,.234885640
66,5.677883052613e-09,Amp DC,.00000001,5.5,F,F,F,F,F,F,Front,F,Main,32.4984245300293,Volt DC,100,T,2W,F,F,05/23/2022,17:41:35,.629754600
67,5.356146193236e-09,Amp DC,.00000001,5.5,F,F,F,F,F,F,Front,F,Main,32.9984054565430,Volt DC,100,T,2W,F,F,05/23/2022,17:41:36,.024593580
68,5.232216437889e-09,Amp DC,.00000001,5.5,F,F,F,F,F,F,Front,F,Main,33.4983673095703,Volt DC,100,T,2W,F,F,05/23/2022,17:41:36,.419473480
69,5.559861016025e-09,Amp DC,.00000001,5.5,F,F,F,F,F,F,Front,F,Main,33.9982185363770,Volt DC,100,T,2W,F,F,05/23/2022,17:41:36,.814327620
70,5.661402013857e-09,Amp DC,.00000001,5.5,F,F,F,F,F,F,Front,F,Main,34.4981994628906,Volt DC,100,T,2W,F,F,05/23/2022,17:41:37,.209157080
71,5.323414153935e-09,Amp DC,.00000001,5.5,F,F,F,F,F,F,Front,F,Main,34.9983024597168,Volt DC,100,T,2W,F,F,05/23/2022,17:41:37,.604009960
72,5.262274171969e-09,Amp DC,.00000001,5.5,F,F,F,F,F,F,Front,F,Main,35.4981880187988,Volt DC,100,T,2W,F,F,05/23/2022,17:41:37,.998875900
73,5.586363815979e-09,Amp DC,.00000001,5.5,F,F,F,F,F,F,Front,F,Main,35.9981002807617,Volt DC,100,T,2W,F,F,05/23/2022,17:41:38,.393737920
74,5.630544031021e-09,Amp DC,.00000001,5.5,F,F,F,F,F,F,Front,F,Main,36.4983787536621,Volt DC,100,T,2W,F,F,05/23/2022,17:41:38,.788614500
75,5.291878935054e-09,Amp DC,.00000001,5.5,F,F,F,F,F,F,Front,F,Main,36.9979972839355,Volt DC,100,T,2W,F,F,05/23/2022,17:41:39,.183491780
76,5.307621453454e-09,Amp DC,.00000001,5.5,F,F,F,F,F,F,Front,F,Main,37.4980621337891,Volt DC,100,T,2W,F,F,05/23/2022,17:41:39,.578328640
77,5.633036259667e-09,Amp DC,.00000001,5.5,F,F,F,F,F,F,Front,F,Main,37.9980545043945,Volt DC,100,T,2W,F,F,05/23/2022,17:41:39,.973184840
78,5.611701325847e-09,Amp DC,.00000001,5.5,F,F,F,F,F,F,Front,F,Main,38.4980773925781,Volt DC,100,T,2W,F,F,05/23/2022,17:41:40,.368046800
79,5.273202763334e-09,Amp DC,.00000001,5.5,F,F,F,F,F,F,Front,F,Main,38.9978675842285,Volt DC,100,T,2W,F,F,05/23/2022,17:41:40,.762881600
80,5.344175324495e-09,Amp DC,.00000001,5.5,F,F,F,F,F,F,Front,F,Main,39.4977226257324,Volt DC,100,T,2W,F,F,05/23/2022,17:41:41,.157736900
81,5.666012992123e-09,Amp DC,.00000001,5.5,F,F,F,F,F,F,Front,F,Main,39.9977149963379,Volt DC,100,T,2W,F,F,05/23/2022,17:41:41,.552581420
82,5.585421902765e-09,Amp DC,.00000001,5.5,F,F,F,F,F,F,Front,F,Main,40.4980201721191,Volt DC,100,T,2W,F,F,05/23/2022,17:41:41,.947443040
83,5.248957268833e-09,Amp DC,.00000001,5.5,F,F,F,F,F,F,Front,F,Main,40.9976654052734,Volt DC,100,T,2W,F,F,05/23/2022,17:41:42,.342290500
84,5.392747581823e-09,Amp DC,.00000001,5.5,F,F,F,F,F,F,Front,F,Main,41.4978790283203,Volt DC,100,T,2W,F,F,05/23/2022,17:41:42,.737128180
85,5.682024184495e-09,Amp DC,.00000001,5.5,F,F,F,F,F,F,Front,F,Main,41.9977340698242,Volt DC,100,T,2W,F,F,05/23/2022,17:41:43,.131970440
86,5.539626979356e-09,Amp DC,.00000001,5.5,F,F,F,F,F,F,Front,F,Main,42.4978141784668,Volt DC,100,T,2W,F,F,05/23/2022,17:41:43,.526818240
87,5.222660970361e-09,Amp DC,.00000001,5.5,F,F,F,F,F,F,Front,F,Main,42.9974975585938,Volt DC,100,T,2W,F,F,05/23/2022,17:41:43,.921666220
88,5.4695226126e-09,Amp DC,.00000001,5.5,F,F,F,F,F,F,Front,F,Main,43.4979057312012,Volt DC,100,T,2W,F,F,05/23/2022,17:41:44,.316513160
89,5.708973294105e-09,Amp DC,.00000001,5.5,F,F,F,F,F,F,Front,F,Main,43.9976119995117,Volt DC,100,T,2W,F,F,05/23/2022,17:41:44,.711367100
90,5.452317708432e-09,Amp DC,.00000001,5.5,F,F,F,F,F,F,Front,F,Main,44.4976196289063,Volt DC,100,T,2W,F,F,05/23/2022,17:41:45,.106233040
91,5.235636812984e-09,Amp DC,.00000001,5.5,F,F,F,F,F,F,Front,F,Main,44.9977836608887,Volt DC,100,T,2W,F,F,05/23/2022,17:41:45,.501098380
92,5.537160063795e-09,Amp DC,.00000001,5.5,F,F,F,F,F,F,Front,F,Main,45.4974975585938,Volt DC,100,T,2W,F,F,05/23/2022,17:41:45,.895951920
93,5.717935902538e-09,Amp DC,.00000001,5.5,F,F,F,F,F,F,Front,F,Main,45.9979095458984,Volt DC,100,T,2W,F,F,05/23/2022,17:41:46,.290841100
94,5.401540104089e-09,Amp DC,.00000001,5.5,F,F,F,F,F,F,Front,F,Main,46.4981651306152,Volt DC,100,T,2W,F,F,05/23/2022,17:41:46,.685718780
95,5.26313925775e-09,Amp DC,.00000001,5.5,F,F,F,F,F,F,Front,F,Main,46.9977645874023,Volt DC,100,T,2W,F,F,05/23/2022,17:41:47,.080592040
96,5.588407514523e-09,Amp DC,.00000001,5.5,F,F,F,F,F,F,Front,F,Main,47.4979896545410,Volt DC,100,T,2W,F,F,05/23/2022,17:41:47,.475440120
97,5.689492432737e-09,Amp DC,.00000001,5.5,F,F,F,F,F,F,Front,F,Main,47.9976921081543,Volt DC,100,T,2W,F,F,05/23/2022,17:41:47,.870281840
98,5.360819788081e-09,Amp DC,.00000001,5.5,F,F,F,F,F,F,Front,F,Main,48.4981040954590,Volt DC,100,T,2W,F,F,05/23/2022,17:41:48,.265152600
99,5.307877692928e-09,Amp DC,.00000001,5.5,F,F,F,F,F,F,Front,F,Main,48.9978332519531,Volt DC,100,T,2W,F,F,05/23/2022,17:41:48,.660031660
100,5.636739075499e-09,Amp DC,.00000001,5.5,F,F,F,F,F,F,Front,F,Main,49.4976806640625,Volt DC,100,T,2W,F,F,05/23/2022,17:41:49,.054889780
101,5.651198176082e-09,Amp DC,.00000001,5.5,F,F,F,F,F,F,Front,F,Main,49.9977645874023,Volt DC,100,T,2W,F,F,05/23/2022,17:41:49,.449768040
102,5.30490362749e-09,Amp DC,.00000001,5.5,F,F,F,F,F,F,Front,F,Main,50.4979095458984,Volt DC,100,T,2W,F,F,05/23/2022,17:41:49,.844658560
103,5.3574646941e-09,Amp DC,.00000001,5.5,F,F,F,F,F,F,Front,F,Main,50.9974899291992,Volt DC,100,T,2W,F,F,05/23/2022,17:41:50,.239506500
104,5.687482484973e-09,Amp DC,.00000001,5.5,F,F,F,F,F,F,Front,F,Main,51.4975814819336,Volt DC,100,T,2W,F,F,05/23/2022,17:41:50,.634376620
105,5.620300225218e-09,Amp DC,.00000001,5.5,F,F,F,F,F,F,Front,F,Main,51.9977035522461,Volt DC,100,T,2W,F,F,05/23/2022,17:41:51,.029238160
106,5.280326842438e-09,Amp DC,.00000001,5.5,F,F,F,F,F,F,Front,F,Main,52.4975624084473,Volt DC,100,T,2W,F,F,05/23/2022,17:41:51,.424095440
107,5.403136160709e-09,Amp DC,.00000001,5.5,F,F,F,F,F,F,Front,F,Main,52.9972000122070,Volt DC,100,T,2W,F,F,05/23/2022,17:41:51,.818978560
108,5.710513839574e-09,Amp DC,.00000001,5.5,F,F,F,F,F,F,Front,F,Main,53.4973182678223,Volt DC,100,T,2W,F,F,05/23/2022,17:41:52,.213859240
109,5.579381401333e-09,Amp DC,.00000001,5.5,F,F,F,F,F,F,Front,F,Main,53.9970626831055,Volt DC,100,T,2W,F,F,05/23/2022,17:41:52,.608729160
110,5.272038361426e-09,Amp DC,.00000001,5.5,F,F,F,F,F,F,Front,F,Main,54.4972496032715,Volt DC,100,T,2W,F,F,05/23/2022,17:41:53,.003573680
111,5.448629103455e-09,Amp DC,.00000001,5.5,F,F,F,F,F,F,Front,F,Main,54.9971466064453,Volt DC,100,T,2W,F,F,05/23/2022,17:41:53,.398421080
112,5.725733664974e-09,Amp DC,.00000001,5.5,F,F,F,F,F,F,Front,F,Main,55.4971275329590,Volt DC,100,T,2W,F,F,05/23/2022,17:41:53,.793294580
113,5.539194880555e-09,Amp DC,.00000001,5.5,F,F,F,F,F,F,Front,F,Main,55.9972305297852,Volt DC,100,T,2W,F,F,05/23/2022,17:41:54,.188130280
114,5.259554125558e-09,Amp DC,.00000001,5.5,F,F,F,F,F,F,Front,F,Main,56.4971618652344,Volt DC,100,T,2W,F,F,05/23/2022,17:41:54,.583006300
115,5.515765177933e-09,Amp DC,.00000001,5.5,F,F,F,F,F,F,Front,F,Main,56.9971466064453,Volt DC,100,T,2W,F,F,05/23/2022,17:41:54,.977878480
116,5.739303698959e-09,Amp DC,.00000001,5.5,F,F,F,F,F,F,Front,F,Main,57.4974021911621,Volt DC,100,T,2W,F,F,05/23/2022,17:41:55,.372750640
117,5.470840225286e-09,Amp DC,.00000001,5.5,F,F,F,F,F,F,Front,F,Main,57.9967956542969,Volt DC,100,T,2W,F,F,05/23/2022,17:41:55,.767607980
118,5.281424186876e-09,Amp DC,.00000001,5.5,F,F,F,F,F,F,Front,F,Main,58.4971237182617,Volt DC,100,T,2W,F,F,05/23/2022,17:41:56,.162468360
119,5.572359462747e-09,Amp DC,.00000001,5.5,F,F,F,F,F,F,Front,F,Main,58.9968032836914,Volt DC,100,T,2W,F,F,05/23/2022,17:41:56,.557323200
120,5.747045950244e-09,Amp DC,.00000001,5.5,F,F,F,F,F,F,Front,F,Main,59.4973716735840,Volt DC,100,T,2W,F,F,05/23/2022,17:41:56,.952184420
121,5.42947775628e-09,Amp DC,.00000001,5.5,F,F,F,F,F,F,Front,F,Main,59.9973335266113,Volt DC,100,T,2W,F,F,05/23/2022,17:41:57,.347057440
122,5.303770311826e-09,Amp DC,.00000001,5.5,F,F,F,F,F,F,Front,F,Main,60.4974403381348,Volt DC,100,T,2W,F,F,05/23/2022,17:41:57,.741931500
123,5.616984211088e-09,Amp DC,.00000001,5.5,F,F,F,F,F,F,Front,F,Main,60.9974021911621,Volt DC,100,T,2W,F,F,05/23/2022,17:41:58,.136803120
124,5.7209419424e-09,Amp DC,.00000001,5.5,F,F,F,F,F,F,Front,F,Main,61.4970817565918,Volt DC,100,T,2W,F,F,05/23/2022,17:41:58,.531674800
125,5.435939698373e-09,Amp DC,.00000001,5.5,F,F,F,F,F,F,Front,F,Main,62.0005149841309,Volt DC,100,T,2W,F,F,05/23/2022,17:41:58,.926536320
126,5.34254285256e-09,Amp DC,.00000001,5.5,F,F,F,F,F,F,Front,F,Main,62.5003738403320,Volt DC,100,T,2W,F,F,05/23/2022,17:41:59,.321398540
127,5.675790504256e-09,Amp DC,.00000001,5.5,F,F,F,F,F,F,Front,F,Main,63.0006217956543,Volt DC,100,T,2W,F,F,05/23/2022,17:41:59,.716268900
128,5.677399439463e-09,Amp DC,.00000001,5.5,F,F,F,F,F,F,Front,F,Main,63.5003890991211,Volt DC,100,T,2W,F,F,05/23/2022,17:42:00,.111106540
129,5.33778221623e-09,Amp DC,.00000001,5.5,F,F,F,F,F,F,Front,F,Main,64.0002746582031,Volt DC,100,T,2W,F,F,05/23/2022,17:42:00,.505984380
130,5.392286617223e-09,Amp DC,.00000001,5.5,F,F,F,F,F,F,Front,F,Main,64.5003128051758,Volt DC,100,T,2W,F,F,05/23/2022,17:42:00,.900840200
131,5.719586138042e-09,Amp DC,.00000001,5.5,F,F,F,F,F,F,Front,F,Main,65.0002517700195,Volt DC,100,T,2W,F,F,05/23/2022,17:42:01,.295709640
132,5.642898592839e-09,Amp DC,.00000001,5.5,F,F,F,F,F,F,Front,F,Main,65.5003433227539,Volt DC,100,T,2W,F,F,05/23/2022,17:42:01,.690540340
133,5.303722350192e-09,Amp DC,.00000001,5.5,F,F,F,F,F,F,Front,F,Main,66.0001449584961,Volt DC,100,T,2W,F,F,05/23/2022,17:42:02,.085407480
134,5.440153660885e-09,Amp DC,.00000001,5.5,F,F,F,F,F,F,Front,F,Main,66.4997863769531,Volt DC,100,T,2W,F,F,05/23/2022,17:42:02,.480249620
135,5.745986797479e-09,Amp DC,.00000001,5.5,F,F,F,F,F,F,Front,F,Main,67.0000839233398,Volt DC,100,T,2W,F,F,05/23/2022,17:42:02,.875104680
136,5.583996820491e-09,Amp DC,.00000001,5.5,F,F,F,F,F,F,Front,F,Main,67.4996490478516,Volt DC,100,T,2W,F,F,05/23/2022,17:42:03,.269975420
137,5.284956028362e-09,Amp DC,.00000001,5.5,F,F,F,F,F,F,Front,F,Main,67.9997482299805,Volt DC,100,T,2W,F,F,05/23/2022,17:42:03,.664826880
138,5.508387967978e-09,Amp DC,.00000001,5.5,F,F,F,F,F,F,Front,F,Main,68.4998245239258,Volt DC,100,T,2W,F,F,05/23/2022,17:42:04,.059705460
139,5.765626642784e-09,Amp DC,.00000001,5.5,F,F,F,F,F,F,Front,F,Main,69.0000076293945,Volt DC,100,T,2W,F,F,05/23/2022,17:42:04,.454594620
140,5.529274815785e-09,Amp DC,.00000001,5.5,F,F,F,F,F,F,Front,F,Main,69.4997253417969,Volt DC,100,T,2W,F,F,05/23/2022,17:42:04,.849470760
141,5.291702187549e-09,Amp DC,.00000001,5.5,F,F,F,F,F,F,Front,F,Main,69.9997634887695,Volt DC,100,T,2W,F,F,05/23/2022,17:42:05,.244338380
142,5.573578487628e-09,Amp DC,.00000001,5.5,F,F,F,F,F,F,Front,F,Main,70.4994125366211,Volt DC,100,T,2W,F,F,05/23/2022,17:42:05,.639199260
143,5.770399269522e-09,Amp DC,.00000001,5.5,F,F,F,F,F,F,Front,F,Main,70.9997329711914,Volt DC,100,T,2W,F,F,05/23/2022,17:42:06,.034046800
144,5.463834273911e-09,Amp DC,.00000001,5.5,F,F,F,F,F,F,Front,F,Main,71.4994277954102,Volt DC,100,T,2W,F,F,05/23/2022,17:42:06,.428892220
145,5.315322848531e-09,Amp DC,.00000001,5.5,F,F,F,F,F,F,Front,F,Main,71.9996490478516,Volt DC,100,T,2W,F,F,05/23/2022,17:42:06,.823741080
146,5.628550070469e-09,Amp DC,.00000001,5.5,F,F,F,F,F,F,Front,F,Main,72.4994964599609,Volt DC,100,T,2W,F,F,05/23/2022,17:42:07,.218576920
147,5.763246768709e-09,Amp DC,.00000001,5.5,F,F,F,F,F,F,Front,F,Main,73.0001678466797,Volt DC,100,T,2W,F,F,05/23/2022,17:42:07,.613410980
148,5.426490368166e-09,Amp DC,.00000001,5.5,F,F,F,F,F,F,Front,F,Main,73.4999542236328,Volt DC,100,T,2W,F,F,05/23/2022,17:42:08,.008298700
149,5.347160048075e-09,Amp DC,.00000001,5.5,F,F,F,F,F,F,Front,F,Main,74.0001068115234,Volt DC,100,T,2W,F,F,05/23/2022,17:42:08,.403158420
150,5.668999936148e-09,Amp DC,.00000001,5.5,F,F,F,F,F,F,Front,F,Main,74.5000305175781,Volt DC,100,T,2W,F,F,05/23/2022,17:42:08,.798009180
151,5.721450868634e-09,Amp DC,.00000001,5.5,F,F,F,F,F,F,Front,F,Main,74.9998321533203,Volt DC,100,T,2W,F,F,05/23/2022,17:42:09,.192853780
152,5.38674083117e-09,Amp DC,.00000001,5.5,F,F,F,F,F,F,Front,F,Main,75.4999313354492,Volt DC,100,T,2W,F,F,05/23/2022,17:42:09,.587712940
153,5.40550137984e-09,Amp DC,.00000001,5.5,F,F,F,F,F,F,Front,F,Main,75.9996490478516,Volt DC,100,T,2W,F,F,05/23/2022,17:42:09,.982582220
154,5.726727980715e-09,Amp DC,.00000001,5.5,F,F,F,F,F,F,Front,F,Main,76.4995574951172,Volt DC,100,T,2W,F,F,05/23/2022,17:42:10,.377425640
155,5.690381055246e-09,Amp DC,.00000001,5.5,F,F,F,F,F,F,Front,F,Main,77.0002670288086,Volt DC,100,T,2W,F,F,05/23/2022,17:42:10,.772269660
156,5.330552443894e-09,Amp DC,.00000001,5.5,F,F,F,F,F,F,Front,F,Main,77.4995193481445,Volt DC,100,T,2W,F,F,05/23/2022,17:42:11,.167130140
157,5.450792261996e-09,Amp DC,.00000001,5.5,F,F,F,F,F,F,Front,F,Main,77.9996795654297,Volt DC,100,T,2W,F,F,05/23/2022,17:42:11,.561996260
158,5.750357967571e-09,Amp DC,.00000001,5.5,F,F,F,F,F,F,Front,F,Main,78.4993133544922,Volt DC,100,T,2W,F,F,05/23/2022,17:42:11,.956869360
159,5.639894329335e-09,Amp DC,.00000001,5.5,F,F,F,F,F,F,Front,F,Main,78.9996414184570,Volt DC,100,T,2W,F,F,05/23/2022,17:42:12,.351728560
160,5.318832929646e-09,Amp DC,.00000001,5.5,F,F,F,F,F,F,Front,F,Main,79.4995803833008,Volt DC,100,T,2W,F,F,05/23/2022,17:42:12,.746596840
161,5.505470745959e-09,Amp DC,.00000001,5.5,F,F,F,F,F,F,Front,F,Main,79.9993896484375,Volt DC,100,T,2W,F,F,05/23/2022,17:42:13,.141455640
162,5.780606660011e-09,Amp DC,.00000001,5.5,F,F,F,F,F,F,Front,F,Main,80.4996871948242,Volt DC,100,T,2W,F,F,05/23/2022,17:42:13,.536334280
163,5.591403340333e-09,Amp DC,.00000001,5.5,F,F,F,F,F,F,Front,F,Main,80.9996948242188,Volt DC,100,T,2W,F,F,05/23/2022,17:42:13,.931187340
164,5.310280659643e-09,Amp DC,.00000001,5.5,F,F,F,F,F,F,Front,F,Main,81.4993438720703,Volt DC,100,T,2W,F,F,05/23/2022,17:42:14,.326030540
165,5.576191064449e-09,Amp DC,.00000001,5.5,F,F,F,F,F,F,Front,F,Main,81.9992752075195,Volt DC,100,T,2W,F,F,05/23/2022,17:42:14,.720899520
166,5.789444923465e-09,Amp DC,.00000001,5.5,F,F,F,F,F,F,Front,F,Main,82.4995193481445,Volt DC,100,T,2W,F,F,05/23/2022,17:42:15,.115760160
167,5.509641187729e-09,Amp DC,.00000001,5.5,F,F,F,F,F,F,Front,F,Main,82.9995040893555,Volt DC,100,T,2W,F,F,05/23/2022,17:42:15,.510619160
168,5.321025842164e-09,Amp DC,.00000001,5.5,F,F,F,F,F,F,Front,F,Main,83.4991073608398,Volt DC,100,T,2W,F,F,05/23/2022,17:42:15,.905480800
169,5.646148881766e-09,Amp DC,.00000001,5.5,F,F,F,F,F,F,Front,F,Main,83.9993896484375,Volt DC,100,T,2W,F,F,05/23/2022,17:42:16,.300335220
170,5.778696632319e-09,Amp DC,.00000001,5.5,F,F,F,F,F,F,Front,F,Main,84.4992446899414,Volt DC,100,T,2W,F,F,05/23/2022,17:42:16,.695198960
171,5.456836760231e-09,Amp DC,.00000001,5.5,F,F,F,F,F,F,Front,F,Main,84.9995040893555,Volt DC,100,T,2W,F,F,05/23/2022,17:42:17,.090068840
172,5.364013677678e-09,Amp DC,.00000001,5.5,F,F,F,F,F,F,Front,F,Main,85.4992675781250,Volt DC,100,T,2W,F,F,05/23/2022,17:42:17,.484908980
173,5.692437188287e-09,Amp DC,.00000001,5.5,F,F,F,F,F,F,Front,F,Main,85.9991912841797,Volt DC,100,T,2W,F,F,05/23/2022,17:42:17,.879753440
174,5.745049769246e-09,Amp DC,.00000001,5.5,F,F,F,F,F,F,Front,F,Main,86.4995498657227,Volt DC,100,T,2W,F,F,05/23/2022,17:42:18,.274615420
175,5.401017411089e-09,Amp DC,.00000001,5.5,F,F,F,F,F,F,Front,F,Main,86.9993209838867,Volt DC,100,T,2W,F,F,05/23/2022,17:42:18,.669473240
176,5.425055960018e-09,Amp DC,.00000001,5.5,F,F,F,F,F,F,Front,F,Main,87.4994583129883,Volt DC,100,T,2W,F,F,05/23/2022,17:42:19,.064339500
177,5.749902332042e-09,Amp DC,.00000001,5.5,F,F,F,F,F,F,Front,F,Main,87.9996414184570,Volt DC,100,T,2W,F,F,05/23/2022,17:42:19,.459194580
178,5.692204041452e-09,Amp DC,.00000001,5.5,F,F,F,F,F,F,Front,F,Main,88.4992218017578,Volt DC,100,T,2W,F,F,05/23/2022,17:42:19,.854055380
179,5.36357402936e-09,Amp DC,.00000001,5.5,F,F,F,F,F,F,Front,F,Main,88.9996414184570,Volt DC,100,T,2W,F,F,05/23/2022,17:42:20,.248915900
180,5.472300390608e-09,Amp DC,.00000001,5.5,F,F,F,F,F,F,Front,F,Main,89.4996032714844,Volt DC,100,T,2W,F,F,05/23/2022,17:42:20,.643784660
181,5.775520062201e-09,Amp DC,.00000001,5.5,F,F,F,F,F,F,Front,F,Main,89.9992446899414,Volt DC,100,T,2W,F,F,05/23/2022,17:42:21,.038640100
182,5.653418622131e-09,Amp DC,.00000001,5.5,F,F,F,F,F,F,Front,F,Main,90.4990844726563,Volt DC,100,T,2W,F,F,05/23/2022,17:42:21,.433516040
183,5.346251885641e-09,Amp DC,.00000001,5.5,F,F,F,F,F,F,Front,F,Main,90.9994125366211,Volt DC,100,T,2W,F,F,05/23/2022,17:42:21,.828364240
184,5.523802748542e-09,Amp DC,.00000001,5.5,F,F,F,F,F,F,Front,F,Main,91.4991836547852,Volt DC,100,T,2W,F,F,05/23/2022,17:42:22,.223236640
185,5.80020520502e-09,Amp DC,.00000001,5.5,F,F,F,F,F,F,Front,F,Main,91.9989242553711,Volt DC,100,T,2W,F,F,05/23/2022,17:42:22,.618102360
186,5.593795204817e-09,Amp DC,.00000001,5.5,F,F,F,F,F,F,Front,F,Main,92.4989547729492,Volt DC,100,T,2W,F,F,05/23/2022,17:42:23,.012941660
187,5.336982855653e-09,Amp DC,.00000001,5.5,F,F,F,F,F,F,Front,F,Main,92.9995193481445,Volt DC,100,T,2W,F,F,05/23/2022,17:42:23,.407800180
188,5.595102603451e-09,Amp DC,.00000001,5.5,F,F,F,F,F,F,Front,F,Main,93.4990005493164,Volt DC,100,T,2W,F,F,05/23/2022,17:42:23,.802651140
189,5.813983960934e-09,Amp DC,.00000001,5.5,F,F,F,F,F,F,Front,F,Main,93.9992218017578,Volt DC,100,T,2W,F,F,05/23/2022,17:42:24,.197524240
190,5.528285385026e-09,Amp DC,.00000001,5.5,F,F,F,F,F,F,Front,F,Main,94.4988174438477,Volt DC,100,T,2W,F,F,05/23/2022,17:42:24,.592355340
191,5.356708854265e-09,Amp DC,.00000001,5.5,F,F,F,F,F,F,Front,F,Main,94.9992294311523,Volt DC,100,T,2W,F,F,05/23/2022,17:42:24,.987230880
192,5.650477419294e-09,Amp DC,.00000001,5.5,F,F,F,F,F,F,Front,F,Main,95.4986343383789,Volt DC,100,T,2W,F,F,05/23/2022,17:42:25,.382069700
193,5.805727454344e-09,Amp DC,.00000001,5.5,F,F,F,F,F,F,Front,F,Main,95.9988784790039,Volt DC,100,T,2W,F,F,05/23/2022,17:42:25,.776936060
194,5.48488277019e-09,Amp DC,.00000001,5.5,F,F,F,F,F,F,Front,F,Main,96.4994125366211,Volt DC,100,T,2W,F,F,05/23/2022,17:42:26,.171789480
195,5.378585576921e-09,Amp DC,.00000001,5.5,F,F,F,F,F,F,Front,F,Main,96.9989929199219,Volt DC,100,T,2W,F,F,05/23/2022,17:42:26,.566638000
196,5.710292239058e-09,Amp DC,.00000001,5.5,F,F,F,F,F,F,Front,F,Main,97.4988937377930,Volt DC,100,T,2W,F,F,05/23/2022,17:42:26,.961488060
197,5.765784294454e-09,Amp DC,.00000001,5.5,F,F,F,F,F,F,Front,F,Main,97.9986267089844,Volt DC,100,T,2W,F,F,05/23/2022,17:42:27,.356326520
198,5.431562311031e-09,Amp DC,.00000001,5.5,F,F,F,F,F,F,Front,F,Main,98.4985351562500,Volt DC,100,T,2W,F,F,05/23/2022,17:42:27,.751168700
199,5.437504668748e-09,Amp DC,.00000001,5.5,F,F,F,F,F,F,Front,F,Main,98.9987869262695,Volt DC,100,T,2W,F,F,05/23/2022,17:42:28,.146043040
200,5.752683662763e-09,Amp DC,.00000001,5.5,F,F,F,F,F,F,Front,F,Main,99.4984130859375,Volt DC,100,T,2W,F,F,05/23/2022,17:42:28,.540890860
201,5.746387810035e-09,Amp DC,.00000001,5.5,F,F,F,F,F,F,Front,F,Main,99.9992218017578,Volt DC,100,T,2W,F,F,05/23/2022,17:42:28,.935736420
202,5.391609381178e-09,Amp DC,.00000001,5.5,F,F,F,F,F,F,Front,F,Main,100.4988708496094,Volt DC,100,T,2W,F,F,05/23/2022,17:42:29,.330598360
203,5.478303588546e-09,Amp DC,.00000001,5.5,F,F,F,F,F,F,Front,F,Main,100.9992446899414,Volt DC,100,T,2W,F,F,05/23/2022,17:42:29,.725434080
204,5.788007406693e-09,Amp DC,.00000001,5.5,F,F,F,F,F,F,Front,F,Main,101.4987869262695,Volt DC,100,T,2W,F,F,05/23/2022,17:42:30,.120317520
205,5.6982809582e-09,Amp DC,.00000001,5.5,F,F,F,F,F,F,Front,F,Main,101.9990692138672,Volt DC,100,T,2W,F,F,05/23/2022,17:42:30,.515152680
206,5.366650235317e-09,Amp DC,.00000001,5.5,F,F,F,F,F,F,Front,F,Main,102.4986038208008,Volt DC,100,T,2W,F,F,05/23/2022,17:42:30,.910020020
207,5.534787739236e-09,Amp DC,.00000001,5.5,F,F,F,F,F,F,Front,F,Main,102.9987869262695,Volt DC,100,T,2W,F,F,05/23/2022,17:42:31,.304847160
208,5.810143921536e-09,Amp DC,.00000001,5.5,F,F,F,F,F,F,Front,F,Main,103.4987030029297,Volt DC,100,T,2W,F,F,05/23/2022,17:42:31,.699718640
209,5.645953482514e-09,Amp DC,.00000001,5.5,F,F,F,F,F,F,Front,F,Main,103.9984741210938,Volt DC,100,T,2W,F,F,05/23/2022,17:42:32,.094553220
210,5.356021848257e-09,Amp DC,.00000001,5.5,F,F,F,F,F,F,Front,F,Main,104.4987564086914,Volt DC,100,T,2W,F,F,05/23/2022,17:42:32,.489398260
211,5.58417134755e-09,Amp DC,.00000001,5.5,F,F,F,F,F,F,Front,F,Main,104.9990539550781,Volt DC,100,T,2W,F,F,05/23/2022,17:42:32,.884251120
212,5.821801263295e-09,Amp DC,.00000001,5.5,F,F,F,F,F,F,Front,F,Main,105.4985733032227,Volt DC,100,T,2W,F,F,05/23/2022,17:42:33,.279099880
213,5.606431763283e-09,Amp DC,.00000001,5.5,F,F,F,F,F,F,Front,F,Main,105.9986190795898,Volt DC,100,T,2W,F,F,05/23/2022,17:42:33,.673979740
214,5.352016163584e-09,Amp DC,.00000001,5.5,F,F,F,F,F,F,Front,F,Main,106.4982757568359,Volt DC,100,T,2W,F,F,05/23/2022,17:42:34,.068829360
215,5.618859599821e-09,Amp DC,.00000001,5.5,F,F,F,F,F,F,Front,F,Main,106.9985656738281,Volt DC,100,T,2W,F,F,05/23/2022,17:42:34,.463695900
216,5.829829508031e-09,Amp DC,.00000001,5.5,F,F,F,F,F,F,Front,F,Main,107.4982604980469,Volt DC,100,T,2W,F,F,05/23/2022,17:42:34,.858564780
217,5.567453165156e-09,Amp DC,.00000001,5.5,F,F,F,F,F,F,Front,F,Main,107.9982833862305,Volt DC,100,T,2W,F,F,05/23/2022,17:42:35,.253443560
218,5.36398969686e-09,Amp DC,.00000001,5.5,F,F,F,F,F,F,Front,F,Main,108.4981765747070,Volt DC,100,T,2W,F,F,05/23/2022,17:42:35,.648306180
219,5.656934032316e-09,Amp DC,.00000001,5.5,F,F,F,F,F,F,Front,F,Main,108.9984436035156,Volt DC,100,T,2W,F,F,05/23/2022,17:42:36,.043189040
220,5.829352556219e-09,Amp DC,.00000001,5.5,F,F,F,F,F,F,Front,F,Main,109.4980468750000,Volt DC,100,T,2W,F,F,05/23/2022,17:42:36,.438037640
221,5.549397830151e-09,Amp DC,.00000001,5.5,F,F,F,F,F,F,Front,F,Main,109.9983139038086,Volt DC,100,T,2W,F,F,05/23/2022,17:42:36,.832892620
222,5.379059864197e-09,Amp DC,.00000001,5.5,F,F,F,F,F,F,Front,F,Main,110.4980239868164,Volt DC,100,T,2W,F,F,05/23/2022,17:42:37,.227767540
223,5.683037596071e-09,Amp DC,.00000001,5.5,F,F,F,F,F,F,Front,F,Main,110.9982757568359,Volt DC,100,T,2W,F,F,05/23/2022,17:42:37,.622656140
224,5.830477434188e-09,Amp DC,.00000001,5.5,F,F,F,F,F,F,Front,F,Main,111.4978485107422,Volt DC,100,T,2W,F,F,05/23/2022,17:42:38,.017505580
225,5.535223834841e-09,Amp DC,.00000001,5.5,F,F,F,F,F,F,Front,F,Main,111.9977951049805,Volt DC,100,T,2W,F,F,05/23/2022,17:42:38,.412369820
226,5.381826984063e-09,Amp DC,.00000001,5.5,F,F,F,F,F,F,Front,F,Main,112.4977493286133,Volt DC,100,T,2W,F,F,05/23/2022,17:42:38,.807222980
227,5.700238947526e-09,Amp DC,.00000001,5.5,F,F,F,F,F,F,Front,F,Main,112.9983291625977,Volt DC,100,T,2W,F,F,05/23/2022,17:42:39,.202090620
228,5.845734118992e-09,Amp DC,.00000001,5.5,F,F,F,F,F,F,Front,F,Main,113.4986114501953,Volt DC,100,T,2W,F,F,05/23/2022,17:42:39,.596969740
229,5.519619428185e-09,Amp DC,.00000001,5.5,F,F,F,F,F,F,Front,F,Main,113.9981765747070,Volt DC,100,T,2W,F,F,05/23/2022,17:42:39,.991799760
230,5.39704281266e-09,Amp DC,.00000001,5.5,F,F,F,F,F,F,Front,F,Main,114.4984664916992,Volt DC,100,T,2W,F,F,05/23/2022,17:42:40,.386690180
231,5.70616576212e-09,Amp DC,.00000001,5.5,F,F,F,F,F,F,Front,F,Main,114.9983062744141,Volt DC,100,T,2W,F,F,05/23/2022,17:42:40,.781572920
232,5.830717242361e-09,Amp DC,.00000001,5.5,F,F,F,F,F,F,Front,F,Main,115.4979782104492,Volt DC,100,T,2W,F,F,05/23/2022,17:42:41,.176437100
233,5.522307944261e-09,Amp DC,.00000001,5.5,F,F,F,F,F,F,Front,F,Main,115.9986114501953,Volt DC,100,T,2W,F,F,05/23/2022,17:42:41,.571297000
234,5.39268185662e-09,Amp DC,.00000001,5.5,F,F,F,F,F,F,Front,F,Main,116.4978179931641,Volt DC,100,T,2W,F,F,05/23/2022,17:42:41,.966148200
235,5.728747698441e-09,Amp DC,.00000001,5.5,F,F,F,F,F,F,Front,F,Main,116.9986114501953,Volt DC,100,T,2W,F,F,05/23/2022,17:42:42,.361017980
236,5.823320492482e-09,Amp DC,.00000001,5.5,F,F,F,F,F,F,Front,F,Main,117.4977111816406,Volt DC,100,T,2W,F,F,05/23/2022,17:42:42,.755897980
237,5.517877710304e-09,Amp DC,.00000001,5.5,F,F,F,F,F,F,Front,F,Main,117.9981765747070,Volt DC,100,T,2W,F,F,05/23/2022,17:42:43,.150797160
238,5.405043967954e-09,Amp DC,.00000001,5.5,F,F,F,F,F,F,Front,F,Main,118.4980010986328,Volt DC,100,T,2W,F,F,05/23/2022,17:42:43,.545661540
239,5.726110252624e-09,Amp DC,.00000001,5.5,F,F,F,F,F,F,Front,F,Main,118.9980087280273,Volt DC,100,T,2W,F,F,05/23/2022,17:42:43,.940514620
240,5.831466864947e-09,Amp DC,.00000001,5.5,F,F,F,F,F,F,Front,F,Main,119.4979248046875,Volt DC,100,T,2W,F,F,05/23/2022,17:42:44,.335411400
241,5.515246037646e-09,Amp DC,.00000001,5.5,F,F,F,F,F,F,Front,F,Main,119.9979553222656,Volt DC,100,T,2W,F,F,05/23/2022,17:42:44,.730283080
242,5.411896708551e-09,Amp DC,.00000001,5.5,F,F,F,F,F,F,Front,F,Main,120.4975967407227,Volt DC,100,T,2W,F,F,05/23/2022,17:42:45,.125180760
243,5.7370383999e-09,Amp DC,.00000001,5.5,F,F,F,F,F,F,Front,F,Main,120.9978408813477,Volt DC,100,T,2W,F,F,05/23/2022,17:42:45,.520045140
244,5.833097116437e-09,Amp DC,.00000001,5.5,F,F,F,F,F,F,Front,F,Main,121.4980316162109,Volt DC,100,T,2W,F,F,05/23/2022,17:42:45,.914902980
245,5.500599531416e-09,Amp DC,.00000001,5.5,F,F,F,F,F,F,Front,F,Main,121.9976577758789,Volt DC,100,T,2W,F,F,05/23/2022,17:42:46,.309754420
246,5.418958615167e-09,Amp DC,.00000001,5.5,F,F,F,F,F,F,Front,F,Main,122.4971847534180,Volt DC,100,T,2W,F,F,05/23/2022,17:42:46,.704653420
247,5.752621490274e-09,Amp DC,.00000001,5.5,F,F,F,F,F,F,Front,F,Main,122.9975509643555,Volt DC,100,T,2W,F,F,05/23/2022,17:42:47,.099536940
248,5.822983428772e-09,Amp DC,.00000001,5.5,F,F,F,F,F,F,Front,F,Main,123.4972915649414,Volt DC,100,T,2W,F,F,05/23/2022,17:42:47,.494422780
249,5.506814115819e-09,Amp DC,.00000001,5.5,F,F,F,F,F,F,Front,F,Main,123.9974136352539,Volt DC,100,T,2W,F,F,05/23/2022,17:42:47,.889303340
250,5.43462608249e-09,Amp DC,.00000001,5.5,F,F,F,F,F,F,Front,F,Main,124.4973144531250,Volt DC,100,T,2W,F,F,05/23/2022,17:42:48,.284185660
251,5.754220655518e-09,Amp DC,.00000001,5.5,F,F,F,F,F,F,Front,F,Main,124.9976959228516,Volt DC,100,T,2W,F,F,05/23/2022,17:42:48,.679077220
252,5.823296955754e-09,Amp DC,.00000001,5.5,F,F,F,F,F,F,Front,F,Main,125.4972381591797,Volt DC,100,T,2W,F,F,05/23/2022,17:42:49,.073959020
253,5.507051703546e-09,Amp DC,.00000001,5.5,F,F,F,F,F,F,Front,F,Main,125.9969024658203,Volt DC,100,T,2W,F,F,05/23/2022,17:42:49,.468831520
254,5.440182526684e-09,Amp DC,.00000001,5.5,F,F,F,F,F,F,Front,F,Main,126.4969253540039,Volt DC,100,T,2W,F,F,05/23/2022,17:42:49,.863728760
255,5.762406551924e-09,Amp DC,.00000001,5.5,F,F,F,F,F,F,Front,F,Main,126.9977493286133,Volt DC,100,T,2W,F,F,05/23/2022,17:42:50,.258593480
256,5.824554616396e-09,Amp DC,.00000001,5.5,F,F,F,F,F,F,Front,F,Main,127.4971771240234,Volt DC,100,T,2W,F,F,05/23/2022,17:42:50,.653476860
257,5.50839285296e-09,Amp DC,.00000001,5.5,F,F,F,F,F,F,Front,F,Main,127.9974441528320,Volt DC,100,T,2W,F,F,05/23/2022,17:42:51,.048340560
258,5.455198515136e-09,Amp DC,.00000001,5.5,F,F,F,F,F,F,Front,F,Main,128.4974822998047,Volt DC,100,T,2W,F,F,05/23/2022,17:42:51,.443188420
259,5.767935018497e-09,Amp DC,.00000001,5.5,F,F,F,F,F,F,Front,F,Main,128.9975433349609,Volt DC,100,T,2W,F,F,05/23/2022,17:42:51,.838081420
260,5.820385062805e-09,Amp DC,.00000001,5.5,F,F,F,F,F,F,Front,F,Main,129.4972686767578,Volt DC,100,T,2W,F,F,05/23/2022,17:42:52,.232960340
261,5.499137589737e-09,Amp DC,.00000001,5.5,F,F,F,F,F,F,Front,F,Main,129.9973907470703,Volt DC,100,T,2W,F,F,05/23/2022,17:42:52,.627848000
262,5.457689411514e-09,Amp DC,.00000001,5.5,F,F,F,F,F,F,Front,F,Main,130.4974060058594,Volt DC,100,T,2W,F,F,05/23/2022,17:42:53,.022725520
263,5.784562162603e-09,Amp DC,.00000001,5.5,F,F,F,F,F,F,Front,F,Main,130.9972686767578,Volt DC,100,T,2W,F,F,05/23/2022,17:42:53,.417598240
264,5.810015579755e-09,Amp DC,.00000001,5.5,F,F,F,F,F,F,Front,F,Main,131.4970092773438,Volt DC,100,T,2W,F,F,05/23/2022,17:42:53,.812483640
265,5.484800169597e-09,Amp DC,.00000001,5.5,F,F,F,F,F,F,Front,F,Main,131.9975128173828,Volt DC,100,T,2W,F,F,05/23/2022,17:42:54,.207367660
266,5.490286003607e-09,Amp DC,.00000001,5.5,F,F,F,F,F,F,Front,F,Main,132.4971160888672,Volt DC,100,T,2W,F,F,05/23/2022,17:42:54,.602265540
267,5.823706406005e-09,Amp DC,.00000001,5.5,F,F,F,F,F,F,Front,F,Main,132.9976654052734,Volt DC,100,T,2W,F,F,05/23/2022,17:42:54,.997161360
268,5.801673808037e-09,Amp DC,.00000001,5.5,F,F,F,F,F,F,Front,F,Main,133.4968719482422,Volt DC,100,T,2W,F,F,05/23/2022,17:42:55,.392059540
269,5.46069900409e-09,Amp DC,.00000001,5.5,F,F,F,F,F,F,Front,F,Main,133.9972839355469,Volt DC,100,T,2W,F,F,05/23/2022,17:42:55,.786969200
270,5.497199584426e-09,Amp DC,.00000001,5.5,F,F,F,F,F,F,Front,F,Main,134.4963378906250,Volt DC,100,T,2W,F,F,05/23/2022,17:42:56,.181863680
271,5.84260462233e-09,Amp DC,.00000001,5.5,F,F,F,F,F,F,Front,F,Main,134.9969482421875,Volt DC,100,T,2W,F,F,05/23/2022,17:42:56,.576748800
272,5.780218081952e-09,Amp DC,.00000001,5.5,F,F,F,F,F,F,Front,F,Main,135.4971160888672,Volt DC,100,T,2W,F,F,05/23/2022,17:42:56,.971646360
273,5.434549255057e-09,Amp DC,.00000001,5.5,F,F,F,F,F,F,Front,F,Main,135.9965057373047,Volt DC,100,T,2W,F,F,05/23/2022,17:42:57,.366540460
274,5.552005521992e-09,Amp DC,.00000001,5.5,F,F,F,F,F,F,Front,F,Main,136.4967651367188,Volt DC,100,T,2W,F,F,05/23/2022,17:42:57,.761416900
275,5.854025708629e-09,Amp DC,.00000001,5.5,F,F,F,F,F,F,Front,F,Main,136.9969482421875,Volt DC,100,T,2W,F,F,05/23/2022,17:42:58,.156303840
276,5.735449004618e-09,Amp DC,.00000001,5.5,F,F,F,F,F,F,Front,F,Main,137.4967193603516,Volt DC,100,T,2W,F,F,05/23/2022,17:42:58,.551140600
277,5.417515769324e-09,Amp DC,.00000001,5.5,F,F,F,F,F,F,Front,F,Main,137.9966125488281,Volt DC,100,T,2W,F,F,05/23/2022,17:42:58,.946044200
278,5.591718643672e-09,Amp DC,.00000001,5.5,F,F,F,F,F,F,Front,F,Main,138.4963378906250,Volt DC,100,T,2W,F,F,05/23/2022,17:42:59,.340948120
279,5.874192243738e-09,Amp DC,.00000001,5.5,F,F,F,F,F,F,Front,F,Main,138.9966888427734,Volt DC,100,T,2W,F,F,05/23/2022,17:42:59,.735832880
280,5.683561621339e-09,Amp DC,.00000001,5.5,F,F,F,F,F,F,Front,F,Main,139.4962158203125,Volt DC,100,T,2W,F,F,05/23/2022,17:43:00,.130725860
281,5.409697578784e-09,Amp DC,.00000001,5.5,F,F,F,F,F,F,Front,F,Main,139.9962921142578,Volt DC,100,T,2W,F,F,05/23/2022,17:43:00,.525576240
282,5.648204126629e-09,Amp DC,.00000001,5.5,F,F,F,F,F,F,Front,F,Main,140.4963684082031,Volt DC,100,T,2W,F,F,05/23/2022,17:43:00,.920470640
283,5.90700777181e-09,Amp DC,.00000001,5.5,F,F,F,F,F,F,Front,F,Main,140.9973602294922,Volt DC,100,T,2W,F,F,05/23/2022,17:43:01,.315357800
284,5.623261856158e-09,Amp DC,.00000001,5.5,F,F,F,F,F,F,Front,F,Main,141.4967041015625,Volt DC,100,T,2W,F,F,05/23/2022,17:43:01,.710234840
285,5.412044590258e-09,Amp DC,.00000001,5.5,F,F,F,F,F,F,Front,F,Main,141.9966430664063,Volt DC,100,T,2W,F,F,05/23/2022,17:43:02,.105136240
286,5.702233352167e-09,Amp DC,.00000001,5.5,F,F,F,F,F,F,Front,F,Main,142.4965209960938,Volt DC,100,T,2W,F,F,05/23/2022,17:43:02,.500007260
287,5.99506133625e-09,Amp DC,.00000001,5.5,F,F,F,F,F,F,Front,F,Main,142.9967346191406,Volt DC,100,T,2W,F,F,05/23/2022,17:43:02,.894894180
288,5.560719440467e-09,Amp DC,.00000001,5.5,F,F,F,F,F,F,Front,F,Main,143.4966278076172,Volt DC,100,T,2W,F,F,05/23/2022,17:43:03,.289799980
289,5.441957995345e-09,Amp DC,.00000001,5.5,F,F,F,F,F,F,Front,F,Main,143.9970550537109,Volt DC,100,T,2W,F,F,05/23/2022,17:43:03,.684673660
290,5.737974539954e-09,Amp DC,.00000001,5.5,F,F,F,F,F,F,Front,F,Main,144.4964752197266,Volt DC,100,T,2W,F,F,05/23/2022,17:43:04,.079562460
291,5.874822406327e-09,Amp DC,.00000001,5.5,F,F,F,F,F,F,Front,F,Main,144.9970245361328,Volt DC,100,T,2W,F,F,05/23/2022,17:43:04,.474431700
292,5.552331039382e-09,Amp DC,.00000001,5.5,F,F,F,F,F,F,Front,F,Main,145.4963226318359,Volt DC,100,T,2W,F,F,05/23/2022,17:43:04,.869288740
293,5.463682395401e-09,Amp DC,.00000001,5.5,F,F,F,F,F,F,Front,F,Main,145.9962310791016,Volt DC,100,T,2W,F,F,05/23/2022,17:43:05,.264178360
294,5.790708801356e-09,Amp DC,.00000001,5.5,F,F,F,F,F,F,Front,F,Main,146.4965972900391,Volt DC,100,T,2W,F,F,05/23/2022,17:43:05,.659069940
295,5.849791762103e-09,Amp DC,.00000001,5.5,F,F,F,F,F,F,Front,F,Main,146.9964447021484,Volt DC,100,T,2W,F,F,05/23/2022,17:43:06,.053943240
296,5.52194334702e-09,Amp DC,.00000001,5.5,F,F,F,F,F,F,Front,F,Main,147.4960937500000,Volt DC,100,T,2W,F,F,05/23/2022,17:43:06,.448835640
297,5.495811805645e-09,Amp DC,.00000001,5.5,F,F,F,F,F,F,Front,F,Main,147.9961853027344,Volt DC,100,T,2W,F,F,05/23/2022,17:43:06,.843721220
298,5.814250858549e-09,Amp DC,.00000001,5.5,F,F,F,F,F,F,Front,F,Main,148.4959106445313,Volt DC,100,T,2W,F,F,05/23/2022,17:43:07,.238595380
299,5.836805261339e-09,Amp DC,.00000001,5.5,F,F,F,F,F,F,Front,F,Main,148.9966583251953,Volt DC,100,T,2W,F,F,05/23/2022,17:43:07,.633483500
300,5.492454935307e-09,Amp DC,.00000001,5.5,F,F,F,F,F,F,Front,F,Main,149.4958343505859,Volt DC,100,T,2W,F,F,05/23/2022,17:43:08,.028350340
301,5.529917856961e-09,Amp DC,.00000001,5.5,F,F,F,F,F,F,Front,F,Main,149.9963073730469,Volt DC,100,T,2W,F,F,05/23/2022,17:43:08,.423239640
302,5.842984318605e-09,Amp DC,.00000001,5.5,F,F,F,F,F,F,Front,F,Main,150.4958038330078,Volt DC,100,T,2W,F,F,05/23/2022,17:43:08,.818127480
303,5.815984582824e-09,Amp DC,.00000001,5.5,F,F,F,F,F,F,Front,F,Main,150.9959716796875,Volt DC,100,T,2W,F,F,05/23/2022,17:43:09,.213002640
304,5.464495078655e-09,Amp DC,.00000001,5.5,F,F,F,F,F,F,Front,F,Main,151.4957733154297,Volt DC,100,T,2W,F,F,05/23/2022,17:43:09,.607896120
305,5.547029946484e-09,Amp DC,.00000001,5.5,F,F,F,F,F,F,Front,F,Main,151.9961090087891,Volt DC,100,T,2W,F,F,05/23/2022,17:43:10,.002778780
306,5.863565633035e-09,Amp DC,.00000001,5.5,F,F,F,F,F,F,Front,F,Main,152.4960479736328,Volt DC,100,T,2W,F,F,05/23/2022,17:43:10,.397663620
307,5.834712268893e-09,Amp DC,.00000001,5.5,F,F,F,F,F,F,Front,F,Main,152.9986267089844,Volt DC,100,T,2W,F,F,05/23/2022,17:43:10,.792533000
308,5.477575726331e-09,Amp DC,.00000001,5.5,F,F,F,F,F,F,Front,F,Main,153.4996948242188,Volt DC,100,T,2W,F,F,05/23/2022,17:43:11,.187396640
309,5.549321002718e-09,Amp DC,.00000001,5.5,F,F,F,F,F,F,Front,F,Main,153.9988708496094,Volt DC,100,T,2W,F,F,05/23/2022,17:43:11,.582256680
310,5.884115861221e-09,Amp DC,.00000001,5.5,F,F,F,F,F,F,Front,F,Main,154.4995727539063,Volt DC,100,T,2W,F,F,05/23/2022,17:43:11,.977152440
311,5.795207869141e-09,Amp DC,.00000001,5.5,F,F,F,F,F,F,Front,F,Main,154.9996643066406,Volt DC,100,T,2W,F,F,05/23/2022,17:43:12,.372041700
312,5.334309438609e-09,Amp DC,.00000001,5.5,F,F,F,F,F,F,Front,F,Main,155.4995727539063,Volt DC,100,T,2W,F,F,05/23/2022,17:43:12,.766952500
313,5.555222948317e-09,Amp DC,.00000001,5.5,F,F,F,F,F,F,Front,F,Main,155.9991760253906,Volt DC,100,T,2W,F,F,05/23/2022,17:43:13,.161834120
314,5.863308505383e-09,Amp DC,.00000001,5.5,F,F,F,F,F,F,Front,F,Main,156.4990539550781,Volt DC,100,T,2W,F,F,05/23/2022,17:43:13,.556707880
315,5.781244816205e-09,Amp DC,.00000001,5.5,F,F,F,F,F,F,Front,F,Main,156.9992523193359,Volt DC,100,T,2W,F,F,05/23/2022,17:43:13,.951569680
316,5.462937213707e-09,Amp DC,.00000001,5.5,F,F,F,F,F,F,Front,F,Main,157.5000305175781,Volt DC,100,T,2W,F,F,05/23/2022,17:43:14,.346446520
317,5.57975932125e-09,Amp DC,.00000001,5.5,F,F,F,F,F,F,Front,F,Main,157.9991912841797,Volt DC,100,T,2W,F,F,05/23/2022,17:43:14,.741344960
318,5.890432142053e-09,Amp DC,.00000001,5.5,F,F,F,F,F,F,Front,F,Main,158.4992218017578,Volt DC,100,T,2W,F,F,05/23/2022,17:43:15,.136232240
319,5.775608435954e-09,Amp DC,.00000001,5.5,F,F,F,F,F,F,Front,F,Main,158.9992065429688,Volt DC,100,T,2W,F,F,05/23/2022,17:43:15,.531122140
320,5.45439826638e-09,Amp DC,.00000001,5.5,F,F,F,F,F,F,Front,F,Main,159.4990997314453,Volt DC,100,T,2W,F,F,05/23/2022,17:43:15,.925976160
321,5.599922303645e-09,Amp DC,.00000001,5.5,F,F,F,F,F,F,Front,F,Main,159.9988403320313,Volt DC,100,T,2W,F,F,05/23/2022,17:43:16,.320851840
322,5.904494670972e-09,Amp DC,.00000001,5.5,F,F,F,F,F,F,Front,F,Main,160.4994506835938,Volt DC,100,T,2W,F,F,05/23/2022,17:43:16,.715709080
323,5.769997812877e-09,Amp DC,.00000001,5.5,F,F,F,F,F,F,Front,F,Main,160.9994049072266,Volt DC,100,T,2W,F,F,05/23/2022,17:43:17,.110588500
324,5.458494101163e-09,Amp DC,.00000001,5.5,F,F,F,F,F,F,Front,F,Main,161.4994659423828,Volt DC,100,T,2W,F,F,05/23/2022,17:43:17,.505480020
325,5.604885000565e-09,Amp DC,.00000001,5.5,F,F,F,F,F,F,Front,F,Main,161.9989013671875,Volt DC,100,T,2W,F,F,05/23/2022,17:43:17,.900367780
326,5.901279909182e-09,Amp DC,.00000001,5.5,F,F,F,F,F,F,Front,F,Main,162.4992523193359,Volt DC,100,T,2W,F,F,05/23/2022,17:43:18,.295253300
327,5.757444299093e-09,Amp DC,.00000001,5.5,F,F,F,F,F,F,Front,F,Main,162.9987487792969,Volt DC,100,T,2W,F,F,05/23/2022,17:43:18,.690126700
328,5.460054630646e-09,Amp DC,.00000001,5.5,F,F,F,F,F,F,Front,F,Main,163.4991760253906,Volt DC,100,T,2W,F,F,05/23/2022,17:43:19,.084993560
329,5.614336995308e-09,Amp DC,.00000001,5.5,F,F,F,F,F,F,Front,F,Main,163.9986267089844,Volt DC,100,T,2W,F,F,05/23/2022,17:43:19,.479881320
330,5.911502842793e-09,Amp DC,.00000001,5.5,F,F,F,F,F,F,Front,F,Main,164.4989166259766,Volt DC,100,T,2W,F,F,05/23/2022,17:43:19,.874733960
331,5.753660659025e-09,Amp DC,.00000001,5.5,F,F,F,F,F,F,Front,F,Main,164.9984130859375,Volt DC,100,T,2W,F,F,05/23/2022,17:43:20,.269607060
332,5.459195318025e-09,Amp DC,.00000001,5.5,F,F,F,F,F,F,Front,F,Main,165.4989318847656,Volt DC,100,T,2W,F,F,05/23/2022,17:43:20,.664485560
333,5.633832955709e-09,Amp DC,.00000001,5.5,F,F,F,F,F,F,Front,F,Main,165.9994201660156,Volt DC,100,T,2W,F,F,05/23/2022,17:43:21,.059366800
334,5.896877208755e-09,Amp DC,.00000001,5.5,F,F,F,F,F,F,Front,F,Main,166.4982910156250,Volt DC,100,T,2W,F,F,05/23/2022,17:43:21,.454244900
335,5.753432397171e-09,Amp DC,.00000001,5.5,F,F,F,F,F,F,Front,F,Main,166.9986267089844,Volt DC,100,T,2W,F,F,05/23/2022,17:43:21,.849141560
336,5.468214325788e-09,Amp DC,.00000001,5.5,F,F,F,F,F,F,Front,F,Main,167.4989929199219,Volt DC,100,T,2W,F,F,05/23/2022,17:43:22,.244038060
337,5.637306621509e-09,Amp DC,.00000001,5.5,F,F,F,F,F,F,Front,F,Main,167.9989624023438,Volt DC,100,T,2W,F,F,05/23/2022,17:43:22,.638899840
338,5.91969318009e-09,Amp DC,.00000001,5.5,F,F,F,F,F,F,Front,F,Main,168.4990844726563,Volt DC,100,T,2W,F,F,05/23/2022,17:43:23,.033763720
339,5.745683040459e-09,Amp DC,.00000001,5.5,F,F,F,F,F,F,Front,F,Main,168.9987487792969,Volt DC,100,T,2W,F,F,05/23/2022,17:43:23,.428653280
340,5.467053032504e-09,Amp DC,.00000001,5.5,F,F,F,F,F,F,Front,F,Main,169.4996337890625,Volt DC,100,T,2W,F,F,05/23/2022,17:43:23,.823528680
341,5.6386939562e-09,Amp DC,.00000001,5.5,F,F,F,F,F,F,Front,F,Main,169.9986267089844,Volt DC,100,T,2W,F,F,05/23/2022,17:43:24,.218420060
342,5.926075630214e-09,Amp DC,.00000001,5.5,F,F,F,F,F,F,Front,F,Main,170.4987335205078,Volt DC,100,T,2W,F,F,05/23/2022,17:43:24,.613280560
343,5.740526720643e-09,Amp DC,.00000001,5.5,F,F,F,F,F,F,Front,F,Main,170.9986419677734,Volt DC,100,T,2W,F,F,05/23/2022,17:43:25,.008170340
344,5.462715613191e-09,Amp DC,.00000001,5.5,F,F,F,F,F,F,Front,F,Main,171.4993286132813,Volt DC,100,T,2W,F,F,05/23/2022,17:43:25,.403051040
345,5.664285041007e-09,Amp DC,.00000001,5.5,F,F,F,F,F,F,Front,F,Main,171.9985198974609,Volt DC,100,T,2W,F,F,05/23/2022,17:43:25,.797940720
346,5.92916915565e-09,Amp DC,.00000001,5.5,F,F,F,F,F,F,Front,F,Main,172.4984130859375,Volt DC,100,T,2W,F,F,05/23/2022,17:43:26,.192822700
347,5.727448293413e-09,Amp DC,.00000001,5.5,F,F,F,F,F,F,Front,F,Main,172.9987030029297,Volt DC,100,T,2W,F,F,05/23/2022,17:43:26,.587676500
348,5.452958973251e-09,Amp DC,.00000001,5.5,F,F,F,F,F,F,Front,F,Main,173.4986877441406,Volt DC,100,T,2W,F,F,05/23/2022,17:43:26,.982547300
349,5.697569527285e-09,Amp DC,.00000001,5.5,F,F,F,F,F,F,Front,F,Main,173.9986114501953,Volt DC,100,T,2W,F,F,05/23/2022,17:43:27,.377396360
350,5.942455860719e-09,Amp DC,.00000001,5.5,F,F,F,F,F,F,Front,F,Main,174.4990844726563,Volt DC,100,T,2W,F,F,05/23/2022,17:43:27,.772281940
351,5.673042480225e-09,Amp DC,.00000001,5.5,F,F,F,F,F,F,Front,F,Main,174.9983673095703,Volt DC,100,T,2W,F,F,05/23/2022,17:43:28,.167169040
352,5.470845110267e-09,Amp DC,.00000001,5.5,F,F,F,F,F,F,Front,F,Main,175.4987030029297,Volt DC,100,T,2W,F,F,05/23/2022,17:43:28,.562032320
353,5.73763436762e-09,Amp DC,.00000001,5.5,F,F,F,F,F,F,Front,F,Main,175.9980316162109,Volt DC,100,T,2W,F,F,05/23/2022,17:43:28,.956934080
354,5.941625413897e-09,Amp DC,.00000001,5.5,F,F,F,F,F,F,Front,F,Main,176.4983520507813,Volt DC,100,T,2W,F,F,05/23/2022,17:43:29,.351805720
355,5.650939716162e-09,Amp DC,.00000001,5.5,F,F,F,F,F,F,Front,F,Main,176.9983367919922,Volt DC,100,T,2W,F,F,05/23/2022,17:43:29,.746696160
356,5.480646159128e-09,Amp DC,.00000001,5.5,F,F,F,F,F,F,Front,F,Main,177.4987640380859,Volt DC,100,T,2W,F,F,05/23/2022,17:43:30,.141575140
357,5.776621403442e-09,Amp DC,.00000001,5.5,F,F,F,F,F,F,Front,F,Main,177.9981994628906,Volt DC,100,T,2W,F,F,05/23/2022,17:43:30,.536436180
358,5.928894264429e-09,Amp DC,.00000001,5.5,F,F,F,F,F,F,Front,F,Main,178.4985046386719,Volt DC,100,T,2W,F,F,05/23/2022,17:43:30,.931314660
359,5.595202967612e-09,Amp DC,.00000001,5.5,F,F,F,F,F,F,Front,F,Main,178.9978179931641,Volt DC,100,T,2W,F,F,05/23/2022,17:43:31,.326204300
360,5.516034740083e-09,Amp DC,.00000001,5.5,F,F,F,F,F,F,Front,F,Main,179.4985198974609,Volt DC,100,T,2W,F,F,05/23/2022,17:43:31,.721092140
361,5.827718307927e-09,Amp DC,.00000001,5.5,F,F,F,F,F,F,Front,F,Main,179.9979248046875,Volt DC,100,T,2W,F,F,05/23/2022,17:43:32,.115972400
362,5.895592014582e-09,Amp DC,.00000001,5.5,F,F,F,F,F,F,Front,F,Main,180.4981384277344,Volt DC,100,T,2W,F,F,05/23/2022,17:43:32,.510837100
363,5.557515336818e-09,Amp DC,.00000001,5.5,F,F,F,F,F,F,Front,F,Main,180.9981079101563,Volt DC,100,T,2W,F,F,05/23/2022,17:43:32,.905725500
364,5.572352357319e-09,Amp DC,.00000001,5.5,F,F,F,F,F,F,Front,F,Main,181.4990081787109,Volt DC,100,T,2W,F,F,05/23/2022,17:43:33,.300591560
365,5.884188691851e-09,Amp DC,.00000001,5.5,F,F,F,F,F,F,Front,F,Main,181.9985656738281,Volt DC,100,T,2W,F,F,05/23/2022,17:43:33,.695475400
366,5.844827732915e-09,Amp DC,.00000001,5.5,F,F,F,F,F,F,Front,F,Main,182.4985351562500,Volt DC,100,T,2W,F,F,05/23/2022,17:43:34,.090331040
367,5.505420119789e-09,Amp DC,.00000001,5.5,F,F,F,F,F,F,Front,F,Main,182.9985198974609,Volt DC,100,T,2W,F,F,05/23/2022,17:43:34,.485217720
368,5.617995402218e-09,Amp DC,.00000001,5.5,F,F,F,F,F,F,Front,F,Main,183.4982604980469,Volt DC,100,T,2W,F,F,05/23/2022,17:43:34,.880099580
369,5.921201751136e-09,Amp DC,.00000001,5.5,F,F,F,F,F,F,Front,F,Main,183.9982147216797,Volt DC,100,T,2W,F,F,05/23/2022,17:43:35,.274948200
370,5.781394918358e-09,Amp DC,.00000001,5.5,F,F,F,F,F,F,Front,F,Main,184.4983367919922,Volt DC,100,T,2W,F,F,05/23/2022,17:43:35,.669811600
371,5.482857279304e-09,Amp DC,.00000001,5.5,F,F,F,F,F,F,Front,F,Main,184.9980468750000,Volt DC,100,T,2W,F,F,05/23/2022,17:43:36,.064675120
372,5.710112382928e-09,Amp DC,.00000001,5.5,F,F,F,F,F,F,Front,F,Main,185.4995574951172,Volt DC,100,T,2W,F,F,05/23/2022,17:43:36,.459525800
373,5.931612978571e-09,Amp DC,.00000001,5.5,F,F,F,F,F,F,Front,F,Main,185.9979248046875,Volt DC,100,T,2W,F,F,05/23/2022,17:43:36,.854369460
374,5.707249339792e-09,Amp DC,.00000001,5.5,F,F,F,F,F,F,Front,F,Main,186.4981536865234,Volt DC,100,T,2W,F,F,05/23/2022,17:43:37,.249233240
375,5.479466658187e-09,Amp DC,.00000001,5.5,F,F,F,F,F,F,Front,F,Main,186.9977264404297,Volt DC,100,T,2W,F,F,05/23/2022,17:43:37,.644088900
376,5.789584811566e-09,Amp DC,.00000001,5.5,F,F,F,F,F,F,Front,F,Main,187.4983825683594,Volt DC,100,T,2W,F,F,05/23/2022,17:43:38,.038966560
377,5.943517233931e-09,Amp DC,.00000001,5.5,F,F,F,F,F,F,Front,F,Main,187.9983367919922,Volt DC,100,T,2W,F,F,05/23/2022,17:43:38,.433833040
378,5.62514346214e-09,Amp DC,.00000001,5.5,F,F,F,F,F,F,Front,F,Main,188.4977111816406,Volt DC,100,T,2W,F,F,05/23/2022,17:43:38,.828710820
379,5.513912437749e-09,Amp DC,.00000001,5.5,F,F,F,F,F,F,Front,F,Main,188.9977874755859,Volt DC,100,T,2W,F,F,05/23/2022,17:43:39,.223563840
380,5.841086281322e-09,Amp DC,.00000001,5.5,F,F,F,F,F,F,Front,F,Main,189.4980621337891,Volt DC,100,T,2W,F,F,05/23/2022,17:43:39,.618417680
381,5.905149258467e-09,Amp DC,.00000001,5.5,F,F,F,F,F,F,Front,F,Main,189.9974365234375,Volt DC,100,T,2W,F,F,05/23/2022,17:43:40,.013288500
382,5.578958628405e-09,Amp DC,.00000001,5.5,F,F,F,F,F,F,Front,F,Main,190.4973144531250,Volt DC,100,T,2W,F,F,05/23/2022,17:43:40,.408127400
383,5.573681516324e-09,Amp DC,.00000001,5.5,F,F,F,F,F,F,Front,F,Main,190.9978027343750,Volt DC,100,T,2W,F,F,05/23/2022,17:43:40,.803016500
384,5.891249710288e-09,Amp DC,.00000001,5.5,F,F,F,F,F,F,Front,F,Main,191.4980468750000,Volt DC,100,T,2W,F,F,05/23/2022,17:43:41,.197877460
385,5.862630825249e-09,Amp DC,.00000001,5.5,F,F,F,F,F,F,Front,F,Main,191.9970092773438,Volt DC,100,T,2W,F,F,05/23/2022,17:43:41,.592752380
386,5.545637282722e-09,Amp DC,.00000001,5.5,F,F,F,F,F,F,Front,F,Main,192.4976654052734,Volt DC,100,T,2W,F,F,05/23/2022,17:43:41,.987645160
387,5.606648034728e-09,Amp DC,.00000001,5.5,F,F,F,F,F,F,Front,F,Main,192.9972991943359,Volt DC,100,T,2W,F,F,05/23/2022,17:43:42,.382525260
388,5.936942493179e-09,Amp DC,.00000001,5.5,F,F,F,F,F,F,Front,F,Main,193.4977874755859,Volt DC,100,T,2W,F,F,05/23/2022,17:43:42,.777386040
389,5.829046134664e-09,Amp DC,.00000001,5.5,F,F,F,F,F,F,Front,F,Main,193.9974975585938,Volt DC,100,T,2W,F,F,05/23/2022,17:43:43,.172234580
390,5.514797507544e-09,Amp DC,.00000001,5.5,F,F,F,F,F,F,Front,F,Main,194.4976806640625,Volt DC,100,T,2W,F,F,05/23/2022,17:43:43,.567098420
391,5.67656366357e-09,Amp DC,.00000001,5.5,F,F,F,F,F,F,Front,F,Main,194.9977111816406,Volt DC,100,T,2W,F,F,05/23/2022,17:43:43,.961972300
392,5.950344661443e-09,Amp DC,.00000001,5.5,F,F,F,F,F,F,Front,F,Main,195.4977569580078,Volt DC,100,T,2W,F,F,05/23/2022,17:43:44,.356835440
393,5.781859879761e-09,Amp DC,.00000001,5.5,F,F,F,F,F,F,Front,F,Main,195.9975738525391,Volt DC,100,T,2W,F,F,05/23/2022,17:43:44,.751725780
394,5.502148070491e-09,Amp DC,.00000001,5.5,F,F,F,F,F,F,Front,F,Main,196.4981689453125,Volt DC,100,T,2W,F,F,05/23/2022,17:43:45,.146620900
395,5.706760841662e-09,Amp DC,.00000001,5.5,F,F,F,F,F,F,Front,F,Main,196.9973754882813,Volt DC,100,T,2W,F,F,05/23/2022,17:43:45,.541495840
396,5.974947203669e-09,Amp DC,.00000001,5.5,F,F,F,F,F,F,Front,F,Main,197.4981384277344,Volt DC,100,T,2W,F,F,05/23/2022,17:43:45,.936389180
397,5.731306540468e-09,Amp DC,.00000001,5.5,F,F,F,F,F,F,Front,F,Main,197.9980468750000,Volt DC,100,T,2W,F,F,05/23/2022,17:43:46,.331260680
398,5.494208643597e-09,Amp DC,.00000001,5.5,F,F,F,F,F,F,Front,F,Main,198.4974670410156,Volt DC,100,T,2W,F,F,05/23/2022,17:43:46,.726119900
399,5.786788381812e-09,Amp DC,.00000001,5.5,F,F,F,F,F,F,Front,F,Main,198.9973449707031,Volt DC,100,T,2W,F,F,05/23/2022,17:43:47,.120982880
400,5.979126083133e-09,Amp DC,.00000001,5.5,F,F,F,F,F,F,Front,F,Main,199.4979553222656,Volt DC,100,T,2W,F,F,05/23/2022,17:43:47,.515828980
401,5.661620061659e-09,Amp DC,.00000001,5.5,F,F,F,F,F,F,Front,F,Main,199.9973907470703,Volt DC,100,T,2W,F,F,05/23/2022,17:43:47,.910687980
402,5.520379264823e-09,Amp DC,.00000001,5.5,F,F,F,F,F,F,Front,F,Main,200.4973602294922,Volt DC,100,T,2W,F,F,05/23/2022,17:43:48,.305547660
403,5.842319072968e-09,Amp DC,.00000001,5.5,F,F,F,F,F,F,Front,F,Main,200.9972686767578,Volt DC,100,T,2W,F,F,05/23/2022,17:43:48,.700405220
404,5.969107430559e-09,Amp DC,.00000001,5.5,F,F,F,F,F,F,Front,F,Main,201.4986267089844,Volt DC,100,T,2W,F,F,05/23/2022,17:43:49,.095273940
405,5.606216380016e-09,Amp DC,.00000001,5.5,F,F,F,F,F,F,Front,F,Main,201.9971008300781,Volt DC,100,T,2W,F,F,05/23/2022,17:43:49,.490145120
406,5.566757277364e-09,Amp DC,.00000001,5.5,F,F,F,F,F,F,Front,F,Main,202.4973449707031,Volt DC,100,T,2W,F,F,05/23/2022,17:43:49,.885009300
407,5.881978459854e-09,Amp DC,.00000001,5.5,F,F,F,F,F,F,Front,F,Main,202.9966888427734,Volt DC,100,T,2W,F,F,05/23/2022,17:43:50,.279868480
408,5.928579849268e-09,Amp DC,.00000001,5.5,F,F,F,F,F,F,Front,F,Main,203.4974365234375,Volt DC,100,T,2W,F,F,05/23/2022,17:43:50,.674717920
409,5.578689954433e-09,Amp DC,.00000001,5.5,F,F,F,F,F,F,Front,F,Main,203.9964141845703,Volt DC,100,T,2W,F,F,05/23/2022,17:43:51,.069589360
410,5.616279441512e-09,Amp DC,.00000001,5.5,F,F,F,F,F,F,Front,F,Main,204.4967956542969,Volt DC,100,T,2W,F,F,05/23/2022,17:43:51,.464466120
411,5.944578163053e-09,Amp DC,.00000001,5.5,F,F,F,F,F,F,Front,F,Main,204.9976654052734,Volt DC,100,T,2W,F,F,05/23/2022,17:43:51,.859329580
412,5.891335863595e-09,Amp DC,.00000001,5.5,F,F,F,F,F,F,Front,F,Main,205.4967956542969,Volt DC,100,T,2W,F,F,05/23/2022,17:43:52,.254167400
413,5.557818205659e-09,Amp DC,.00000001,5.5,F,F,F,F,F,F,Front,F,Main,205.9967193603516,Volt DC,100,T,2W,F,F,05/23/2022,17:43:52,.649033660
414,5.652365242526e-09,Amp DC,.00000001,5.5,F,F,F,F,F,F,Front,F,Main,206.4966583251953,Volt DC,100,T,2W,F,F,05/23/2022,17:43:53,.043907980
415,5.96631366534e-09,Amp DC,.00000001,5.5,F,F,F,F,F,F,Front,F,Main,206.9963378906250,Volt DC,100,T,2W,F,F,05/23/2022,17:43:53,.438794460
416,5.872149877462e-09,Amp DC,.00000001,5.5,F,F,F,F,F,F,Front,F,Main,207.4968109130859,Volt DC,100,T,2W,F,F,05/23/2022,17:43:53,.833681940
417,5.53770851397e-09,Amp DC,.00000001,5.5,F,F,F,F,F,F,Front,F,Main,207.9963989257813,Volt DC,100,T,2W,F,F,05/23/2022,17:43:54,.228559520
418,5.701503269506e-09,Amp DC,.00000001,5.5,F,F,F,F,F,F,Front,F,Main,208.4975433349609,Volt DC,100,T,2W,F,F,05/23/2022,17:43:54,.623432080
419,5.973822769789e-09,Amp DC,.00000001,5.5,F,F,F,F,F,F,Front,F,Main,208.9968566894531,Volt DC,100,T,2W,F,F,05/23/2022,17:43:55,.018315620
420,5.911115152912e-09,Amp DC,.00000001,5.5,F,F,F,F,F,F,Front,F,Main,209.4974975585938,Volt DC,100,T,2W,F,F,05/23/2022,17:43:55,.413178420
421,5.536798131089e-09,Amp DC,.00000001,5.5,F,F,F,F,F,F,Front,F,Main,209.9970092773438,Volt DC,100,T,2W,F,F,05/23/2022,17:43:55,.808045520
