Style,Standard
Append Mode,1
Fill Mode,1
Capacity,100000
Count,421
Base Time Seconds,1653332952
Base Time Fractional,.027120560
Base Time,05/23/2022 19:09:12.027120560
Index,Reading,Unit,Range Digits,Disp Digits,Math,Start Group,Limit1 High,Limit1 Low,Limit2 High,Limit2 Low,Terminal,Questionable,Origin,Value,Unit,Digits,Output,Sense,Source Limit,Overtemp,Date,Time,Fractional Seconds
1,-1.874758126519e-08,Amp DC,.0000001,5.5,F,F,F,F,F,F,Front,F,Main,-0.0012959407177,Volt DC,100,T,2W,F,F,05/23/2022,19:09:12,.027120560
2,1.845339829742e-05,Amp DC,.0001,5.5,F,F,F,F,F,F,Front,F,Main,0.4972415566444,Volt DC,100,T,2W,F,F,05/23/2022,19:09:12,.579887060
3,3.817687684204e-05,Amp DC,.0001,5.5,F,F,F,F,F,F,Front,F,Main,0.9968768954277,Volt DC,100,T,2W,F,F,05/23/2022,19:09:12,.662683620
4,5.934102227911e-05,Amp DC,.0001,5.5,F,F,F,F,F,F,Front,F,Main,1.4960986375809,Volt DC,100,T,2W,F,F,05/23/2022,19:09:12,.745474680
5,8.210432133637e-05,Amp DC,.0001,5.5,F,F,F,F,F,F,Front,F,Main,1.9953991174698,Volt DC,100,T,2W,F,F,05/23/2022,19:09:12,.828248340
6,0.000128954401589,Amp DC,.001,5.5,F,F,F,F,F,F,Front,F,Main,2.4989268779755,Volt DC,100,T,2W,F,F,05/23/2022,19:09:13,.064415380
7,0.0001620886905584,Amp DC,.001,5.5,F,F,F,F,F,F,Front,F,Main,2.9987111091614,Volt DC,100,T,2W,F,F,05/23/2022,19:09:13,.147220120
8,0.0001937366614584,Amp DC,.001,5.5,F,F,F,F,F,F,Front,F,Main,3.4985415935516,Volt DC,100,T,2W,F,F,05/23/2022,19:09:13,.230003860
9,0.0001999959204113,Amp DC,.001,5.5,F,F,F,F,F,F,Front,F,Main,3.5999693870544,Volt DC,100,T,2W,T,F,05/23/2022,19:09:13,.312767500
10,0.0001999967935262,Amp DC,.001,5.5,F,F,F,F,F,F,Front,F,Main,3.5763719081879,Volt DC,100,T,2W,T,F,05/23/2022,19:09:13,.395553080
11,0.0001999963424169,Amp DC,.001,5.5,F,F,F,F,F,F,Front,F,Main,3.5710701942444,Volt DC,100,T,2W,T,F,05/23/2022,19:09:13,.478323440
12,0.0001999957166845,Amp DC,.001,5.5,F,F,F,F,F,F,Front,F,Main,3.5694668292999,Volt DC,100,T,2W,T,F,05/23/2022,19:09:13,.561098340
13,0.0001999956584768,Amp DC,.001,5.5,F,F,F,F,F,F,Front,F,Main,3.5681052207947,Volt DC,100,T,2W,T,F,05/23/2022,19:09:13,.643856700
14,0.0001999959204113,Amp DC,.001,5.5,F,F,F,F,F,F,Front,F,Main,3.5674886703491,Volt DC,100,T,2W,T,F,05/23/2022,19:09:13,.726621240
15,0.0001999955129577,Amp DC,.001,5.5,F,F,F,F,F,F,Front,F,Main,3.5638346672058,Volt DC,100,T,2W,T,F,05/23/2022,19:09:13,.809391260
16,0.0001999961095862,Amp DC,.001,5.5,F,F,F,F,F,F,Front,F,Main,3.5643508434296,Volt DC,100,T,2W,T,F,05/23/2022,19:09:13,.892155160
17,0.0001999953092309,Amp DC,.001,5.5,F,F,F,F,F,F,Front,F,Main,3.5674185752869,Volt DC,100,T,2W,T,F,05/23/2022,19:09:13,.974919940
18,0.0001999959349632,Amp DC,.001,5.5,F,F,F,F,F,F,Front,F,Main,3.5665712356567,Volt DC,100,T,2W,T,F,05/23/2022,19:09:14,.057690820
19,0.0001999953819904,Amp DC,.001,5.5,F,F,F,F,F,F,Front,F,Main,3.5622656345367,Volt DC,100,T,2W,T,F,05/23/2022,19:09:14,.140447100
20,0.0001999952073675,Amp DC,.001,5.5,F,F,F,F,F,F,Front,F,Main,3.5649797916412,Volt DC,100,T,2W,T,F,05/23/2022,19:09:14,.223210380
21,0.0001999955275096,Amp DC,.001,5.5,F,F,F,F,F,F,Front,F,Main,3.5758333206177,Volt DC,100,T,2W,T,F,05/23/2022,19:09:14,.305974680
22,0.0001999958913075,Amp DC,.001,5.5,F,F,F,F,F,F,Front,F,Main,3.5620603561401,Volt DC,100,T,2W,T,F,05/23/2022,19:09:14,.388729980
23,0.0001999955129577,Amp DC,.001,5.5,F,F,F,F,F,F,Front,F,Main,3.5606973171234,Volt DC,100,T,2W,T,F,05/23/2022,19:09:14,.471503480
24,0.0001999953965424,Amp DC,.001,5.5,F,F,F,F,F,F,Front,F,Main,3.5601716041565,Volt DC,100,T,2W,T,F,05/23/2022,19:09:14,.554278060
25,0.0001999956148211,Amp DC,.001,5.5,F,F,F,F,F,F,Front,F,Main,3.5745182037354,Volt DC,100,T,2W,T,F,05/23/2022,19:09:14,.637051040
26,0.0001999957457883,Amp DC,.001,5.5,F,F,F,F,F,F,Front,F,Main,3.5732362270355,Volt DC,100,T,2W,T,F,05/23/2022,19:09:14,.719818220
27,0.0001999954838539,Amp DC,.001,5.5,F,F,F,F,F,F,Front,F,Main,3.5748720169067,Volt DC,100,T,2W,T,F,05/23/2022,19:09:14,.802599340
28,0.0001999950327445,Amp DC,.001,5.5,F,F,F,F,F,F,Front,F,Main,3.5787878036499,Volt DC,100,T,2W,T,F,05/23/2022,19:09:14,.885361080
29,0.0001999948435696,Amp DC,.001,5.5,F,F,F,F,F,F,Front,F,Main,3.5773792266846,Volt DC,100,T,2W,T,F,05/23/2022,19:09:14,.968138800
30,0.0001999950327445,Amp DC,.001,5.5,F,F,F,F,F,F,Front,F,Main,3.5740694999695,Volt DC,100,T,2W,T,F,05/23/2022,19:09:15,.050921140
31,0.0001999947417062,Amp DC,.001,5.5,F,F,F,F,F,F,Front,F,Main,3.5770931243896,Volt DC,100,T,2W,T,F,05/23/2022,19:09:15,.133707060
32,0.000199994945433,Amp DC,.001,5.5,F,F,F,F,F,F,Front,F,Main,3.5773913860321,Volt DC,100,T,2W,T,F,05/23/2022,19:09:15,.216484300
33,0.0001999942905968,Amp DC,.001,5.5,F,F,F,F,F,F,Front,F,Main,3.5749523639679,Volt DC,100,T,2W,T,F,05/23/2022,19:09:15,.299259040
34,0.0001999947126023,Amp DC,.001,5.5,F,F,F,F,F,F,Front,F,Main,3.5728807449341,Volt DC,100,T,2W,T,F,05/23/2022,19:09:15,.382024180
35,0.0001999940141104,Amp DC,.001,5.5,F,F,F,F,F,F,Front,F,Main,3.5718491077423,Volt DC,100,T,2W,T,F,05/23/2022,19:09:15,.464801260
36,0.0001999941159738,Amp DC,.001,5.5,F,F,F,F,F,F,Front,F,Main,3.5712776184082,Volt DC,100,T,2W,T,F,05/23/2022,19:09:15,.547588440
37,0.0001999943342526,Amp DC,.001,5.5,F,F,F,F,F,F,Front,F,Main,3.5714614391327,Volt DC,100,T,2W,T,F,05/23/2022,19:09:15,.630370380
38,0.0001999951637117,Amp DC,.001,5.5,F,F,F,F,F,F,Front,F,Main,3.5760514736176,Volt DC,100,T,2W,T,F,05/23/2022,19:09:15,.713136920
39,0.0001999942323891,Amp DC,.001,5.5,F,F,F,F,F,F,Front,F,Main,3.5659286975861,Volt DC,100,T,2W,T,F,05/23/2022,19:09:15,.795909760
40,0.0001999940286623,Amp DC,.001,5.5,F,F,F,F,F,F,Front,F,Main,3.5681972503662,Volt DC,100,T,2W,T,F,05/23/2022,19:09:15,.878674220
41,0.0001999943924602,Amp DC,.001,5.5,F,F,F,F,F,F,Front,F,Main,3.5586032867432,Volt DC,100,T,2W,T,F,05/23/2022,19:09:15,.961462600
42,0.0001999943051487,Amp DC,.001,5.5,F,F,F,F,F,F,Front,F,Main,3.5530390739441,Volt DC,100,T,2W,T,F,05/23/2022,19:09:16,.044230000
43,0.0001999942323891,Amp DC,.001,5.5,F,F,F,F,F,F,Front,F,Main,3.5522251129150,Volt DC,100,T,2W,T,F,05/23/2022,19:09:16,.127002540
44,0.0001999940577662,Amp DC,.001,5.5,F,F,F,F,F,F,Front,F,Main,3.5368492603302,Volt DC,100,T,2W,T,F,05/23/2022,19:09:16,.209774600
45,0.0001999941014219,Amp DC,.001,5.5,F,F,F,F,F,F,Front,F,Main,3.5362312793732,Volt DC,100,T,2W,T,F,05/23/2022,19:09:16,.292562180
46,0.0001999937958317,Amp DC,.001,5.5,F,F,F,F,F,F,Front,F,Main,3.5430550575256,Volt DC,100,T,2W,T,F,05/23/2022,19:09:16,.375343120
47,0.0001999936066568,Amp DC,.001,5.5,F,F,F,F,F,F,Front,F,Main,3.5432376861572,Volt DC,100,T,2W,T,F,05/23/2022,19:09:16,.458119820
48,0.0001999939850066,Amp DC,.001,5.5,F,F,F,F,F,F,Front,F,Main,3.5501651763916,Volt DC,100,T,2W,T,F,05/23/2022,19:09:16,.540881500
49,0.0001999936357606,Amp DC,.001,5.5,F,F,F,F,F,F,Front,F,Main,3.5482740402222,Volt DC,100,T,2W,T,F,05/23/2022,19:09:16,.623666200
50,0.0001999941596296,Amp DC,.001,5.5,F,F,F,F,F,F,Front,F,Main,3.5493388175964,Volt DC,100,T,2W,T,F,05/23/2022,19:09:16,.706433480
51,0.0001999936648645,Amp DC,.001,5.5,F,F,F,F,F,F,Front,F,Main,3.5539989471436,Volt DC,100,T,2W,T,F,05/23/2022,19:09:16,.789208520
52,0.0001999943924602,Amp DC,.001,5.5,F,F,F,F,F,F,Front,F,Main,3.5524537563324,Volt DC,100,T,2W,T,F,05/23/2022,19:09:16,.871972740
53,0.0001999935047934,Amp DC,.001,5.5,F,F,F,F,F,F,Front,F,Main,3.5535078048706,Volt DC,100,T,2W,T,F,05/23/2022,19:09:16,.954733500
54,0.0001999937812798,Amp DC,.001,5.5,F,F,F,F,F,F,Front,F,Main,3.5612597465515,Volt DC,100,T,2W,T,F,05/23/2022,19:09:17,.037501900
55,0.0001999939704547,Amp DC,.001,5.5,F,F,F,F,F,F,Front,F,Main,3.5618991851807,Volt DC,100,T,2W,T,F,05/23/2022,19:09:17,.120262640
56,0.000199993228307,Amp DC,.001,5.5,F,F,F,F,F,F,Front,F,Main,3.5635132789612,Volt DC,100,T,2W,T,F,05/23/2022,19:09:17,.203039180
57,0.0001999933301704,Amp DC,.001,5.5,F,F,F,F,F,F,Front,F,Main,3.5685636997223,Volt DC,100,T,2W,T,F,05/23/2022,19:09:17,.285817000
58,0.0001999941450777,Amp DC,.001,5.5,F,F,F,F,F,F,Front,F,Main,3.5753319263458,Volt DC,100,T,2W,T,F,05/23/2022,19:09:17,.368594860
59,0.0001999937521759,Amp DC,.001,5.5,F,F,F,F,F,F,Front,F,Main,3.5562217235565,Volt DC,100,T,2W,T,F,05/23/2022,19:09:17,.451366620
60,0.0001999936648645,Amp DC,.001,5.5,F,F,F,F,F,F,Front,F,Main,3.5553863048553,Volt DC,100,T,2W,T,F,05/23/2022,19:09:17,.534138060
61,0.0001999927335419,Amp DC,.001,5.5,F,F,F,F,F,F,Front,F,Main,3.5581674575806,Volt DC,100,T,2W,T,F,05/23/2022,19:09:17,.616915480
62,0.0001999936066568,Amp DC,.001,5.5,F,F,F,F,F,F,Front,F,Main,3.5555582046509,Volt DC,100,T,2W,T,F,05/23/2022,19:09:17,.699681160
63,0.0001999929518206,Amp DC,.001,5.5,F,F,F,F,F,F,Front,F,Main,3.5522363185883,Volt DC,100,T,2W,T,F,05/23/2022,19:09:17,.782451460
64,0.0001999928354053,Amp DC,.001,5.5,F,F,F,F,F,F,Front,F,Main,3.5537707805634,Volt DC,100,T,2W,T,F,05/23/2022,19:09:17,.865236780
65,0.0001999931992032,Amp DC,.001,5.5,F,F,F,F,F,F,Front,F,Main,3.5535764694214,Volt DC,100,T,2W,T,F,05/23/2022,19:09:17,.948017400
66,0.0001999935921049,Amp DC,.001,5.5,F,F,F,F,F,F,Front,F,Main,3.5539193153381,Volt DC,100,T,2W,T,F,05/23/2022,19:09:18,.030802620
67,0.000199993053684,Amp DC,.001,5.5,F,F,F,F,F,F,Front,F,Main,3.5514242649078,Volt DC,100,T,2W,T,F,05/23/2022,19:09:18,.113589300
68,0.0001999926898861,Amp DC,.001,5.5,F,F,F,F,F,F,Front,F,Main,3.5548245906830,Volt DC,100,T,2W,T,F,05/23/2022,19:09:18,.196368040
69,0.0001999929227168,Amp DC,.001,5.5,F,F,F,F,F,F,Front,F,Main,3.5529930591583,Volt DC,100,T,2W,T,F,05/23/2022,19:09:18,.279139700
70,0.0001999926898861,Amp DC,.001,5.5,F,F,F,F,F,F,Front,F,Main,3.5536456108093,Volt DC,100,T,2W,T,F,05/23/2022,19:09:18,.361917840
71,0.0001999928354053,Amp DC,.001,5.5,F,F,F,F,F,F,Front,F,Main,3.5540683269501,Volt DC,100,T,2W,T,F,05/23/2022,19:09:18,.444704880
72,0.0001999933447223,Amp DC,.001,5.5,F,F,F,F,F,F,Front,F,Main,3.5542991161346,Volt DC,100,T,2W,T,F,05/23/2022,19:09:18,.527497040
73,0.0001999931409955,Amp DC,.001,5.5,F,F,F,F,F,F,Front,F,Main,3.5518841743469,Volt DC,100,T,2W,T,F,05/23/2022,19:09:18,.610274760
74,0.0001999929227168,Amp DC,.001,5.5,F,F,F,F,F,F,Front,F,Main,3.5513441562653,Volt DC,100,T,2W,T,F,05/23/2022,19:09:18,.693051840
75,0.000199992879061,Amp DC,.001,5.5,F,F,F,F,F,F,Front,F,Main,3.5485620498657,Volt DC,100,T,2W,T,F,05/23/2022,19:09:18,.775824960
76,0.0001999924570555,Amp DC,.001,5.5,F,F,F,F,F,F,Front,F,Main,3.5590157508850,Volt DC,100,T,2W,T,F,05/23/2022,19:09:18,.858599880
77,0.0001999929954764,Amp DC,.001,5.5,F,F,F,F,F,F,Front,F,Main,3.5553629398346,Volt DC,100,T,2W,T,F,05/23/2022,19:09:18,.941388160
78,0.0001999930682359,Amp DC,.001,5.5,F,F,F,F,F,F,Front,F,Main,3.5527310371399,Volt DC,100,T,2W,T,F,05/23/2022,19:09:19,.024164760
79,0.0001999932428589,Amp DC,.001,5.5,F,F,F,F,F,F,Front,F,Main,3.5573780536652,Volt DC,100,T,2W,T,F,05/23/2022,19:09:19,.106943240
80,0.0001999929663725,Amp DC,.001,5.5,F,F,F,F,F,F,Front,F,Main,3.5562219619751,Volt DC,100,T,2W,T,F,05/23/2022,19:09:19,.189701640
81,0.0001999923551921,Amp DC,.001,5.5,F,F,F,F,F,F,Front,F,Main,3.5513901710510,Volt DC,100,T,2W,T,F,05/23/2022,19:09:19,.272484880
82,0.0001999933301704,Amp DC,.001,5.5,F,F,F,F,F,F,Front,F,Main,3.5551354885101,Volt DC,100,T,2W,T,F,05/23/2022,19:09:19,.355256820
83,0.0001999919622904,Amp DC,.001,5.5,F,F,F,F,F,F,Front,F,Main,3.5567362308502,Volt DC,100,T,2W,T,F,05/23/2022,19:09:19,.438051460
84,0.0001999925589189,Amp DC,.001,5.5,F,F,F,F,F,F,Front,F,Main,3.5542414188385,Volt DC,100,T,2W,T,F,05/23/2022,19:09:19,.520829220
85,0.0001999917731155,Amp DC,.001,5.5,F,F,F,F,F,F,Front,F,Main,3.5569884777069,Volt DC,100,T,2W,T,F,05/23/2022,19:09:19,.603613020
86,0.0001999924716074,Amp DC,.001,5.5,F,F,F,F,F,F,Front,F,Main,3.5582721233368,Volt DC,100,T,2W,T,F,05/23/2022,19:09:19,.686388620
87,0.0001999923842959,Amp DC,.001,5.5,F,F,F,F,F,F,Front,F,Main,3.5555236339569,Volt DC,100,T,2W,T,F,05/23/2022,19:09:19,.769160020
88,0.0001999921805691,Amp DC,.001,5.5,F,F,F,F,F,F,Front,F,Main,3.5534508228302,Volt DC,100,T,2W,T,F,05/23/2022,19:09:19,.851920380
89,0.0001999922242248,Amp DC,.001,5.5,F,F,F,F,F,F,Front,F,Main,3.5528564453125,Volt DC,100,T,2W,T,F,05/23/2022,19:09:19,.934698880
90,0.0001999920059461,Amp DC,.001,5.5,F,F,F,F,F,F,Front,F,Main,3.5529241561890,Volt DC,100,T,2W,T,F,05/23/2022,19:09:20,.017480360
91,0.0001999920641538,Amp DC,.001,5.5,F,F,F,F,F,F,Front,F,Main,3.5531532764435,Volt DC,100,T,2W,T,F,05/23/2022,19:09:20,.100238800
92,0.0001999916275963,Amp DC,.001,5.5,F,F,F,F,F,F,Front,F,Main,3.5544576644897,Volt DC,100,T,2W,T,F,05/23/2022,19:09:20,.183021880
93,0.0001999919913942,Amp DC,.001,5.5,F,F,F,F,F,F,Front,F,Main,3.5584423542023,Volt DC,100,T,2W,T,F,05/23/2022,19:09:20,.265791460
94,0.0001999922824325,Amp DC,.001,5.5,F,F,F,F,F,F,Front,F,Main,3.5595872402191,Volt DC,100,T,2W,T,F,05/23/2022,19:09:20,.348574480
95,0.000199991001864,Amp DC,.001,5.5,F,F,F,F,F,F,Front,F,Main,3.5607876777649,Volt DC,100,T,2W,T,F,05/23/2022,19:09:20,.431346620
96,0.0001999914675253,Amp DC,.001,5.5,F,F,F,F,F,F,Front,F,Main,3.5504062175751,Volt DC,100,T,2W,T,F,05/23/2022,19:09:20,.514116960
97,0.0001999911910389,Amp DC,.001,5.5,F,F,F,F,F,F,Front,F,Main,3.5492606163025,Volt DC,100,T,2W,T,F,05/23/2022,19:09:20,.596881440
98,0.0001999917149078,Amp DC,.001,5.5,F,F,F,F,F,F,Front,F,Main,3.5533246994019,Volt DC,100,T,2W,T,F,05/23/2022,19:09:20,.679654400
99,0.0001999922242248,Amp DC,.001,5.5,F,F,F,F,F,F,Front,F,Main,3.5524671077728,Volt DC,100,T,2W,T,F,05/23/2022,19:09:20,.762432680
100,0.0001999919477385,Amp DC,.001,5.5,F,F,F,F,F,F,Front,F,Main,3.5525701045990,Volt DC,100,T,2W,T,F,05/23/2022,19:09:20,.845206380
101,0.0001999916275963,Amp DC,.001,5.5,F,F,F,F,F,F,Front,F,Main,3.5532453060150,Volt DC,100,T,2W,T,F,05/23/2022,19:09:20,.927976060
102,0.000199991685804,Amp DC,.001,5.5,F,F,F,F,F,F,Front,F,Main,3.5545504093170,Volt DC,100,T,2W,T,F,05/23/2022,19:09:21,.010758740
103,0.0001999911328312,Amp DC,.001,5.5,F,F,F,F,F,F,Front,F,Main,3.5529127120972,Volt DC,100,T,2W,T,F,05/23/2022,19:09:21,.093530100
104,0.0001999916712521,Amp DC,.001,5.5,F,F,F,F,F,F,Front,F,Main,3.5499362945557,Volt DC,100,T,2W,T,F,05/23/2022,19:09:21,.176301240
105,0.0001999923260882,Amp DC,.001,5.5,F,F,F,F,F,F,Front,F,Main,3.5505893230438,Volt DC,100,T,2W,T,F,05/23/2022,19:09:21,.259067340
106,0.0001999924133997,Amp DC,.001,5.5,F,F,F,F,F,F,Front,F,Main,3.5473599433899,Volt DC,100,T,2W,T,F,05/23/2022,19:09:21,.341829400
107,0.0001999913802138,Amp DC,.001,5.5,F,F,F,F,F,F,Front,F,Main,3.5477840900421,Volt DC,100,T,2W,T,F,05/23/2022,19:09:21,.424613500
108,0.0001999914675253,Amp DC,.001,5.5,F,F,F,F,F,F,Front,F,Main,3.5476355552673,Volt DC,100,T,2W,T,F,05/23/2022,19:09:21,.507384940
109,0.0001999911037274,Amp DC,.001,5.5,F,F,F,F,F,F,Front,F,Main,3.5489730834961,Volt DC,100,T,2W,T,F,05/23/2022,19:09:21,.590167880
110,0.0001999911328312,Amp DC,.001,5.5,F,F,F,F,F,F,Front,F,Main,3.5501077175140,Volt DC,100,T,2W,T,F,05/23/2022,19:09:21,.672937040
111,0.0001999907253776,Amp DC,.001,5.5,F,F,F,F,F,F,Front,F,Main,3.5500712394714,Volt DC,100,T,2W,T,F,05/23/2022,19:09:21,.755716740
112,0.0001999909145525,Amp DC,.001,5.5,F,F,F,F,F,F,Front,F,Main,3.5501079559326,Volt DC,100,T,2W,T,F,05/23/2022,19:09:21,.838498000
113,0.0001999910891755,Amp DC,.001,5.5,F,F,F,F,F,F,Front,F,Main,3.5505545139313,Volt DC,100,T,2W,T,F,05/23/2022,19:09:21,.921262880
114,0.0001999914093176,Amp DC,.001,5.5,F,F,F,F,F,F,Front,F,Main,3.5488491058350,Volt DC,100,T,2W,T,F,05/23/2022,19:09:22,.004044040
115,0.0001999906671699,Amp DC,.001,5.5,F,F,F,F,F,F,Front,F,Main,3.5516190528870,Volt DC,100,T,2W,T,F,05/23/2022,19:09:22,.086820980
116,0.0001999917876674,Amp DC,.001,5.5,F,F,F,F,F,F,Front,F,Main,3.5527415275574,Volt DC,100,T,2W,T,F,05/23/2022,19:09:22,.169595660
117,0.0001999906380661,Amp DC,.001,5.5,F,F,F,F,F,F,Front,F,Main,3.5519859790802,Volt DC,100,T,2W,T,F,05/23/2022,19:09:22,.252367180
118,0.000199990827241,Amp DC,.001,5.5,F,F,F,F,F,F,Front,F,Main,3.5527181625366,Volt DC,100,T,2W,T,F,05/23/2022,19:09:22,.335141560
119,0.000199990987312,Amp DC,.001,5.5,F,F,F,F,F,F,Front,F,Main,3.5487458705902,Volt DC,100,T,2W,T,F,05/23/2022,19:09:22,.417923000
120,0.0001999908708967,Amp DC,.001,5.5,F,F,F,F,F,F,Front,F,Main,3.5530850887299,Volt DC,100,T,2W,T,F,05/23/2022,19:09:22,.500699320
121,0.0001999906817218,Amp DC,.001,5.5,F,F,F,F,F,F,Front,F,Main,3.5513560771942,Volt DC,100,T,2W,T,F,05/23/2022,19:09:22,.583477200
122,0.0001999912201427,Amp DC,.001,5.5,F,F,F,F,F,F,Front,F,Main,3.5502901077271,Volt DC,100,T,2W,T,F,05/23/2022,19:09:22,.666250080
123,0.000199990987312,Amp DC,.001,5.5,F,F,F,F,F,F,Front,F,Main,3.5510344505310,Volt DC,100,T,2W,T,F,05/23/2022,19:09:22,.749036100
124,0.0001999905798584,Amp DC,.001,5.5,F,F,F,F,F,F,Front,F,Main,3.5504276752472,Volt DC,100,T,2W,T,F,05/23/2022,19:09:22,.831812520
125,0.0001999906235142,Amp DC,.001,5.5,F,F,F,F,F,F,Front,F,Main,3.5489277839661,Volt DC,100,T,2W,T,F,05/23/2022,19:09:22,.914590760
126,0.0001999904488912,Amp DC,.001,5.5,F,F,F,F,F,F,Front,F,Main,3.5567808151245,Volt DC,100,T,2W,T,F,05/23/2022,19:09:22,.997377300
127,0.0001999903179239,Amp DC,.001,5.5,F,F,F,F,F,F,Front,F,Main,3.5533010959625,Volt DC,100,T,2W,T,F,05/23/2022,19:09:23,.080150320
128,0.0001999901287491,Amp DC,.001,5.5,F,F,F,F,F,F,Front,F,Main,3.5567719936371,Volt DC,100,T,2W,T,F,05/23/2022,19:09:23,.162935900
129,0.0001999902160605,Amp DC,.001,5.5,F,F,F,F,F,F,Front,F,Main,3.5520887374878,Volt DC,100,T,2W,T,F,05/23/2022,19:09:23,.245722220
130,0.0001999903470278,Amp DC,.001,5.5,F,F,F,F,F,F,Front,F,Main,3.5543317794800,Volt DC,100,T,2W,T,F,05/23/2022,19:09:23,.328504020
131,0.0001999902742682,Amp DC,.001,5.5,F,F,F,F,F,F,Front,F,Main,3.5660798549652,Volt DC,100,T,2W,T,F,05/23/2022,19:09:23,.411298700
132,0.0001999906380661,Amp DC,.001,5.5,F,F,F,F,F,F,Front,F,Main,3.5618662834167,Volt DC,100,T,2W,T,F,05/23/2022,19:09:23,.494069400
133,0.0001999907690333,Amp DC,.001,5.5,F,F,F,F,F,F,Front,F,Main,3.5587399005890,Volt DC,100,T,2W,T,F,05/23/2022,19:09:23,.576837520
134,0.0001999897212954,Amp DC,.001,5.5,F,F,F,F,F,F,Front,F,Main,3.5602180957794,Volt DC,100,T,2W,T,F,05/23/2022,19:09:23,.659631580
135,0.0001999902306125,Amp DC,.001,5.5,F,F,F,F,F,F,Front,F,Main,3.5566112995148,Volt DC,100,T,2W,T,F,05/23/2022,19:09:23,.742415640
136,0.0001999894302571,Amp DC,.001,5.5,F,F,F,F,F,F,Front,F,Main,3.5556373596191,Volt DC,100,T,2W,T,F,05/23/2022,19:09:23,.825188200
137,0.0001999897795031,Amp DC,.001,5.5,F,F,F,F,F,F,Front,F,Main,3.5649914741516,Volt DC,100,T,2W,T,F,05/23/2022,19:09:23,.907948680
138,0.0001999895321205,Amp DC,.001,5.5,F,F,F,F,F,F,Front,F,Main,3.5647974014282,Volt DC,100,T,2W,T,F,05/23/2022,19:09:23,.990731880
139,0.0001999899977818,Amp DC,.001,5.5,F,F,F,F,F,F,Front,F,Main,3.5594258308411,Volt DC,100,T,2W,T,F,05/23/2022,19:09:24,.073514240
140,0.0001999895757763,Amp DC,.001,5.5,F,F,F,F,F,F,Front,F,Main,3.5549612045288,Volt DC,100,T,2W,T,F,05/23/2022,19:09:24,.156290620
141,0.0001999898522627,Amp DC,.001,5.5,F,F,F,F,F,F,Front,F,Main,3.5556135177612,Volt DC,100,T,2W,T,F,05/23/2022,19:09:24,.239068000
142,0.0001999890664592,Amp DC,.001,5.5,F,F,F,F,F,F,Front,F,Main,3.5533003807068,Volt DC,100,T,2W,T,F,05/23/2022,19:09:24,.321838780
143,0.0001999898231588,Amp DC,.001,5.5,F,F,F,F,F,F,Front,F,Main,3.5516071319580,Volt DC,100,T,2W,T,F,05/23/2022,19:09:24,.404620240
144,0.0001999899104703,Amp DC,.001,5.5,F,F,F,F,F,F,Front,F,Main,3.5533490180969,Volt DC,100,T,2W,T,F,05/23/2022,19:09:24,.487388500
145,0.0001999900414376,Amp DC,.001,5.5,F,F,F,F,F,F,Front,F,Main,3.5465586185455,Volt DC,100,T,2W,T,F,05/23/2022,19:09:24,.570156460
146,0.0001999896339839,Amp DC,.001,5.5,F,F,F,F,F,F,Front,F,Main,3.5471761226654,Volt DC,100,T,2W,T,F,05/23/2022,19:09:24,.652924220
147,0.0001999900268856,Amp DC,.001,5.5,F,F,F,F,F,F,Front,F,Main,3.5466971397400,Volt DC,100,T,2W,T,F,05/23/2022,19:09:24,.735709260
148,0.0001999893138418,Amp DC,.001,5.5,F,F,F,F,F,F,Front,F,Main,3.5462608337402,Volt DC,100,T,2W,T,F,05/23/2022,19:09:24,.818492840
149,0.0001999892701861,Amp DC,.001,5.5,F,F,F,F,F,F,Front,F,Main,3.5520646572113,Volt DC,100,T,2W,T,F,05/23/2022,19:09:24,.901271160
150,0.0001999891392188,Amp DC,.001,5.5,F,F,F,F,F,F,Front,F,Main,3.5505521297455,Volt DC,100,T,2W,T,F,05/23/2022,19:09:24,.984040420
151,0.0001999890810112,Amp DC,.001,5.5,F,F,F,F,F,F,Front,F,Main,3.5489280223846,Volt DC,100,T,2W,T,F,05/23/2022,19:09:25,.066829200
152,0.0001999890664592,Amp DC,.001,5.5,F,F,F,F,F,F,Front,F,Main,3.5480246543884,Volt DC,100,T,2W,T,F,05/23/2022,19:09:25,.149629540
153,0.0001999892265303,Amp DC,.001,5.5,F,F,F,F,F,F,Front,F,Main,3.5458021163940,Volt DC,100,T,2W,T,F,05/23/2022,19:09:25,.232411140
154,0.0001999892701861,Amp DC,.001,5.5,F,F,F,F,F,F,Front,F,Main,3.5529127120972,Volt DC,100,T,2W,T,F,05/23/2022,19:09:25,.315188500
155,0.0001999899832299,Amp DC,.001,5.5,F,F,F,F,F,F,Front,F,Main,3.5542285442352,Volt DC,100,T,2W,T,F,05/23/2022,19:09:25,.397964860
156,0.0001999894011533,Amp DC,.001,5.5,F,F,F,F,F,F,Front,F,Main,3.5478880405426,Volt DC,100,T,2W,T,F,05/23/2022,19:09:25,.480762340
157,0.0001999894884648,Amp DC,.001,5.5,F,F,F,F,F,F,Front,F,Main,3.5462377071381,Volt DC,100,T,2W,T,F,05/23/2022,19:09:25,.563536300
158,0.0001999891683226,Amp DC,.001,5.5,F,F,F,F,F,F,Front,F,Main,3.5451047420502,Volt DC,100,T,2W,T,F,05/23/2022,19:09:25,.646324800
159,0.0001999891683226,Amp DC,.001,5.5,F,F,F,F,F,F,Front,F,Main,3.5521907806396,Volt DC,100,T,2W,T,F,05/23/2022,19:09:25,.729100540
160,0.0001999894302571,Amp DC,.001,5.5,F,F,F,F,F,F,Front,F,Main,3.5571613311768,Volt DC,100,T,2W,T,F,05/23/2022,19:09:25,.811881700
161,0.0001999889936997,Amp DC,.001,5.5,F,F,F,F,F,F,Front,F,Main,3.5494210720062,Volt DC,100,T,2W,T,F,05/23/2022,19:09:25,.894665920
162,0.0001999890664592,Amp DC,.001,5.5,F,F,F,F,F,F,Front,F,Main,3.5477142333984,Volt DC,100,T,2W,T,F,05/23/2022,19:09:25,.977454380
163,0.0001999891683226,Amp DC,.001,5.5,F,F,F,F,F,F,Front,F,Main,3.5452630519867,Volt DC,100,T,2W,T,F,05/23/2022,19:09:26,.060243720
164,0.0001999888481805,Amp DC,.001,5.5,F,F,F,F,F,F,Front,F,Main,3.5430526733398,Volt DC,100,T,2W,T,F,05/23/2022,19:09:26,.143023100
165,0.0001999890373554,Amp DC,.001,5.5,F,F,F,F,F,F,Front,F,Main,3.5488712787628,Volt DC,100,T,2W,T,F,05/23/2022,19:09:26,.225815420
166,0.0001999888045248,Amp DC,.001,5.5,F,F,F,F,F,F,Front,F,Main,3.5415551662445,Volt DC,100,T,2W,T,F,05/23/2022,19:09:26,.308587220
167,0.0001999890810112,Amp DC,.001,5.5,F,F,F,F,F,F,Front,F,Main,3.5423452854156,Volt DC,100,T,2W,T,F,05/23/2022,19:09:26,.391369940
168,0.0001999879750656,Amp DC,.001,5.5,F,F,F,F,F,F,Front,F,Main,3.5470952987671,Volt DC,100,T,2W,T,F,05/23/2022,19:09:26,.474143460
169,0.0001999887172133,Amp DC,.001,5.5,F,F,F,F,F,F,Front,F,Main,3.5451164245605,Volt DC,100,T,2W,T,F,05/23/2022,19:09:26,.556931200
170,0.0001999883388635,Amp DC,.001,5.5,F,F,F,F,F,F,Front,F,Main,3.5493519306183,Volt DC,100,T,2W,T,F,05/23/2022,19:09:26,.639721220
171,0.0001999888045248,Amp DC,.001,5.5,F,F,F,F,F,F,Front,F,Main,3.5520195960999,Volt DC,100,T,2W,T,F,05/23/2022,19:09:26,.722509460
172,0.0001999889791477,Amp DC,.001,5.5,F,F,F,F,F,F,Front,F,Main,3.5446350574493,Volt DC,100,T,2W,T,F,05/23/2022,19:09:26,.805281420
173,0.0001999884407269,Amp DC,.001,5.5,F,F,F,F,F,F,Front,F,Main,3.5441427230835,Volt DC,100,T,2W,T,F,05/23/2022,19:09:26,.888052900
174,0.000199988426175,Amp DC,.001,5.5,F,F,F,F,F,F,Front,F,Main,3.5413839817047,Volt DC,100,T,2W,T,F,05/23/2022,19:09:26,.970825280
175,0.0001999882952077,Amp DC,.001,5.5,F,F,F,F,F,F,Front,F,Main,3.5389566421509,Volt DC,100,T,2W,T,F,05/23/2022,19:09:27,.053627900
176,0.0001999877858907,Amp DC,.001,5.5,F,F,F,F,F,F,Front,F,Main,3.5459408760071,Volt DC,100,T,2W,T,F,05/23/2022,19:09:27,.136409800
177,0.0001999886735575,Amp DC,.001,5.5,F,F,F,F,F,F,Front,F,Main,3.5484924316406,Volt DC,100,T,2W,T,F,05/23/2022,19:09:27,.219197700
178,0.0001999880623771,Amp DC,.001,5.5,F,F,F,F,F,F,Front,F,Main,3.5470051765442,Volt DC,100,T,2W,T,F,05/23/2022,19:09:27,.301969500
179,0.0001999884698307,Amp DC,.001,5.5,F,F,F,F,F,F,Front,F,Main,3.5476350784302,Volt DC,100,T,2W,T,F,05/23/2022,19:09:27,.384743040
180,0.000199988935492,Amp DC,.001,5.5,F,F,F,F,F,F,Front,F,Main,3.5457000732422,Volt DC,100,T,2W,T,F,05/23/2022,19:09:27,.467538760
181,0.0001999889791477,Amp DC,.001,5.5,F,F,F,F,F,F,Front,F,Main,3.5453574657440,Volt DC,100,T,2W,T,F,05/23/2022,19:09:27,.550324420
182,0.0001999879896175,Amp DC,.001,5.5,F,F,F,F,F,F,Front,F,Main,3.5374798774719,Volt DC,100,T,2W,T,F,05/23/2022,19:09:27,.633101920
183,0.0001999883388635,Amp DC,.001,5.5,F,F,F,F,F,F,Front,F,Main,3.5430772304535,Volt DC,100,T,2W,T,F,05/23/2022,19:09:27,.715884040
184,0.0001999879750656,Amp DC,.001,5.5,F,F,F,F,F,F,Front,F,Main,3.5410168170929,Volt DC,100,T,2W,T,F,05/23/2022,19:09:27,.798658100
185,0.000199988426175,Amp DC,.001,5.5,F,F,F,F,F,F,Front,F,Main,3.5524668693542,Volt DC,100,T,2W,T,F,05/23/2022,19:09:27,.881437800
186,0.000199988586246,Amp DC,.001,5.5,F,F,F,F,F,F,Front,F,Main,3.5552277565002,Volt DC,100,T,2W,T,F,05/23/2022,19:09:27,.964212460
187,0.0001999895321205,Amp DC,.001,5.5,F,F,F,F,F,F,Front,F,Main,3.5511386394501,Volt DC,100,T,2W,T,F,05/23/2022,19:09:28,.047000540
188,0.0001999883388635,Amp DC,.001,5.5,F,F,F,F,F,F,Front,F,Main,3.5462043285370,Volt DC,100,T,2W,T,F,05/23/2022,19:09:28,.129793640
189,0.0001999882224482,Amp DC,.001,5.5,F,F,F,F,F,F,Front,F,Main,3.5598385334015,Volt DC,100,T,2W,T,F,05/23/2022,19:09:28,.212576500
190,0.0001999877131311,Amp DC,.001,5.5,F,F,F,F,F,F,Front,F,Main,3.5608701705933,Volt DC,100,T,2W,T,F,05/23/2022,19:09:28,.295358660
191,0.0001999882661039,Amp DC,.001,5.5,F,F,F,F,F,F,Front,F,Main,3.5563702583313,Volt DC,100,T,2W,T,F,05/23/2022,19:09:28,.378124720
192,0.0001999881205847,Amp DC,.001,5.5,F,F,F,F,F,F,Front,F,Main,3.5555684566498,Volt DC,100,T,2W,T,F,05/23/2022,19:09:28,.460901360
193,0.0001999879314099,Amp DC,.001,5.5,F,F,F,F,F,F,Front,F,Main,3.5543773174286,Volt DC,100,T,2W,T,F,05/23/2022,19:09:28,.543684960
194,0.0001999890810112,Amp DC,.001,5.5,F,F,F,F,F,F,Front,F,Main,3.5562100410461,Volt DC,100,T,2W,T,F,05/23/2022,19:09:28,.626452800
195,0.000199988586246,Amp DC,.001,5.5,F,F,F,F,F,F,Front,F,Main,3.5505776405334,Volt DC,100,T,2W,T,F,05/23/2022,19:09:28,.709223280
196,0.0001999881787924,Amp DC,.001,5.5,F,F,F,F,F,F,Front,F,Main,3.5516309738159,Volt DC,100,T,2W,T,F,05/23/2022,19:09:28,.792002800
197,0.0001999882661039,Amp DC,.001,5.5,F,F,F,F,F,F,Front,F,Main,3.5524439811707,Volt DC,100,T,2W,T,F,05/23/2022,19:09:28,.874785340
198,0.0001999880623771,Amp DC,.001,5.5,F,F,F,F,F,F,Front,F,Main,3.5521697998047,Volt DC,100,T,2W,T,F,05/23/2022,19:09:28,.957569440
199,0.0001999882224482,Amp DC,.001,5.5,F,F,F,F,F,F,Front,F,Main,3.5515048503876,Volt DC,100,T,2W,T,F,05/23/2022,19:09:29,.040354840
200,0.000199987902306,Amp DC,.001,5.5,F,F,F,F,F,F,Front,F,Main,3.5534732341766,Volt DC,100,T,2W,T,F,05/23/2022,19:09:29,.123121160
201,0.0001999887172133,Amp DC,.001,5.5,F,F,F,F,F,F,Front,F,Main,3.5558087825775,Volt DC,100,T,2W,T,F,05/23/2022,19:09:29,.205893720
202,0.0001999879750656,Amp DC,.001,5.5,F,F,F,F,F,F,Front,F,Main,3.5564837455750,Volt DC,100,T,2W,T,F,05/23/2022,19:09:29,.288688480
203,0.0001999882661039,Amp DC,.001,5.5,F,F,F,F,F,F,Front,F,Main,3.5551223754883,Volt DC,100,T,2W,T,F,05/23/2022,19:09:29,.371464140
204,0.0001999876694754,Amp DC,.001,5.5,F,F,F,F,F,F,Front,F,Main,3.5537719726563,Volt DC,100,T,2W,T,F,05/23/2022,19:09:29,.454255840
205,0.0001999879750656,Amp DC,.001,5.5,F,F,F,F,F,F,Front,F,Main,3.5529365539551,Volt DC,100,T,2W,T,F,05/23/2022,19:09:29,.537030800
206,0.000199987742235,Amp DC,.001,5.5,F,F,F,F,F,F,Front,F,Main,3.5526616573334,Volt DC,100,T,2W,T,F,05/23/2022,19:09:29,.619816880
207,0.0001999876985792,Amp DC,.001,5.5,F,F,F,F,F,F,Front,F,Main,3.5530052185059,Volt DC,100,T,2W,T,F,05/23/2022,19:09:29,.702588320
208,0.000199987742235,Amp DC,.001,5.5,F,F,F,F,F,F,Front,F,Main,3.5520441532135,Volt DC,100,T,2W,T,F,05/23/2022,19:09:29,.785363900
209,0.0001999873056775,Amp DC,.001,5.5,F,F,F,F,F,F,Front,F,Main,3.5548825263977,Volt DC,100,T,2W,T,F,05/23/2022,19:09:29,.868142740
210,0.0001999872038141,Amp DC,.001,5.5,F,F,F,F,F,F,Front,F,Main,3.5542871952057,Volt DC,100,T,2W,T,F,05/23/2022,19:09:29,.950932300
211,0.0001999879896175,Amp DC,.001,5.5,F,F,F,F,F,F,Front,F,Main,3.5555803775787,Volt DC,100,T,2W,T,F,05/23/2022,19:09:30,.033708660
212,0.0001999874220928,Amp DC,.001,5.5,F,F,F,F,F,F,Front,F,Main,3.5551342964172,Volt DC,100,T,2W,T,F,05/23/2022,19:09:30,.116488780
213,0.0001999878440984,Amp DC,.001,5.5,F,F,F,F,F,F,Front,F,Main,3.5521106719971,Volt DC,100,T,2W,T,F,05/23/2022,19:09:30,.199270980
214,0.0001999876112677,Amp DC,.001,5.5,F,F,F,F,F,F,Front,F,Main,3.5528664588928,Volt DC,100,T,2W,T,F,05/23/2022,19:09:30,.282060960
215,0.0001999877567869,Amp DC,.001,5.5,F,F,F,F,F,F,Front,F,Main,3.5541391372681,Volt DC,100,T,2W,T,F,05/23/2022,19:09:30,.364850900
216,0.0001999874220928,Amp DC,.001,5.5,F,F,F,F,F,F,Front,F,Main,3.5540015697479,Volt DC,100,T,2W,T,F,05/23/2022,19:09:30,.447646320
217,0.0001999870291911,Amp DC,.001,5.5,F,F,F,F,F,F,Front,F,Main,3.5539197921753,Volt DC,100,T,2W,T,F,05/23/2022,19:09:30,.530437200
218,0.0001999870728469,Amp DC,.001,5.5,F,F,F,F,F,F,Front,F,Main,3.5521802902222,Volt DC,100,T,2W,T,F,05/23/2022,19:09:30,.613216440
219,0.0001999877858907,Amp DC,.001,5.5,F,F,F,F,F,F,Front,F,Main,3.5555922985077,Volt DC,100,T,2W,T,F,05/23/2022,19:09:30,.695996900
220,0.0001999870146392,Amp DC,.001,5.5,F,F,F,F,F,F,Front,F,Main,3.5561652183533,Volt DC,100,T,2W,T,F,05/23/2022,19:09:30,.778773620
221,0.0001999874803005,Amp DC,.001,5.5,F,F,F,F,F,F,Front,F,Main,3.5488028526306,Volt DC,100,T,2W,T,F,05/23/2022,19:09:30,.861569780
222,0.000199987218366,Amp DC,.001,5.5,F,F,F,F,F,F,Front,F,Main,3.5529012680054,Volt DC,100,T,2W,T,F,05/23/2022,19:09:30,.944340760
223,0.0001999869273277,Amp DC,.001,5.5,F,F,F,F,F,F,Front,F,Main,3.5434670448303,Volt DC,100,T,2W,T,F,05/23/2022,19:09:31,.027126820
224,0.0001999864762183,Amp DC,.001,5.5,F,F,F,F,F,F,Front,F,Main,3.5484018325806,Volt DC,100,T,2W,T,F,05/23/2022,19:09:31,.109917940
225,0.0001999869855354,Amp DC,.001,5.5,F,F,F,F,F,F,Front,F,Main,3.5451617240906,Volt DC,100,T,2W,T,F,05/23/2022,19:09:31,.192710600
226,0.0001999869709834,Amp DC,.001,5.5,F,F,F,F,F,F,Front,F,Main,3.5491337776184,Volt DC,100,T,2W,T,F,05/23/2022,19:09:31,.275485800
227,0.0001999875385081,Amp DC,.001,5.5,F,F,F,F,F,F,Front,F,Main,3.5517227649689,Volt DC,100,T,2W,T,F,05/23/2022,19:09:31,.358266100
228,0.0001999876694754,Amp DC,.001,5.5,F,F,F,F,F,F,Front,F,Main,3.5498003959656,Volt DC,100,T,2W,T,F,05/23/2022,19:09:31,.441040820
229,0.0001999868545681,Amp DC,.001,5.5,F,F,F,F,F,F,Front,F,Main,3.5485160350800,Volt DC,100,T,2W,T,F,05/23/2022,19:09:31,.523831480
230,0.0001999869709834,Amp DC,.001,5.5,F,F,F,F,F,F,Front,F,Main,3.5488927364349,Volt DC,100,T,2W,T,F,05/23/2022,19:09:31,.606612280
231,0.0001999869855354,Amp DC,.001,5.5,F,F,F,F,F,F,Front,F,Main,3.5495467185974,Volt DC,100,T,2W,T,F,05/23/2022,19:09:31,.689388680
232,0.000199986709049,Amp DC,.001,5.5,F,F,F,F,F,F,Front,F,Main,3.5479097366333,Volt DC,100,T,2W,T,F,05/23/2022,19:09:31,.772184520
233,0.0001999871747103,Amp DC,.001,5.5,F,F,F,F,F,F,Front,F,Main,3.5488712787628,Volt DC,100,T,2W,T,F,05/23/2022,19:09:31,.854964700
234,0.000199986883672,Amp DC,.001,5.5,F,F,F,F,F,F,Front,F,Main,3.5453906059265,Volt DC,100,T,2W,T,F,05/23/2022,19:09:31,.937755800
235,0.0001999878149945,Amp DC,.001,5.5,F,F,F,F,F,F,Front,F,Main,3.5450246334076,Volt DC,100,T,2W,T,F,05/23/2022,19:09:32,.020547440
236,0.0001999867381528,Amp DC,.001,5.5,F,F,F,F,F,F,Front,F,Main,3.5536334514618,Volt DC,100,T,2W,T,F,05/23/2022,19:09:32,.103335220
237,0.0001999870146392,Amp DC,.001,5.5,F,F,F,F,F,F,Front,F,Main,3.5494775772095,Volt DC,100,T,2W,T,F,05/23/2022,19:09:32,.186110520
238,0.0001999875821639,Amp DC,.001,5.5,F,F,F,F,F,F,Front,F,Main,3.5330944061279,Volt DC,100,T,2W,T,F,05/23/2022,19:09:32,.268905000
239,0.0001999874220928,Amp DC,.001,5.5,F,F,F,F,F,F,Front,F,Main,3.5371477603912,Volt DC,100,T,2W,T,F,05/23/2022,19:09:32,.351696060
240,0.0001999866071856,Amp DC,.001,5.5,F,F,F,F,F,F,Front,F,Main,3.5469584465027,Volt DC,100,T,2W,T,F,05/23/2022,19:09:32,.434471260
241,0.0001999875385081,Amp DC,.001,5.5,F,F,F,F,F,F,Front,F,Main,3.5509898662567,Volt DC,100,T,2W,T,F,05/23/2022,19:09:32,.517258300
242,0.0001999867963605,Amp DC,.001,5.5,F,F,F,F,F,F,Front,F,Main,3.5491120815277,Volt DC,100,T,2W,T,F,05/23/2022,19:09:32,.600038220
243,0.0001999870728469,Amp DC,.001,5.5,F,F,F,F,F,F,Front,F,Main,3.5484249591827,Volt DC,100,T,2W,T,F,05/23/2022,19:09:32,.682834180
244,0.0001999873347813,Amp DC,.001,5.5,F,F,F,F,F,F,Front,F,Main,3.5506570339203,Volt DC,100,T,2W,T,F,05/23/2022,19:09:32,.765629420
245,0.0001999869855354,Amp DC,.001,5.5,F,F,F,F,F,F,Front,F,Main,3.5519163608551,Volt DC,100,T,2W,T,F,05/23/2022,19:09:32,.848410160
246,0.0001999862870434,Amp DC,.001,5.5,F,F,F,F,F,F,Front,F,Main,3.5529115200043,Volt DC,100,T,2W,T,F,05/23/2022,19:09:32,.931191000
247,0.000199987218366,Amp DC,.001,5.5,F,F,F,F,F,F,Front,F,Main,3.5504519939423,Volt DC,100,T,2W,T,F,05/23/2022,19:09:33,.013960800
248,0.0001999866944971,Amp DC,.001,5.5,F,F,F,F,F,F,Front,F,Main,3.5532672405243,Volt DC,100,T,2W,T,F,05/23/2022,19:09:33,.096731020
249,0.0001999871165026,Amp DC,.001,5.5,F,F,F,F,F,F,Front,F,Main,3.5588321685791,Volt DC,100,T,2W,T,F,05/23/2022,19:09:33,.179504120
250,0.0001999872911256,Amp DC,.001,5.5,F,F,F,F,F,F,Front,F,Main,3.5532438755035,Volt DC,100,T,2W,T,F,05/23/2022,19:09:33,.262290760
251,0.0001999873493332,Amp DC,.001,5.5,F,F,F,F,F,F,Front,F,Main,3.5639028549194,Volt DC,100,T,2W,T,F,05/23/2022,19:09:33,.345070160
252,0.0001999866944971,Amp DC,.001,5.5,F,F,F,F,F,F,Front,F,Main,3.5655636787415,Volt DC,100,T,2W,T,F,05/23/2022,19:09:33,.427871900
253,0.0001999865053222,Amp DC,.001,5.5,F,F,F,F,F,F,Front,F,Main,3.5649235248566,Volt DC,100,T,2W,T,F,05/23/2022,19:09:33,.510649060
254,0.0001999867963605,Amp DC,.001,5.5,F,F,F,F,F,F,Front,F,Main,3.5553977489471,Volt DC,100,T,2W,T,F,05/23/2022,19:09:33,.593428020
255,0.0001999879459618,Amp DC,.001,5.5,F,F,F,F,F,F,Front,F,Main,3.5533709526062,Volt DC,100,T,2W,T,F,05/23/2022,19:09:33,.676190700
256,0.0001999867963605,Amp DC,.001,5.5,F,F,F,F,F,F,Front,F,Main,3.5531756877899,Volt DC,100,T,2W,T,F,05/23/2022,19:09:33,.758969820
257,0.0001999865198741,Amp DC,.001,5.5,F,F,F,F,F,F,Front,F,Main,3.5565419197083,Volt DC,100,T,2W,T,F,05/23/2022,19:09:33,.841761320
258,0.0001999871601583,Amp DC,.001,5.5,F,F,F,F,F,F,Front,F,Main,3.5547785758972,Volt DC,100,T,2W,T,F,05/23/2022,19:09:33,.924542980
259,0.0001999868982239,Amp DC,.001,5.5,F,F,F,F,F,F,Front,F,Main,3.5559453964233,Volt DC,100,T,2W,T,F,05/23/2022,19:09:34,.007321300
260,0.0001999868982239,Amp DC,.001,5.5,F,F,F,F,F,F,Front,F,Main,3.5586032867432,Volt DC,100,T,2W,T,F,05/23/2022,19:09:34,.090094340
261,0.0001999869855354,Amp DC,.001,5.5,F,F,F,F,F,F,Front,F,Main,3.5657594203949,Volt DC,100,T,2W,T,F,05/23/2022,19:09:34,.172893440
262,0.0001999863452511,Amp DC,.001,5.5,F,F,F,F,F,F,Front,F,Main,3.5630564689636,Volt DC,100,T,2W,T,F,05/23/2022,19:09:34,.255682920
263,0.0001999867527047,Amp DC,.001,5.5,F,F,F,F,F,F,Front,F,Main,3.5650715827942,Volt DC,100,T,2W,T,F,05/23/2022,19:09:34,.338453160
264,0.000199986025109,Amp DC,.001,5.5,F,F,F,F,F,F,Front,F,Main,3.5612478256226,Volt DC,100,T,2W,T,F,05/23/2022,19:09:34,.421231740
265,0.0001999866944971,Amp DC,.001,5.5,F,F,F,F,F,F,Front,F,Main,3.5636973381042,Volt DC,100,T,2W,T,F,05/23/2022,19:09:34,.504013400
266,0.0001999861560762,Amp DC,.001,5.5,F,F,F,F,F,F,Front,F,Main,3.5653574466705,Volt DC,100,T,2W,T,F,05/23/2022,19:09:34,.586800180
267,0.0001999868982239,Amp DC,.001,5.5,F,F,F,F,F,F,Front,F,Main,3.5656559467316,Volt DC,100,T,2W,T,F,05/23/2022,19:09:34,.669589100
268,0.0001999864180107,Amp DC,.001,5.5,F,F,F,F,F,F,Front,F,Main,3.5536332130432,Volt DC,100,T,2W,T,F,05/23/2022,19:09:34,.752392780
269,0.000199987392989,Amp DC,.001,5.5,F,F,F,F,F,F,Front,F,Main,3.5503938198090,Volt DC,100,T,2W,T,F,05/23/2022,19:09:34,.835160820
270,0.0001999858941417,Amp DC,.001,5.5,F,F,F,F,F,F,Front,F,Main,3.5519158840179,Volt DC,100,T,2W,T,F,05/23/2022,19:09:34,.917955480
271,0.0001999863743549,Amp DC,.001,5.5,F,F,F,F,F,F,Front,F,Main,3.5508522987366,Volt DC,100,T,2W,T,F,05/23/2022,19:09:35,.000752840
272,0.0001999865635298,Amp DC,.001,5.5,F,F,F,F,F,F,Front,F,Main,3.5492599010468,Volt DC,100,T,2W,T,F,05/23/2022,19:09:35,.083533880
273,0.0001999863743549,Amp DC,.001,5.5,F,F,F,F,F,F,Front,F,Main,3.5503025054932,Volt DC,100,T,2W,T,F,05/23/2022,19:09:35,.166310080
274,0.0001999859232455,Amp DC,.001,5.5,F,F,F,F,F,F,Front,F,Main,3.5506443977356,Volt DC,100,T,2W,T,F,05/23/2022,19:09:35,.249100960
275,0.0001999863452511,Amp DC,.001,5.5,F,F,F,F,F,F,Front,F,Main,3.5525107383728,Volt DC,100,T,2W,T,F,05/23/2022,19:09:35,.331900120
276,0.0001999860687647,Amp DC,.001,5.5,F,F,F,F,F,F,Front,F,Main,3.5517218112946,Volt DC,100,T,2W,T,F,05/23/2022,19:09:35,.414681760
277,0.0001999865780817,Amp DC,.001,5.5,F,F,F,F,F,F,Front,F,Main,3.5517458915710,Volt DC,100,T,2W,T,F,05/23/2022,19:09:35,.497541240
278,0.0001999861997319,Amp DC,.001,5.5,F,F,F,F,F,F,Front,F,Main,3.5503828525543,Volt DC,100,T,2W,T,F,05/23/2022,19:09:35,.580236260
279,0.0001999865198741,Amp DC,.001,5.5,F,F,F,F,F,F,Front,F,Main,3.5523631572723,Volt DC,100,T,2W,T,F,05/23/2022,19:09:35,.663013860
280,0.0001999858795898,Amp DC,.001,5.5,F,F,F,F,F,F,Front,F,Main,3.5495009422302,Volt DC,100,T,2W,T,F,05/23/2022,19:09:35,.745797960
281,0.0001999862142839,Amp DC,.001,5.5,F,F,F,F,F,F,Front,F,Main,3.5493760108948,Volt DC,100,T,2W,T,F,05/23/2022,19:09:35,.828577980
282,0.0001999864762183,Amp DC,.001,5.5,F,F,F,F,F,F,Front,F,Main,3.5491230487823,Volt DC,100,T,2W,T,F,05/23/2022,19:09:35,.911364740
283,0.0001999868545681,Amp DC,.001,5.5,F,F,F,F,F,F,Front,F,Main,3.5500624179840,Volt DC,100,T,2W,T,F,05/23/2022,19:09:35,.994145320
284,0.0001999857486226,Amp DC,.001,5.5,F,F,F,F,F,F,Front,F,Main,3.5505547523499,Volt DC,100,T,2W,T,F,05/23/2022,19:09:36,.076923560
285,0.0001999856467592,Amp DC,.001,5.5,F,F,F,F,F,F,Front,F,Main,3.5506684780121,Volt DC,100,T,2W,T,F,05/23/2022,19:09:36,.159726460
286,0.0001999858650379,Amp DC,.001,5.5,F,F,F,F,F,F,Front,F,Main,3.5506575107574,Volt DC,100,T,2W,T,F,05/23/2022,19:09:36,.242522360
287,0.0001999860687647,Amp DC,.001,5.5,F,F,F,F,F,F,Front,F,Main,3.5497069358826,Volt DC,100,T,2W,T,F,05/23/2022,19:09:36,.325297880
288,0.0001999856176553,Amp DC,.001,5.5,F,F,F,F,F,F,Front,F,Main,3.5502111911774,Volt DC,100,T,2W,T,F,05/23/2022,19:09:36,.408069900
289,0.0001999860687647,Amp DC,.001,5.5,F,F,F,F,F,F,Front,F,Main,3.5505192279816,Volt DC,100,T,2W,T,F,05/23/2022,19:09:36,.490857600
290,0.0001999854139285,Amp DC,.001,5.5,F,F,F,F,F,F,Front,F,Main,3.5507714748383,Volt DC,100,T,2W,T,F,05/23/2022,19:09:36,.573656120
291,0.0001999857340707,Amp DC,.001,5.5,F,F,F,F,F,F,Front,F,Main,3.5510904788971,Volt DC,100,T,2W,T,F,05/23/2022,19:09:36,.656443380
292,0.0001999858650379,Amp DC,.001,5.5,F,F,F,F,F,F,Front,F,Main,3.5495474338531,Volt DC,100,T,2W,T,F,05/23/2022,19:09:36,.739226840
293,0.0001999854721362,Amp DC,.001,5.5,F,F,F,F,F,F,Front,F,Main,3.5498671531677,Volt DC,100,T,2W,T,F,05/23/2022,19:09:36,.821999560
294,0.00019998618518,Amp DC,.001,5.5,F,F,F,F,F,F,Front,F,Main,3.5492832660675,Volt DC,100,T,2W,T,F,05/23/2022,19:09:36,.904786700
295,0.0001999859669013,Amp DC,.001,5.5,F,F,F,F,F,F,Front,F,Main,3.5487921237946,Volt DC,100,T,2W,T,F,05/23/2022,19:09:36,.987570600
296,0.0001999861124204,Amp DC,.001,5.5,F,F,F,F,F,F,Front,F,Main,3.5495932102203,Volt DC,100,T,2W,T,F,05/23/2022,19:09:37,.070343800
297,0.0001999860978685,Amp DC,.001,5.5,F,F,F,F,F,F,Front,F,Main,3.5489747524261,Volt DC,100,T,2W,T,F,05/23/2022,19:09:37,.153133780
298,0.0001999856176553,Amp DC,.001,5.5,F,F,F,F,F,F,Front,F,Main,3.5474414825439,Volt DC,100,T,2W,T,F,05/23/2022,19:09:37,.235913720
299,0.0001999861124204,Amp DC,.001,5.5,F,F,F,F,F,F,Front,F,Main,3.5476336479187,Volt DC,100,T,2W,T,F,05/23/2022,19:09:37,.318711640
300,0.0001999855448958,Amp DC,.001,5.5,F,F,F,F,F,F,Front,F,Main,3.5479094982147,Volt DC,100,T,2W,T,F,05/23/2022,19:09:37,.401503980
301,0.0001999857922783,Amp DC,.001,5.5,F,F,F,F,F,F,Front,F,Main,3.5490882396698,Volt DC,100,T,2W,T,F,05/23/2022,19:09:37,.484287520
302,0.0001999850937864,Amp DC,.001,5.5,F,F,F,F,F,F,Front,F,Main,3.5635366439819,Volt DC,100,T,2W,T,F,05/23/2022,19:09:37,.567071800
303,0.0001999856031034,Amp DC,.001,5.5,F,F,F,F,F,F,Front,F,Main,3.5631587505341,Volt DC,100,T,2W,T,F,05/23/2022,19:09:37,.649862560
304,0.0001999852247536,Amp DC,.001,5.5,F,F,F,F,F,F,Front,F,Main,3.5644164085388,Volt DC,100,T,2W,T,F,05/23/2022,19:09:37,.732654080
305,0.0001999856467592,Amp DC,.001,5.5,F,F,F,F,F,F,Front,F,Main,3.5633995532990,Volt DC,100,T,2W,T,F,05/23/2022,19:09:37,.815438660
306,0.0001999855594477,Amp DC,.001,5.5,F,F,F,F,F,F,Front,F,Main,3.5613851547241,Volt DC,100,T,2W,T,F,05/23/2022,19:09:37,.898215060
307,0.0001999853848247,Amp DC,.001,5.5,F,F,F,F,F,F,Front,F,Main,3.5721819400787,Volt DC,100,T,2W,T,F,05/23/2022,19:09:37,.981002200
308,0.0001999863015953,Amp DC,.001,5.5,F,F,F,F,F,F,Front,F,Main,3.5720784664154,Volt DC,100,T,2W,T,F,05/23/2022,19:09:38,.063801260
309,0.0001999854284804,Amp DC,.001,5.5,F,F,F,F,F,F,Front,F,Main,3.5710937976837,Volt DC,100,T,2W,T,F,05/23/2022,19:09:38,.146570700
310,0.0001999855739996,Amp DC,.001,5.5,F,F,F,F,F,F,Front,F,Main,3.5779631137848,Volt DC,100,T,2W,T,F,05/23/2022,19:09:38,.229360180
311,0.0001999855739996,Amp DC,.001,5.5,F,F,F,F,F,F,Front,F,Main,3.5618646144867,Volt DC,100,T,2W,T,F,05/23/2022,19:09:38,.312155120
312,0.0001999856176553,Amp DC,.001,5.5,F,F,F,F,F,F,Front,F,Main,3.5496618747711,Volt DC,100,T,2W,T,F,05/23/2022,19:09:38,.394944360
313,0.0001999852538574,Amp DC,.001,5.5,F,F,F,F,F,F,Front,F,Main,3.5490555763245,Volt DC,100,T,2W,T,F,05/23/2022,19:09:38,.477732900
314,0.0001999852538574,Amp DC,.001,5.5,F,F,F,F,F,F,Front,F,Main,3.5489296913147,Volt DC,100,T,2W,T,F,05/23/2022,19:09:38,.560518500
315,0.0001999855739996,Amp DC,.001,5.5,F,F,F,F,F,F,Front,F,Main,3.5483005046844,Volt DC,100,T,2W,T,F,05/23/2022,19:09:38,.643308500
316,0.0001999861124204,Amp DC,.001,5.5,F,F,F,F,F,F,Front,F,Main,3.5538294315338,Volt DC,100,T,2W,T,F,05/23/2022,19:09:38,.726097320
317,0.000199985151994,Amp DC,.001,5.5,F,F,F,F,F,F,Front,F,Main,3.5511155128479,Volt DC,100,T,2W,T,F,05/23/2022,19:09:38,.808900140
318,0.0001999851810979,Amp DC,.001,5.5,F,F,F,F,F,F,Front,F,Main,3.5495462417603,Volt DC,100,T,2W,T,F,05/23/2022,19:09:38,.891690220
319,0.0001999856904149,Amp DC,.001,5.5,F,F,F,F,F,F,Front,F,Main,3.5536470413208,Volt DC,100,T,2W,T,F,05/23/2022,19:09:38,.974483020
320,0.0001999856176553,Amp DC,.001,5.5,F,F,F,F,F,F,Front,F,Main,3.5539548397064,Volt DC,100,T,2W,T,F,05/23/2022,19:09:39,.057272000
321,0.0001999855594477,Amp DC,.001,5.5,F,F,F,F,F,F,Front,F,Main,3.5465931892395,Volt DC,100,T,2W,T,F,05/23/2022,19:09:39,.140053580
322,0.0001999859232455,Amp DC,.001,5.5,F,F,F,F,F,F,Front,F,Main,3.5481276512146,Volt DC,100,T,2W,T,F,05/23/2022,19:09:39,.222844280
323,0.0001999854284804,Amp DC,.001,5.5,F,F,F,F,F,F,Front,F,Main,3.5543553829193,Volt DC,100,T,2W,T,F,05/23/2022,19:09:39,.305630640
324,0.0001999856613111,Amp DC,.001,5.5,F,F,F,F,F,F,Front,F,Main,3.5517680644989,Volt DC,100,T,2W,T,F,05/23/2022,19:09:39,.388407480
325,0.0001999848318519,Amp DC,.001,5.5,F,F,F,F,F,F,Front,F,Main,3.5518705844879,Volt DC,100,T,2W,T,F,05/23/2022,19:09:39,.471205880
326,0.0001999850501306,Amp DC,.001,5.5,F,F,F,F,F,F,Front,F,Main,3.5533356666565,Volt DC,100,T,2W,T,F,05/23/2022,19:09:39,.553991800
327,0.0001999850064749,Amp DC,.001,5.5,F,F,F,F,F,F,Front,F,Main,3.5515968799591,Volt DC,100,T,2W,T,F,05/23/2022,19:09:39,.636783780
328,0.0001999853848247,Amp DC,.001,5.5,F,F,F,F,F,F,Front,F,Main,3.5517568588257,Volt DC,100,T,2W,T,F,05/23/2022,19:09:39,.719569940
329,0.0001999848755077,Amp DC,.001,5.5,F,F,F,F,F,F,Front,F,Main,3.5503020286560,Volt DC,100,T,2W,T,F,05/23/2022,19:09:39,.802350320
330,0.0001999851810979,Amp DC,.001,5.5,F,F,F,F,F,F,Front,F,Main,3.5532894134521,Volt DC,100,T,2W,T,F,05/23/2022,19:09:39,.885128180
331,0.0001999848318519,Amp DC,.001,5.5,F,F,F,F,F,F,Front,F,Main,3.5546295642853,Volt DC,100,T,2W,T,F,05/23/2022,19:09:39,.967921480
332,0.0001999850210268,Amp DC,.001,5.5,F,F,F,F,F,F,Front,F,Main,3.5527067184448,Volt DC,100,T,2W,T,F,05/23/2022,19:09:40,.050712140
333,0.0001999856904149,Amp DC,.001,5.5,F,F,F,F,F,F,Front,F,Main,3.5529026985168,Volt DC,100,T,2W,T,F,05/23/2022,19:09:40,.133497720
334,0.00019998413336,Amp DC,.001,5.5,F,F,F,F,F,F,Front,F,Main,3.5532569885254,Volt DC,100,T,2W,T,F,05/23/2022,19:09:40,.216267820
335,0.0001999841770157,Amp DC,.001,5.5,F,F,F,F,F,F,Front,F,Main,3.5466392040253,Volt DC,100,T,2W,T,F,05/23/2022,19:09:40,.299044740
336,0.0001999852247536,Amp DC,.001,5.5,F,F,F,F,F,F,Front,F,Main,3.5494565963745,Volt DC,100,T,2W,T,F,05/23/2022,19:09:40,.381835160
337,0.0001999843661906,Amp DC,.001,5.5,F,F,F,F,F,F,Front,F,Main,3.5551908016205,Volt DC,100,T,2W,T,F,05/23/2022,19:09:40,.464623100
338,0.0001999850064749,Amp DC,.001,5.5,F,F,F,F,F,F,Front,F,Main,3.5535430908203,Volt DC,100,T,2W,T,F,05/23/2022,19:09:40,.547412660
339,0.0001999844243983,Amp DC,.001,5.5,F,F,F,F,F,F,Front,F,Main,3.5515396595001,Volt DC,100,T,2W,T,F,05/23/2022,19:09:40,.630205620
340,0.0001999857922783,Amp DC,.001,5.5,F,F,F,F,F,F,Front,F,Main,3.5558338165283,Volt DC,100,T,2W,T,F,05/23/2022,19:09:40,.712992640
341,0.0001999846135732,Amp DC,.001,5.5,F,F,F,F,F,F,Front,F,Main,3.5502569675446,Volt DC,100,T,2W,T,F,05/23/2022,19:09:40,.795776100
342,0.0001999847736442,Amp DC,.001,5.5,F,F,F,F,F,F,Front,F,Main,3.5504977703094,Volt DC,100,T,2W,T,F,05/23/2022,19:09:40,.878548920
343,0.0001999848609557,Amp DC,.001,5.5,F,F,F,F,F,F,Front,F,Main,3.5543327331543,Volt DC,100,T,2W,T,F,05/23/2022,19:09:40,.961341460
344,0.0001999847299885,Amp DC,.001,5.5,F,F,F,F,F,F,Front,F,Main,3.5547559261322,Volt DC,100,T,2W,T,F,05/23/2022,19:09:41,.044130880
345,0.0001999845990213,Amp DC,.001,5.5,F,F,F,F,F,F,Front,F,Main,3.5588314533234,Volt DC,100,T,2W,T,F,05/23/2022,19:09:41,.126914400
346,0.0001999847008847,Amp DC,.001,5.5,F,F,F,F,F,F,Front,F,Main,3.5491809844971,Volt DC,100,T,2W,T,F,05/23/2022,19:09:41,.209708300
347,0.0001999851083383,Amp DC,.001,5.5,F,F,F,F,F,F,Front,F,Main,3.5479538440704,Volt DC,100,T,2W,T,F,05/23/2022,19:09:41,.292505320
348,0.0001999852393055,Amp DC,.001,5.5,F,F,F,F,F,F,Front,F,Main,3.5493636131287,Volt DC,100,T,2W,T,F,05/23/2022,19:09:41,.375287460
349,0.0001999850646826,Amp DC,.001,5.5,F,F,F,F,F,F,Front,F,Main,3.5498325824738,Volt DC,100,T,2W,T,F,05/23/2022,19:09:41,.458061460
350,0.0001999855448958,Amp DC,.001,5.5,F,F,F,F,F,F,Front,F,Main,3.5497882366180,Volt DC,100,T,2W,T,F,05/23/2022,19:09:41,.540853620
351,0.0001999850937864,Amp DC,.001,5.5,F,F,F,F,F,F,Front,F,Main,3.5475673675537,Volt DC,100,T,2W,T,F,05/23/2022,19:09:41,.623634980
352,0.0001999851374421,Amp DC,.001,5.5,F,F,F,F,F,F,Front,F,Main,3.5475783348083,Volt DC,100,T,2W,T,F,05/23/2022,19:09:41,.706407600
353,0.0001999847299885,Amp DC,.001,5.5,F,F,F,F,F,F,Front,F,Main,3.5477960109711,Volt DC,100,T,2W,T,F,05/23/2022,19:09:41,.789194260
354,0.0001999848173,Amp DC,.001,5.5,F,F,F,F,F,F,Front,F,Main,3.5569434165955,Volt DC,100,T,2W,T,F,05/23/2022,19:09:41,.871993600
355,0.000199985326617,Amp DC,.001,5.5,F,F,F,F,F,F,Front,F,Main,3.5515503883362,Volt DC,100,T,2W,T,F,05/23/2022,19:09:41,.954780600
356,0.0001999855739996,Amp DC,.001,5.5,F,F,F,F,F,F,Front,F,Main,3.5527186393738,Volt DC,100,T,2W,T,F,05/23/2022,19:09:42,.037563700
357,0.0001999847736442,Amp DC,.001,5.5,F,F,F,F,F,F,Front,F,Main,3.5542407035828,Volt DC,100,T,2W,T,F,05/23/2022,19:09:42,.120356400
358,0.0001999849773711,Amp DC,.001,5.5,F,F,F,F,F,F,Front,F,Main,3.5552031993866,Volt DC,100,T,2W,T,F,05/23/2022,19:09:42,.203135960
359,0.0001999843225349,Amp DC,.001,5.5,F,F,F,F,F,F,Front,F,Main,3.5570471286774,Volt DC,100,T,2W,T,F,05/23/2022,19:09:42,.285929620
360,0.0001999847736442,Amp DC,.001,5.5,F,F,F,F,F,F,Front,F,Main,3.5571613311768,Volt DC,100,T,2W,T,F,05/23/2022,19:09:42,.368724400
361,0.0001999844535021,Amp DC,.001,5.5,F,F,F,F,F,F,Front,F,Main,3.5569202899933,Volt DC,100,T,2W,T,F,05/23/2022,19:09:42,.451521680
362,0.0001999849337153,Amp DC,.001,5.5,F,F,F,F,F,F,Front,F,Main,3.5570225715637,Volt DC,100,T,2W,T,F,05/23/2022,19:09:42,.534312580
363,0.0001999846863328,Amp DC,.001,5.5,F,F,F,F,F,F,Front,F,Main,3.5534729957581,Volt DC,100,T,2W,T,F,05/23/2022,19:09:42,.617087360
364,0.0001999852975132,Amp DC,.001,5.5,F,F,F,F,F,F,Front,F,Main,3.5535767078400,Volt DC,100,T,2W,T,F,05/23/2022,19:09:42,.699892000
365,0.0001999846572289,Amp DC,.001,5.5,F,F,F,F,F,F,Front,F,Main,3.5541384220123,Volt DC,100,T,2W,T,F,05/23/2022,19:09:42,.782682820
366,0.0001999846135732,Amp DC,.001,5.5,F,F,F,F,F,F,Front,F,Main,3.5533366203308,Volt DC,100,T,2W,T,F,05/23/2022,19:09:42,.865459140
367,0.0001999845408136,Amp DC,.001,5.5,F,F,F,F,F,F,Front,F,Main,3.5527863502502,Volt DC,100,T,2W,T,F,05/23/2022,19:09:42,.948235540
368,0.0001999849046115,Amp DC,.001,5.5,F,F,F,F,F,F,Front,F,Main,3.5529248714447,Volt DC,100,T,2W,T,F,05/23/2022,19:09:43,.031026880
369,0.0001999845990213,Amp DC,.001,5.5,F,F,F,F,F,F,Front,F,Main,3.5490541458130,Volt DC,100,T,2W,T,F,05/23/2022,19:09:43,.113826520
370,0.0001999848318519,Amp DC,.001,5.5,F,F,F,F,F,F,Front,F,Main,3.5503482818604,Volt DC,100,T,2W,T,F,05/23/2022,19:09:43,.196600700
371,0.0001999844971579,Amp DC,.001,5.5,F,F,F,F,F,F,Front,F,Main,3.5506103038788,Volt DC,100,T,2W,T,F,05/23/2022,19:09:43,.279389540
372,0.0001999855739996,Amp DC,.001,5.5,F,F,F,F,F,F,Front,F,Main,3.5540001392365,Volt DC,100,T,2W,T,F,05/23/2022,19:09:43,.362181460
373,0.0001999844243983,Amp DC,.001,5.5,F,F,F,F,F,F,Front,F,Main,3.5639607906342,Volt DC,100,T,2W,T,F,05/23/2022,19:09:43,.444974220
374,0.0001999847881962,Amp DC,.001,5.5,F,F,F,F,F,F,Front,F,Main,3.5649459362030,Volt DC,100,T,2W,T,F,05/23/2022,19:09:43,.527758620
375,0.0001999844971579,Amp DC,.001,5.5,F,F,F,F,F,F,Front,F,Main,3.5653133392334,Volt DC,100,T,2W,T,F,05/23/2022,19:09:43,.610557060
376,0.0001999851810979,Amp DC,.001,5.5,F,F,F,F,F,F,Front,F,Main,3.5579729080200,Volt DC,100,T,2W,T,F,05/23/2022,19:09:43,.693337680
377,0.0001999854284804,Amp DC,.001,5.5,F,F,F,F,F,F,Front,F,Main,3.5458362102509,Volt DC,100,T,2W,T,F,05/23/2022,19:09:43,.776131060
378,0.0001999849628191,Amp DC,.001,5.5,F,F,F,F,F,F,Front,F,Main,3.5457100868225,Volt DC,100,T,2W,T,F,05/23/2022,19:09:43,.858913020
379,0.0001999848609557,Amp DC,.001,5.5,F,F,F,F,F,F,Front,F,Main,3.5461926460266,Volt DC,100,T,2W,T,F,05/23/2022,19:09:43,.941702420
380,0.0001999852247536,Amp DC,.001,5.5,F,F,F,F,F,F,Front,F,Main,3.5472555160522,Volt DC,100,T,2W,T,F,05/23/2022,19:09:44,.024481940
381,0.000199984642677,Amp DC,.001,5.5,F,F,F,F,F,F,Front,F,Main,3.5518589019775,Volt DC,100,T,2W,T,F,05/23/2022,19:09:44,.107272600
382,0.0001999849191634,Amp DC,.001,5.5,F,F,F,F,F,F,Front,F,Main,3.5545501708984,Volt DC,100,T,2W,T,F,05/23/2022,19:09:44,.190066200
383,0.0001999849191634,Amp DC,.001,5.5,F,F,F,F,F,F,Front,F,Main,3.5491461753845,Volt DC,100,T,2W,T,F,05/23/2022,19:09:44,.272860140
384,0.0001999850646826,Amp DC,.001,5.5,F,F,F,F,F,F,Front,F,Main,3.5490894317627,Volt DC,100,T,2W,T,F,05/23/2022,19:09:44,.355648740
385,0.0001999846572289,Amp DC,.001,5.5,F,F,F,F,F,F,Front,F,Main,3.5496840476990,Volt DC,100,T,2W,T,F,05/23/2022,19:09:44,.438425700
386,0.0001999848755077,Amp DC,.001,5.5,F,F,F,F,F,F,Front,F,Main,3.5492830276489,Volt DC,100,T,2W,T,F,05/23/2022,19:09:44,.521207100
387,0.0001999845553655,Amp DC,.001,5.5,F,F,F,F,F,F,Front,F,Main,3.5494780540466,Volt DC,100,T,2W,T,F,05/23/2022,19:09:44,.603993080
388,0.000199985326617,Amp DC,.001,5.5,F,F,F,F,F,F,Front,F,Main,3.5441076755524,Volt DC,100,T,2W,T,F,05/23/2022,19:09:44,.686778900
389,0.0001999847881962,Amp DC,.001,5.5,F,F,F,F,F,F,Front,F,Main,3.5468451976776,Volt DC,100,T,2W,T,F,05/23/2022,19:09:44,.769556200
390,0.0001999850937864,Amp DC,.001,5.5,F,F,F,F,F,F,Front,F,Main,3.5480241775513,Volt DC,100,T,2W,T,F,05/23/2022,19:09:44,.852361740
391,0.0001999845844693,Amp DC,.001,5.5,F,F,F,F,F,F,Front,F,Main,3.5519618988037,Volt DC,100,T,2W,T,F,05/23/2022,19:09:44,.935145140
392,0.0001999847445404,Amp DC,.001,5.5,F,F,F,F,F,F,Front,F,Main,3.5514914989471,Volt DC,100,T,2W,T,F,05/23/2022,19:09:45,.017933000
393,0.0001999842352234,Amp DC,.001,5.5,F,F,F,F,F,F,Front,F,Main,3.5491893291473,Volt DC,100,T,2W,T,F,05/23/2022,19:09:45,.100719260
394,0.0001999852247536,Amp DC,.001,5.5,F,F,F,F,F,F,Front,F,Main,3.5507137775421,Volt DC,100,T,2W,T,F,05/23/2022,19:09:45,.183518080
395,0.0001999845844693,Amp DC,.001,5.5,F,F,F,F,F,F,Front,F,Main,3.5481159687042,Volt DC,100,T,2W,T,F,05/23/2022,19:09:45,.266309600
396,0.0001999848609557,Amp DC,.001,5.5,F,F,F,F,F,F,Front,F,Main,3.5512194633484,Volt DC,100,T,2W,T,F,05/23/2022,19:09:45,.349105700
397,0.000199985326617,Amp DC,.001,5.5,F,F,F,F,F,F,Front,F,Main,3.5500965118408,Volt DC,100,T,2W,T,F,05/23/2022,19:09:45,.431890580
398,0.0001999847445404,Amp DC,.001,5.5,F,F,F,F,F,F,Front,F,Main,3.5552372932434,Volt DC,100,T,2W,T,F,05/23/2022,19:09:45,.514675540
399,0.0001999846135732,Amp DC,.001,5.5,F,F,F,F,F,F,Front,F,Main,3.5559468269348,Volt DC,100,T,2W,T,F,05/23/2022,19:09:45,.597450700
400,0.0001999850210268,Amp DC,.001,5.5,F,F,F,F,F,F,Front,F,Main,3.5622668266296,Volt DC,100,T,2W,T,F,05/23/2022,19:09:45,.680217860
401,0.0001999848609557,Amp DC,.001,5.5,F,F,F,F,F,F,Front,F,Main,3.5657358169556,Volt DC,100,T,2W,T,F,05/23/2022,19:09:45,.763013400
402,0.0001999847299885,Amp DC,.001,5.5,F,F,F,F,F,F,Front,F,Main,3.5645792484283,Volt DC,100,T,2W,T,F,05/23/2022,19:09:45,.845801280
403,0.0001999847445404,Amp DC,.001,5.5,F,F,F,F,F,F,Front,F,Main,3.5554089546204,Volt DC,100,T,2W,T,F,05/23/2022,19:09:45,.928580600
404,0.0001999860542128,Amp DC,.001,5.5,F,F,F,F,F,F,Front,F,Main,3.5576868057251,Volt DC,100,T,2W,T,F,05/23/2022,19:09:46,.011370860
405,0.0001999850210268,Amp DC,.001,5.5,F,F,F,F,F,F,Front,F,Main,3.5544803142548,Volt DC,100,T,2W,T,F,05/23/2022,19:09:46,.094158120
406,0.0001999845844693,Amp DC,.001,5.5,F,F,F,F,F,F,Front,F,Main,3.5529580116272,Volt DC,100,T,2W,T,F,05/23/2022,19:09:46,.176936880
407,0.0001999842497753,Amp DC,.001,5.5,F,F,F,F,F,F,Front,F,Main,3.5518457889557,Volt DC,100,T,2W,T,F,05/23/2022,19:09:46,.259721140
408,0.0001999846572289,Amp DC,.001,5.5,F,F,F,F,F,F,Front,F,Main,3.5525348186493,Volt DC,100,T,2W,T,F,05/23/2022,19:09:46,.342509580
409,0.0001999842788791,Amp DC,.001,5.5,F,F,F,F,F,F,Front,F,Main,3.5545501708984,Volt DC,100,T,2W,T,F,05/23/2022,19:09:46,.425310300
410,0.0001999839732889,Amp DC,.001,5.5,F,F,F,F,F,F,Front,F,Main,3.5531075000763,Volt DC,100,T,2W,T,F,05/23/2022,19:09:46,.508097020
411,0.0001999855448958,Amp DC,.001,5.5,F,F,F,F,F,F,Front,F,Main,3.5514938831329,Volt DC,100,T,2W,T,F,05/23/2022,19:09:46,.590889920
412,0.0001999845117098,Amp DC,.001,5.5,F,F,F,F,F,F,Front,F,Main,3.5528442859650,Volt DC,100,T,2W,T,F,05/23/2022,19:09:46,.673677080
413,0.0001999845844693,Amp DC,.001,5.5,F,F,F,F,F,F,Front,F,Main,3.5519516468048,Volt DC,100,T,2W,T,F,05/23/2022,19:09:46,.756465920
414,0.0001999847736442,Amp DC,.001,5.5,F,F,F,F,F,F,Front,F,Main,3.5481047630310,Volt DC,100,T,2W,T,F,05/23/2022,19:09:46,.839258660
415,0.0001999843370868,Amp DC,.001,5.5,F,F,F,F,F,F,Front,F,Main,3.5477380752563,Volt DC,100,T,2W,T,F,05/23/2022,19:09:46,.922068080
416,0.0001999848755077,Amp DC,.001,5.5,F,F,F,F,F,F,Front,F,Main,3.5501289367676,Volt DC,100,T,2W,T,F,05/23/2022,19:09:47,.004848300
417,0.0001999845990213,Amp DC,.001,5.5,F,F,F,F,F,F,Front,F,Main,3.5514698028564,Volt DC,100,T,2W,T,F,05/23/2022,19:09:47,.087634640
418,0.0001999853702728,Amp DC,.001,5.5,F,F,F,F,F,F,Front,F,Main,3.5476691722870,Volt DC,100,T,2W,T,F,05/23/2022,19:09:47,.170427860
419,0.000199984468054,Amp DC,.001,5.5,F,F,F,F,F,F,Front,F,Main,3.5482409000397,Volt DC,100,T,2W,T,F,05/23/2022,19:09:47,.253223800
420,0.0001999850937864,Amp DC,.001,5.5,F,F,F,F,F,F,Front,F,Main,3.5486526489258,Volt DC,100,T,2W,T,F,05/23/2022,19:09:47,.336017420
421,0.0001999847445404,Amp DC,.001,5.5,F,F,F,F,F,F,Front,F,Main,3.5458035469055,Volt DC,100,T,2W,T,F,05/23/2022,19:09:47,.418810020
