Style,Standard
Append Mode,1
Fill Mode,1
Capacity,100000
Count,421
Base Time Seconds,1653328942
Base Time Fractional,.803427580
Base Time,05/23/2022 18:02:22.803427580
Index,Reading,Unit,Range Digits,Disp Digits,Math,Start Group,Limit1 High,Limit1 Low,Limit2 High,Limit2 Low,Terminal,Questionable,Origin,Value,Unit,Digits,Output,Sense,Source Limit,Overtemp,Date,Time,Fractional Seconds
1,-1.80682779849e-09,Amp DC,.0000001,5.5,F,F,F,F,F,F,Front,F,Main,-0.0020057819784,Volt DC,100,T,2W,F,F,05/23/2022,18:02:22,.803427580
2,-1.131238103191e-09,Amp DC,.00000001,5.5,F,F,F,F,F,F,Front,F,Main,0.4978503584862,Volt DC,100,T,2W,F,F,05/23/2022,18:02:23,.334016060
3,4.789696195218e-09,Amp DC,.00000001,5.5,F,F,F,F,F,F,Front,F,Main,0.9979696869850,Volt DC,100,T,2W,F,F,05/23/2022,18:02:23,.728890720
4,4.466440994833e-09,Amp DC,.00000001,5.5,F,F,F,F,F,F,Front,F,Main,1.4977691173553,Volt DC,100,T,2W,F,F,05/23/2022,18:02:24,.123749620
5,4.632163541629e-09,Amp DC,.00000001,5.5,F,F,F,F,F,F,Front,F,Main,1.9977512359619,Volt DC,100,T,2W,F,F,05/23/2022,18:02:24,.518630560
6,4.860311264565e-09,Amp DC,.00000001,5.5,F,F,F,F,F,F,Front,F,Main,2.4981563091278,Volt DC,100,T,2W,F,F,05/23/2022,18:02:24,.913505660
7,4.89111906532e-09,Amp DC,.00000001,5.5,F,F,F,F,F,F,Front,F,Main,2.9979674816132,Volt DC,100,T,2W,F,F,05/23/2022,18:02:25,.308378640
8,4.562377586836e-09,Amp DC,.00000001,5.5,F,F,F,F,F,F,Front,F,Main,3.4978563785553,Volt DC,100,T,2W,F,F,05/23/2022,18:02:25,.703232020
9,4.691579569283e-09,Amp DC,.00000001,5.5,F,F,F,F,F,F,Front,F,Main,3.9977014064789,Volt DC,100,T,2W,F,F,05/23/2022,18:02:26,.098091580
10,5.07382402759e-09,Amp DC,.00000001,5.5,F,F,F,F,F,F,Front,F,Main,4.4978766441345,Volt DC,100,T,2W,F,F,05/23/2022,18:02:26,.492944680
11,4.915420070972e-09,Amp DC,.00000001,5.5,F,F,F,F,F,F,Front,F,Main,4.9981575012207,Volt DC,100,T,2W,F,F,05/23/2022,18:02:26,.887809480
12,4.640960504787e-09,Amp DC,.00000001,5.5,F,F,F,F,F,F,Front,F,Main,5.4981865882874,Volt DC,100,T,2W,F,F,05/23/2022,18:02:27,.282679820
13,4.945638565346e-09,Amp DC,.00000001,5.5,F,F,F,F,F,F,Front,F,Main,5.9984745979309,Volt DC,100,T,2W,F,F,05/23/2022,18:02:27,.677553120
14,5.139240588647e-09,Amp DC,.00000001,5.5,F,F,F,F,F,F,Front,F,Main,6.4981470108032,Volt DC,100,T,2W,F,F,05/23/2022,18:02:28,.072410620
15,4.853250246128e-09,Amp DC,.00000001,5.5,F,F,F,F,F,F,Front,F,Main,6.9983506202698,Volt DC,100,T,2W,F,F,05/23/2022,18:02:28,.467288300
16,4.754936000495e-09,Amp DC,.00000001,5.5,F,F,F,F,F,F,Front,F,Main,7.4982743263245,Volt DC,100,T,2W,F,F,05/23/2022,18:02:28,.862156120
17,5.088924392993e-09,Amp DC,.00000001,5.5,F,F,F,F,F,F,Front,F,Main,7.9980845451355,Volt DC,100,T,2W,F,F,05/23/2022,18:02:29,.257034940
18,5.13986853079e-09,Amp DC,.00000001,5.5,F,F,F,F,F,F,Front,F,Main,8.4980878829956,Volt DC,100,T,2W,F,F,05/23/2022,18:02:29,.651903760
19,4.800108310832e-09,Amp DC,.00000001,5.5,F,F,F,F,F,F,Front,F,Main,8.9979448318481,Volt DC,100,T,2W,F,F,05/23/2022,18:02:30,.046773260
20,4.895611027678e-09,Amp DC,.00000001,5.5,F,F,F,F,F,F,Front,F,Main,9.4981651306152,Volt DC,100,T,2W,F,F,05/23/2022,18:02:30,.441653740
21,5.197906549625e-09,Amp DC,.00000001,5.5,F,F,F,F,F,F,Front,F,Main,9.9980258941650,Volt DC,100,T,2W,F,F,05/23/2022,18:02:30,.836520560
22,5.069062947172e-09,Amp DC,.00000001,5.5,F,F,F,F,F,F,Front,F,Main,10.4979124069214,Volt DC,100,T,2W,F,F,05/23/2022,18:02:31,.231395840
23,4.799334263339e-09,Amp DC,.00000001,5.5,F,F,F,F,F,F,Front,F,Main,10.9979839324951,Volt DC,100,T,2W,F,F,05/23/2022,18:02:31,.626250380
24,5.053681473299e-09,Amp DC,.00000001,5.5,F,F,F,F,F,F,Front,F,Main,11.4979038238525,Volt DC,100,T,2W,F,F,05/23/2022,18:02:32,.021112380
25,5.261710622761e-09,Amp DC,.00000001,5.5,F,F,F,F,F,F,Front,F,Main,11.9983224868774,Volt DC,100,T,2W,F,F,05/23/2022,18:02:32,.415998100
26,4.971672407095e-09,Amp DC,.00000001,5.5,F,F,F,F,F,F,Front,F,Main,12.4983205795288,Volt DC,100,T,2W,F,F,05/23/2022,18:02:32,.810864880
27,4.863891511775e-09,Amp DC,.00000001,5.5,F,F,F,F,F,F,Front,F,Main,12.9986324310303,Volt DC,100,T,2W,F,F,05/23/2022,18:02:33,.205726540
28,5.18596099397e-09,Amp DC,.00000001,5.5,F,F,F,F,F,F,Front,F,Main,13.4984025955200,Volt DC,100,T,2W,F,F,05/23/2022,18:02:33,.600600320
29,5.220221588331e-09,Amp DC,.00000001,5.5,F,F,F,F,F,F,Front,F,Main,13.9983701705933,Volt DC,100,T,2W,F,F,05/23/2022,18:02:33,.995462280
30,4.893660143779e-09,Amp DC,.00000001,5.5,F,F,F,F,F,F,Front,F,Main,14.4985132217407,Volt DC,100,T,2W,F,F,05/23/2022,18:02:34,.390334760
31,5.072226638703e-09,Amp DC,.00000001,5.5,F,F,F,F,F,F,Front,F,Main,14.9982833862305,Volt DC,100,T,2W,F,F,05/23/2022,18:02:34,.785186820
32,5.268862235397e-09,Amp DC,.00000001,5.5,F,F,F,F,F,F,Front,F,Main,15.4984550476074,Volt DC,100,T,2W,F,F,05/23/2022,18:02:35,.180069540
33,5.259624291654e-09,Amp DC,.00000001,5.5,F,F,F,F,F,F,Front,F,Main,15.9985656738281,Volt DC,100,T,2W,F,F,05/23/2022,18:02:35,.574905680
34,5.112308798516e-09,Amp DC,.00000001,5.5,F,F,F,F,F,F,Front,F,Main,16.4984283447266,Volt DC,100,T,2W,F,F,05/23/2022,18:02:35,.969775700
35,5.139460856896e-09,Amp DC,.00000001,5.5,F,F,F,F,F,F,Front,F,Main,16.9984970092773,Volt DC,100,T,2W,F,F,05/23/2022,18:02:36,.364663080
36,5.484884102458e-09,Amp DC,.00000001,5.5,F,F,F,F,F,F,Front,F,Main,17.4981937408447,Volt DC,100,T,2W,F,F,05/23/2022,18:02:36,.759542340
37,4.502675565732e-09,Amp DC,.00000001,5.5,F,F,F,F,F,F,Front,F,Main,17.9983768463135,Volt DC,100,T,2W,F,F,05/23/2022,18:02:37,.154415740
38,4.967700473202e-09,Amp DC,.00000001,5.5,F,F,F,F,F,F,Front,F,Main,18.4983558654785,Volt DC,100,T,2W,F,F,05/23/2022,18:02:37,.549257100
39,5.439495964765e-09,Amp DC,.00000001,5.5,F,F,F,F,F,F,Front,F,Main,18.9987220764160,Volt DC,100,T,2W,F,F,05/23/2022,18:02:37,.944111660
40,5.202579256292e-09,Amp DC,.00000001,5.5,F,F,F,F,F,F,Front,F,Main,19.4989719390869,Volt DC,100,T,2W,F,F,05/23/2022,18:02:38,.338983080
41,4.880094106596e-09,Amp DC,.00000001,5.5,F,F,F,F,F,F,Front,F,Main,19.9987010955811,Volt DC,100,T,2W,F,F,05/23/2022,18:02:38,.733853180
42,5.003190750585e-09,Amp DC,.00000001,5.5,F,F,F,F,F,F,Front,F,Main,20.4988117218018,Volt DC,100,T,2W,F,F,05/23/2022,18:02:39,.128733420
43,5.303598449302e-09,Amp DC,.00000001,5.5,F,F,F,F,F,F,Front,F,Main,20.9987087249756,Volt DC,100,T,2W,F,F,05/23/2022,18:02:39,.523596380
44,5.191527208126e-09,Amp DC,.00000001,5.5,F,F,F,F,F,F,Front,F,Main,21.4987106323242,Volt DC,100,T,2W,F,F,05/23/2022,18:02:39,.918469600
45,4.914041618065e-09,Amp DC,.00000001,5.5,F,F,F,F,F,F,Front,F,Main,21.9987621307373,Volt DC,100,T,2W,F,F,05/23/2022,18:02:40,.313348840
46,5.159188187775e-09,Amp DC,.00000001,5.5,F,F,F,F,F,F,Front,F,Main,22.4987010955811,Volt DC,100,T,2W,F,F,05/23/2022,18:02:40,.708230940
47,5.496766153357e-09,Amp DC,.00000001,5.5,F,F,F,F,F,F,Front,F,Main,22.9986381530762,Volt DC,100,T,2W,F,F,05/23/2022,18:02:41,.103098540
48,5.148178772174e-09,Amp DC,.00000001,5.5,F,F,F,F,F,F,Front,F,Main,23.4986572265625,Volt DC,100,T,2W,F,F,05/23/2022,18:02:41,.497945620
49,5.194268570818e-09,Amp DC,.00000001,5.5,F,F,F,F,F,F,Front,F,Main,23.9985656738281,Volt DC,100,T,2W,F,F,05/23/2022,18:02:41,.892810360
50,5.453641094277e-09,Amp DC,.00000001,5.5,F,F,F,F,F,F,Front,F,Main,24.4986343383789,Volt DC,100,T,2W,F,F,05/23/2022,18:02:42,.287694700
51,5.426859850388e-09,Amp DC,.00000001,5.5,F,F,F,F,F,F,Front,F,Main,24.9984149932861,Volt DC,100,T,2W,F,F,05/23/2022,18:02:42,.682569160
52,5.078041098727e-09,Amp DC,.00000001,5.5,F,F,F,F,F,F,Front,F,Main,25.4983692169189,Volt DC,100,T,2W,F,F,05/23/2022,18:02:43,.077431340
53,5.12226572269e-09,Amp DC,.00000001,5.5,F,F,F,F,F,F,Front,F,Main,25.9980297088623,Volt DC,100,T,2W,F,F,05/23/2022,18:02:43,.472300060
54,5.410234482639e-09,Amp DC,.00000001,5.5,F,F,F,F,F,F,Front,F,Main,26.4983520507813,Volt DC,100,T,2W,F,F,05/23/2022,18:02:43,.867170460
55,5.371244782282e-09,Amp DC,.00000001,5.5,F,F,F,F,F,F,Front,F,Main,26.9983177185059,Volt DC,100,T,2W,F,F,05/23/2022,18:02:44,.262022100
56,4.873310199827e-09,Amp DC,.00000001,5.5,F,F,F,F,F,F,Front,F,Main,27.4982032775879,Volt DC,100,T,2W,F,F,05/23/2022,18:02:44,.656906160
57,5.141739034542e-09,Amp DC,.00000001,5.5,F,F,F,F,F,F,Front,F,Main,27.9984378814697,Volt DC,100,T,2W,F,F,05/23/2022,18:02:45,.051779540
58,5.943562975119e-09,Amp DC,.00000001,5.5,F,F,F,F,F,F,Front,F,Main,28.4982204437256,Volt DC,100,T,2W,F,F,05/23/2022,18:02:45,.446634240
59,4.994563429506e-09,Amp DC,.00000001,5.5,F,F,F,F,F,F,Front,F,Main,28.9982585906982,Volt DC,100,T,2W,F,F,05/23/2022,18:02:45,.841501860
60,5.02106667355e-09,Amp DC,.00000001,5.5,F,F,F,F,F,F,Front,F,Main,29.4982261657715,Volt DC,100,T,2W,F,F,05/23/2022,18:02:46,.236362740
61,5.044711759439e-09,Amp DC,.00000001,5.5,F,F,F,F,F,F,Front,F,Main,29.9981594085693,Volt DC,100,T,2W,F,F,05/23/2022,18:02:46,.631243720
62,5.232429156621e-09,Amp DC,.00000001,5.5,F,F,F,F,F,F,Front,F,Main,30.4982490539551,Volt DC,100,T,2W,F,F,05/23/2022,18:02:47,.026108120
63,4.973795597607e-09,Amp DC,.00000001,5.5,F,F,F,F,F,F,Front,F,Main,30.9980201721191,Volt DC,100,T,2W,F,F,05/23/2022,18:02:47,.420974940
64,5.267437153123e-09,Amp DC,.00000001,5.5,F,F,F,F,F,F,Front,F,Main,31.4979991912842,Volt DC,100,T,2W,F,F,05/23/2022,18:02:47,.815872720
65,5.572907468832e-09,Amp DC,.00000001,5.5,F,F,F,F,F,F,Front,F,Main,31.9978713989258,Volt DC,100,T,2W,F,F,05/23/2022,18:02:48,.210736160
66,5.174914274875e-09,Amp DC,.00000001,5.5,F,F,F,F,F,F,Front,F,Main,32.4985580444336,Volt DC,100,T,2W,F,F,05/23/2022,18:02:48,.605584820
67,5.012729342724e-09,Amp DC,.00000001,5.5,F,F,F,F,F,F,Front,F,Main,32.9985923767090,Volt DC,100,T,2W,F,F,05/23/2022,18:02:49,.000449480
68,5.273893322055e-09,Amp DC,.00000001,5.5,F,F,F,F,F,F,Front,F,Main,33.4985160827637,Volt DC,100,T,2W,F,F,05/23/2022,18:02:49,.395318260
69,5.442532202693e-09,Amp DC,.00000001,5.5,F,F,F,F,F,F,Front,F,Main,33.9984588623047,Volt DC,100,T,2W,F,F,05/23/2022,18:02:49,.790174140
70,5.123327539991e-09,Amp DC,.00000001,5.5,F,F,F,F,F,F,Front,F,Main,34.4984169006348,Volt DC,100,T,2W,F,F,05/23/2022,18:02:50,.185054060
71,5.080513343358e-09,Amp DC,.00000001,5.5,F,F,F,F,F,F,Front,F,Main,34.9983558654785,Volt DC,100,T,2W,F,F,05/23/2022,18:02:50,.579921220
72,5.415253578889e-09,Amp DC,.00000001,5.5,F,F,F,F,F,F,Front,F,Main,35.4983978271484,Volt DC,100,T,2W,F,F,05/23/2022,18:02:50,.974801940
73,5.358573584857e-09,Amp DC,.00000001,5.5,F,F,F,F,F,F,Front,F,Main,35.9982070922852,Volt DC,100,T,2W,F,F,05/23/2022,18:02:51,.369678280
74,5.037085415438e-09,Amp DC,.00000001,5.5,F,F,F,F,F,F,Front,F,Main,36.4985122680664,Volt DC,100,T,2W,F,F,05/23/2022,18:02:51,.764552820
75,5.214912057738e-09,Amp DC,.00000001,5.5,F,F,F,F,F,F,Front,F,Main,36.9982032775879,Volt DC,100,T,2W,F,F,05/23/2022,18:02:52,.159405620
76,5.47963940889e-09,Amp DC,.00000001,5.5,F,F,F,F,F,F,Front,F,Main,37.4981918334961,Volt DC,100,T,2W,F,F,05/23/2022,18:02:52,.554253920
77,5.213593112785e-09,Amp DC,.00000001,5.5,F,F,F,F,F,F,Front,F,Main,37.9981117248535,Volt DC,100,T,2W,F,F,05/23/2022,18:02:52,.949096040
78,5.064378250097e-09,Amp DC,.00000001,5.5,F,F,F,F,F,F,Front,F,Main,38.4980812072754,Volt DC,100,T,2W,F,F,05/23/2022,18:02:53,.343939320
79,5.372470024412e-09,Amp DC,.00000001,5.5,F,F,F,F,F,F,Front,F,Main,38.9979248046875,Volt DC,100,T,2W,F,F,05/23/2022,18:02:53,.738811400
80,5.426063598435e-09,Amp DC,.00000001,5.5,F,F,F,F,F,F,Front,F,Main,39.4978179931641,Volt DC,100,T,2W,F,F,05/23/2022,18:02:54,.133673660
81,5.096958410888e-09,Amp DC,.00000001,5.5,F,F,F,F,F,F,Front,F,Main,39.9978637695313,Volt DC,100,T,2W,F,F,05/23/2022,18:02:54,.528553560
82,5.170527117571e-09,Amp DC,.00000001,5.5,F,F,F,F,F,F,Front,F,Main,40.4980659484863,Volt DC,100,T,2W,F,F,05/23/2022,18:02:54,.923419980
83,5.465110142211e-09,Amp DC,.00000001,5.5,F,F,F,F,F,F,Front,F,Main,40.9978485107422,Volt DC,100,T,2W,F,F,05/23/2022,18:02:55,.318302280
84,5.329880981009e-09,Amp DC,.00000001,5.5,F,F,F,F,F,F,Front,F,Main,41.4981193542480,Volt DC,100,T,2W,F,F,05/23/2022,18:02:55,.713189520
85,5.044934248133e-09,Amp DC,.00000001,5.5,F,F,F,F,F,F,Front,F,Main,41.9978446960449,Volt DC,100,T,2W,F,F,05/23/2022,18:02:56,.108067280
86,5.318005147359e-09,Amp DC,.00000001,5.5,F,F,F,F,F,F,Front,F,Main,42.4979324340820,Volt DC,100,T,2W,F,F,05/23/2022,18:02:56,.502950940
87,5.492757804149e-09,Amp DC,.00000001,5.5,F,F,F,F,F,F,Front,F,Main,42.9976997375488,Volt DC,100,T,2W,F,F,05/23/2022,18:02:56,.897814600
88,5.189783269799e-09,Amp DC,.00000001,5.5,F,F,F,F,F,F,Front,F,Main,43.4980659484863,Volt DC,100,T,2W,F,F,05/23/2022,18:02:57,.292677940
89,5.117315016179e-09,Amp DC,.00000001,5.5,F,F,F,F,F,F,Front,F,Main,43.9977226257324,Volt DC,100,T,2W,F,F,05/23/2022,18:02:57,.687532640
90,5.438644201661e-09,Amp DC,.00000001,5.5,F,F,F,F,F,F,Front,F,Main,44.4977111816406,Volt DC,100,T,2W,F,F,05/23/2022,18:02:58,.082410540
91,5.419424020658e-09,Amp DC,.00000001,5.5,F,F,F,F,F,F,Front,F,Main,44.9979324340820,Volt DC,100,T,2W,F,F,05/23/2022,18:02:58,.477280420
92,5.081966847342e-09,Amp DC,.00000001,5.5,F,F,F,F,F,F,Front,F,Main,45.4975051879883,Volt DC,100,T,2W,F,F,05/23/2022,18:02:58,.872152180
93,5.233238287161e-09,Amp DC,.00000001,5.5,F,F,F,F,F,F,Front,F,Main,45.9980354309082,Volt DC,100,T,2W,F,F,05/23/2022,18:02:59,.267047380
94,5.508196565529e-09,Amp DC,.00000001,5.5,F,F,F,F,F,F,Front,F,Main,46.4983100891113,Volt DC,100,T,2W,F,F,05/23/2022,18:02:59,.661944020
95,5.302387418027e-09,Amp DC,.00000001,5.5,F,F,F,F,F,F,Front,F,Main,46.9979057312012,Volt DC,100,T,2W,F,F,05/23/2022,18:03:00,.056806540
96,5.07912423231e-09,Amp DC,.00000001,5.5,F,F,F,F,F,F,Front,F,Main,47.4981002807617,Volt DC,100,T,2W,F,F,05/23/2022,18:03:00,.451672480
97,5.368625100033e-09,Amp DC,.00000001,5.5,F,F,F,F,F,F,Front,F,Main,47.9977264404297,Volt DC,100,T,2W,F,F,05/23/2022,18:03:00,.846534460
98,5.509780187651e-09,Amp DC,.00000001,5.5,F,F,F,F,F,F,Front,F,Main,48.4981803894043,Volt DC,100,T,2W,F,F,05/23/2022,18:03:01,.241402900
99,5.171449490859e-09,Amp DC,.00000001,5.5,F,F,F,F,F,F,Front,F,Main,48.9980392456055,Volt DC,100,T,2W,F,F,05/23/2022,18:03:01,.636261980
100,5.161875371584e-09,Amp DC,.00000001,5.5,F,F,F,F,F,F,Front,F,Main,49.4979324340820,Volt DC,100,T,2W,F,F,05/23/2022,18:03:02,.031152140
101,5.485746523703e-09,Amp DC,.00000001,5.5,F,F,F,F,F,F,Front,F,Main,49.9980278015137,Volt DC,100,T,2W,F,F,05/23/2022,18:03:02,.426049860
102,5.41534284082e-09,Amp DC,.00000001,5.5,F,F,F,F,F,F,Front,F,Main,50.4982109069824,Volt DC,100,T,2W,F,F,05/23/2022,18:03:02,.820908340
103,5.083814258455e-09,Amp DC,.00000001,5.5,F,F,F,F,F,F,Front,F,Main,50.9976844787598,Volt DC,100,T,2W,F,F,05/23/2022,18:03:03,.215785000
104,5.283790294186e-09,Amp DC,.00000001,5.5,F,F,F,F,F,F,Front,F,Main,51.4976615905762,Volt DC,100,T,2W,F,F,05/23/2022,18:03:03,.610664460
105,5.536420211172e-09,Amp DC,.00000001,5.5,F,F,F,F,F,F,Front,F,Main,51.9977607727051,Volt DC,100,T,2W,F,F,05/23/2022,18:03:04,.005537500
106,5.28224264329e-09,Amp DC,.00000001,5.5,F,F,F,F,F,F,Front,F,Main,52.4976043701172,Volt DC,100,T,2W,F,F,05/23/2022,18:03:04,.400396500
107,5.102328337614e-09,Amp DC,.00000001,5.5,F,F,F,F,F,F,Front,F,Main,52.9972915649414,Volt DC,100,T,2W,F,F,05/23/2022,18:03:04,.795284660
108,5.423512750014e-09,Amp DC,.00000001,5.5,F,F,F,F,F,F,Front,F,Main,53.4974517822266,Volt DC,100,T,2W,F,F,05/23/2022,18:03:05,.190169460
109,5.498506094881e-09,Amp DC,.00000001,5.5,F,F,F,F,F,F,Front,F,Main,53.9973754882813,Volt DC,100,T,2W,F,F,05/23/2022,18:03:05,.585025800
110,5.16982501253e-09,Amp DC,.00000001,5.5,F,F,F,F,F,F,Front,F,Main,54.4974517822266,Volt DC,100,T,2W,F,F,05/23/2022,18:03:05,.979905580
111,5.200560426744e-09,Amp DC,.00000001,5.5,F,F,F,F,F,F,Front,F,Main,54.9973487854004,Volt DC,100,T,2W,F,F,05/23/2022,18:03:06,.374757900
112,5.51636247792e-09,Amp DC,.00000001,5.5,F,F,F,F,F,F,Front,F,Main,55.4972763061523,Volt DC,100,T,2W,F,F,05/23/2022,18:03:06,.769629160
113,5.400096370067e-09,Amp DC,.00000001,5.5,F,F,F,F,F,F,Front,F,Main,55.9973716735840,Volt DC,100,T,2W,F,F,05/23/2022,18:03:07,.164484460
114,5.107123612902e-09,Amp DC,.00000001,5.5,F,F,F,F,F,F,Front,F,Main,56.4972190856934,Volt DC,100,T,2W,F,F,05/23/2022,18:03:07,.559360560
115,5.33972155381e-09,Amp DC,.00000001,5.5,F,F,F,F,F,F,Front,F,Main,56.9972076416016,Volt DC,100,T,2W,F,F,05/23/2022,18:03:07,.954241340
116,5.556526794237e-09,Amp DC,.00000001,5.5,F,F,F,F,F,F,Front,F,Main,57.4974555969238,Volt DC,100,T,2W,F,F,05/23/2022,18:03:08,.349097120
117,5.250575974003e-09,Amp DC,.00000001,5.5,F,F,F,F,F,F,Front,F,Main,57.9968643188477,Volt DC,100,T,2W,F,F,05/23/2022,18:03:08,.743966040
118,5.147112069892e-09,Amp DC,.00000001,5.5,F,F,F,F,F,F,Front,F,Main,58.4973106384277,Volt DC,100,T,2W,F,F,05/23/2022,18:03:09,.138827940
119,5.462197361084e-09,Amp DC,.00000001,5.5,F,F,F,F,F,F,Front,F,Main,58.9969978332520,Volt DC,100,T,2W,F,F,05/23/2022,18:03:09,.533711700
120,5.496869626143e-09,Amp DC,.00000001,5.5,F,F,F,F,F,F,Front,F,Main,59.4974174499512,Volt DC,100,T,2W,F,F,05/23/2022,18:03:09,.928579300
121,5.156838511766e-09,Amp DC,.00000001,5.5,F,F,F,F,F,F,Front,F,Main,59.9974098205566,Volt DC,100,T,2W,F,F,05/23/2022,18:03:10,.323435120
122,5.260159863241e-09,Amp DC,.00000001,5.5,F,F,F,F,F,F,Front,F,Main,60.4974708557129,Volt DC,100,T,2W,F,F,05/23/2022,18:03:10,.718304960
123,5.547288406405e-09,Amp DC,.00000001,5.5,F,F,F,F,F,F,Front,F,Main,60.9975013732910,Volt DC,100,T,2W,F,F,05/23/2022,18:03:11,.113168660
124,5.373054445812e-09,Amp DC,.00000001,5.5,F,F,F,F,F,F,Front,F,Main,61.4972419738770,Volt DC,100,T,2W,F,F,05/23/2022,18:03:11,.508035820
125,5.160868621346e-09,Amp DC,.00000001,5.5,F,F,F,F,F,F,Front,F,Main,62.0006027221680,Volt DC,100,T,2W,F,F,05/23/2022,18:03:11,.902911120
126,5.41076783378e-09,Amp DC,.00000001,5.5,F,F,F,F,F,F,Front,F,Main,62.5003776550293,Volt DC,100,T,2W,F,F,05/23/2022,18:03:12,.297761860
127,5.561412219635e-09,Amp DC,.00000001,5.5,F,F,F,F,F,F,Front,F,Main,63.0007553100586,Volt DC,100,T,2W,F,F,05/23/2022,18:03:12,.692620040
128,5.232731137284e-09,Amp DC,.00000001,5.5,F,F,F,F,F,F,Front,F,Main,63.5006256103516,Volt DC,100,T,2W,F,F,05/23/2022,18:03:13,.087489780
129,5.204705999518e-09,Amp DC,.00000001,5.5,F,F,F,F,F,F,Front,F,Main,64.0004272460938,Volt DC,100,T,2W,F,F,05/23/2022,18:03:13,.482376860
130,5.524993795802e-09,Amp DC,.00000001,5.5,F,F,F,F,F,F,Front,F,Main,64.5004959106445,Volt DC,100,T,2W,F,F,05/23/2022,18:03:13,.877269880
131,5.463171248721e-09,Amp DC,.00000001,5.5,F,F,F,F,F,F,Front,F,Main,65.0003738403320,Volt DC,100,T,2W,F,F,05/23/2022,18:03:14,.272138320
132,5.144932924139e-09,Amp DC,.00000001,5.5,F,F,F,F,F,F,Front,F,Main,65.5005264282227,Volt DC,100,T,2W,F,F,05/23/2022,18:03:14,.666999880
133,5.321481921783e-09,Amp DC,.00000001,5.5,F,F,F,F,F,F,Front,F,Main,66.0003738403320,Volt DC,100,T,2W,F,F,05/23/2022,18:03:15,.061857160
134,5.575209183206e-09,Amp DC,.00000001,5.5,F,F,F,F,F,F,Front,F,Main,66.4999237060547,Volt DC,100,T,2W,F,F,05/23/2022,18:03:15,.456732040
135,5.34086774806e-09,Amp DC,.00000001,5.5,F,F,F,F,F,F,Front,F,Main,67.0002746582031,Volt DC,100,T,2W,F,F,05/23/2022,18:03:15,.851600660
136,5.149020321227e-09,Amp DC,.00000001,5.5,F,F,F,F,F,F,Front,F,Main,67.4998626708984,Volt DC,100,T,2W,F,F,05/23/2022,18:03:16,.246483800
137,5.449311224481e-09,Amp DC,.00000001,5.5,F,F,F,F,F,F,Front,F,Main,68.0000762939453,Volt DC,100,T,2W,F,F,05/23/2022,18:03:16,.641351420
138,5.539610103966e-09,Amp DC,.00000001,5.5,F,F,F,F,F,F,Front,F,Main,68.4999160766602,Volt DC,100,T,2W,F,F,05/23/2022,18:03:17,.036220920
139,5.201302499813e-09,Amp DC,.00000001,5.5,F,F,F,F,F,F,Front,F,Main,69.0000991821289,Volt DC,100,T,2W,F,F,05/23/2022,18:03:17,.431093140
140,5.25656318473e-09,Amp DC,.00000001,5.5,F,F,F,F,F,F,Front,F,Main,69.4999465942383,Volt DC,100,T,2W,F,F,05/23/2022,18:03:17,.825940780
141,5.566952232527e-09,Amp DC,.00000001,5.5,F,F,F,F,F,F,Front,F,Main,69.9999389648438,Volt DC,100,T,2W,F,F,05/23/2022,18:03:18,.220802740
142,5.440524919464e-09,Amp DC,.00000001,5.5,F,F,F,F,F,F,Front,F,Main,70.4996795654297,Volt DC,100,T,2W,F,F,05/23/2022,18:03:18,.615656280
143,5.147307025055e-09,Amp DC,.00000001,5.5,F,F,F,F,F,F,Front,F,Main,70.9998245239258,Volt DC,100,T,2W,F,F,05/23/2022,18:03:19,.010519460
144,5.379309442333e-09,Amp DC,.00000001,5.5,F,F,F,F,F,F,Front,F,Main,71.4994888305664,Volt DC,100,T,2W,F,F,05/23/2022,18:03:19,.405391500
145,5.597183161399e-09,Amp DC,.00000001,5.5,F,F,F,F,F,F,Front,F,Main,71.9997329711914,Volt DC,100,T,2W,F,F,05/23/2022,18:03:19,.800256760
146,5.29746779776e-09,Amp DC,.00000001,5.5,F,F,F,F,F,F,Front,F,Main,72.4996337890625,Volt DC,100,T,2W,F,F,05/23/2022,18:03:20,.195140540
147,5.191922891612e-09,Amp DC,.00000001,5.5,F,F,F,F,F,F,Front,F,Main,73.0002517700195,Volt DC,100,T,2W,F,F,05/23/2022,18:03:20,.590011720
148,5.502775124455e-09,Amp DC,.00000001,5.5,F,F,F,F,F,F,Front,F,Main,73.4999465942383,Volt DC,100,T,2W,F,F,05/23/2022,18:03:20,.984882520
149,5.536175073928e-09,Amp DC,.00000001,5.5,F,F,F,F,F,F,Front,F,Main,74.0001220703125,Volt DC,100,T,2W,F,F,05/23/2022,18:03:21,.379737740
150,5.195572860828e-09,Amp DC,.00000001,5.5,F,F,F,F,F,F,Front,F,Main,74.4999313354492,Volt DC,100,T,2W,F,F,05/23/2022,18:03:21,.774584780
151,5.295457405907e-09,Amp DC,.00000001,5.5,F,F,F,F,F,F,Front,F,Main,74.9998321533203,Volt DC,100,T,2W,F,F,05/23/2022,18:03:22,.169475860
152,5.591884288947e-09,Amp DC,.00000001,5.5,F,F,F,F,F,F,Front,F,Main,75.4997940063477,Volt DC,100,T,2W,F,F,05/23/2022,18:03:22,.564338960
153,5.421280757645e-09,Amp DC,.00000001,5.5,F,F,F,F,F,F,Front,F,Main,75.9997100830078,Volt DC,100,T,2W,F,F,05/23/2022,18:03:22,.959201700
154,5.168468319994e-09,Amp DC,.00000001,5.5,F,F,F,F,F,F,Front,F,Main,76.4996185302734,Volt DC,100,T,2W,F,F,05/23/2022,18:03:23,.354054060
155,5.445256689995e-09,Amp DC,.00000001,5.5,F,F,F,F,F,F,Front,F,Main,77.0002365112305,Volt DC,100,T,2W,F,F,05/23/2022,18:03:23,.748909300
156,5.594213536853e-09,Amp DC,.00000001,5.5,F,F,F,F,F,F,Front,F,Main,77.4994049072266,Volt DC,100,T,2W,F,F,05/23/2022,18:03:24,.143793780
157,5.297386085346e-09,Amp DC,.00000001,5.5,F,F,F,F,F,F,Front,F,Main,77.9996566772461,Volt DC,100,T,2W,F,F,05/23/2022,18:03:24,.538659280
158,5.213826703709e-09,Amp DC,.00000001,5.5,F,F,F,F,F,F,Front,F,Main,78.4992294311523,Volt DC,100,T,2W,F,F,05/23/2022,18:03:24,.933544300
159,5.542960757055e-09,Amp DC,.00000001,5.5,F,F,F,F,F,F,Front,F,Main,78.9996032714844,Volt DC,100,T,2W,F,F,05/23/2022,18:03:25,.328417980
160,5.532420299659e-09,Amp DC,.00000001,5.5,F,F,F,F,F,F,Front,F,Main,79.4994277954102,Volt DC,100,T,2W,F,F,05/23/2022,18:03:25,.723288520
161,5.203625974559e-09,Amp DC,.00000001,5.5,F,F,F,F,F,F,Front,F,Main,79.9993820190430,Volt DC,100,T,2W,F,F,05/23/2022,18:03:26,.118157300
162,5.326658225613e-09,Amp DC,.00000001,5.5,F,F,F,F,F,F,Front,F,Main,80.4994812011719,Volt DC,100,T,2W,F,F,05/23/2022,18:03:26,.513029020
163,5.606949127213e-09,Amp DC,.00000001,5.5,F,F,F,F,F,F,Front,F,Main,80.9994964599609,Volt DC,100,T,2W,F,F,05/23/2022,18:03:26,.907897580
164,5.414619863586e-09,Amp DC,.00000001,5.5,F,F,F,F,F,F,Front,F,Main,81.4992752075195,Volt DC,100,T,2W,F,F,05/23/2022,18:03:27,.302757280
165,5.179077611217e-09,Amp DC,.00000001,5.5,F,F,F,F,F,F,Front,F,Main,81.9991455078125,Volt DC,100,T,2W,F,F,05/23/2022,18:03:27,.697625160
166,5.479194875591e-09,Amp DC,.00000001,5.5,F,F,F,F,F,F,Front,F,Main,82.4994201660156,Volt DC,100,T,2W,F,F,05/23/2022,18:03:28,.092487680
167,5.605305108958e-09,Amp DC,.00000001,5.5,F,F,F,F,F,F,Front,F,Main,82.9993362426758,Volt DC,100,T,2W,F,F,05/23/2022,18:03:28,.487364460
168,5.276583614489e-09,Amp DC,.00000001,5.5,F,F,F,F,F,F,Front,F,Main,83.4988632202148,Volt DC,100,T,2W,F,F,05/23/2022,18:03:28,.882232720
169,5.263308455739e-09,Amp DC,.00000001,5.5,F,F,F,F,F,F,Front,F,Main,83.9992828369141,Volt DC,100,T,2W,F,F,05/23/2022,18:03:29,.277101160
170,5.57639268095e-09,Amp DC,.00000001,5.5,F,F,F,F,F,F,Front,F,Main,84.4990005493164,Volt DC,100,T,2W,F,F,05/23/2022,18:03:29,.671975520
171,5.526340274287e-09,Amp DC,.00000001,5.5,F,F,F,F,F,F,Front,F,Main,84.9992599487305,Volt DC,100,T,2W,F,F,05/23/2022,18:03:30,.066854380
172,5.197642760635e-09,Amp DC,.00000001,5.5,F,F,F,F,F,F,Front,F,Main,85.4990615844727,Volt DC,100,T,2W,F,F,05/23/2022,18:03:30,.461728760
173,5.371089795148e-09,Amp DC,.00000001,5.5,F,F,F,F,F,F,Front,F,Main,85.9990081787109,Volt DC,100,T,2W,F,F,05/23/2022,18:03:30,.856599280
174,5.635919730906e-09,Amp DC,.00000001,5.5,F,F,F,F,F,F,Front,F,Main,86.4992675781250,Volt DC,100,T,2W,F,F,05/23/2022,18:03:31,.251473720
175,5.384805046305e-09,Amp DC,.00000001,5.5,F,F,F,F,F,F,Front,F,Main,86.9991455078125,Volt DC,100,T,2W,F,F,05/23/2022,18:03:31,.646353060
176,5.204556341454e-09,Amp DC,.00000001,5.5,F,F,F,F,F,F,Front,F,Main,87.4990692138672,Volt DC,100,T,2W,F,F,05/23/2022,18:03:32,.041204400
177,5.514718459665e-09,Amp DC,.00000001,5.5,F,F,F,F,F,F,Front,F,Main,87.9994354248047,Volt DC,100,T,2W,F,F,05/23/2022,18:03:32,.436071220
178,5.592894591899e-09,Amp DC,.00000001,5.5,F,F,F,F,F,F,Front,F,Main,88.4990463256836,Volt DC,100,T,2W,F,F,05/23/2022,18:03:32,.830944860
179,5.268867120378e-09,Amp DC,.00000001,5.5,F,F,F,F,F,F,Front,F,Main,88.9995651245117,Volt DC,100,T,2W,F,F,05/23/2022,18:03:33,.225808620
180,5.298737448811e-09,Amp DC,.00000001,5.5,F,F,F,F,F,F,Front,F,Main,89.4995346069336,Volt DC,100,T,2W,F,F,05/23/2022,18:03:33,.620686000
181,5.606314967821e-09,Amp DC,.00000001,5.5,F,F,F,F,F,F,Front,F,Main,89.9990692138672,Volt DC,100,T,2W,F,F,05/23/2022,18:03:34,.015555760
182,5.504364963826e-09,Amp DC,.00000001,5.5,F,F,F,F,F,F,Front,F,Main,90.4989013671875,Volt DC,100,T,2W,F,F,05/23/2022,18:03:34,.410415320
183,5.201921116083e-09,Amp DC,.00000001,5.5,F,F,F,F,F,F,Front,F,Main,90.9992446899414,Volt DC,100,T,2W,F,F,05/23/2022,18:03:34,.805291020
184,5.416191939389e-09,Amp DC,.00000001,5.5,F,F,F,F,F,F,Front,F,Main,91.4990615844727,Volt DC,100,T,2W,F,F,05/23/2022,18:03:35,.200159880
185,5.64462343533e-09,Amp DC,.00000001,5.5,F,F,F,F,F,F,Front,F,Main,91.9989089965820,Volt DC,100,T,2W,F,F,05/23/2022,18:03:35,.595002060
186,5.361601829179e-09,Amp DC,.00000001,5.5,F,F,F,F,F,F,Front,F,Main,92.4988098144531,Volt DC,100,T,2W,F,F,05/23/2022,18:03:35,.989857640
187,5.239220168818e-09,Amp DC,.00000001,5.5,F,F,F,F,F,F,Front,F,Main,92.9994277954102,Volt DC,100,T,2W,F,F,05/23/2022,18:03:36,.384730220
188,5.545502723692e-09,Amp DC,.00000001,5.5,F,F,F,F,F,F,Front,F,Main,93.4988784790039,Volt DC,100,T,2W,F,F,05/23/2022,18:03:36,.779610820
189,5.587382112537e-09,Amp DC,.00000001,5.5,F,F,F,F,F,F,Front,F,Main,93.9990615844727,Volt DC,100,T,2W,F,F,05/23/2022,18:03:37,.174477040
190,5.245264222964e-09,Amp DC,.00000001,5.5,F,F,F,F,F,F,Front,F,Main,94.4986114501953,Volt DC,100,T,2W,F,F,05/23/2022,18:03:37,.569352080
191,5.344286790887e-09,Amp DC,.00000001,5.5,F,F,F,F,F,F,Front,F,Main,94.9990997314453,Volt DC,100,T,2W,F,F,05/23/2022,18:03:37,.964205940
192,5.630088839581e-09,Amp DC,.00000001,5.5,F,F,F,F,F,F,Front,F,Main,95.4984817504883,Volt DC,100,T,2W,F,F,05/23/2022,18:03:38,.359078120
193,5.547422521346e-09,Amp DC,.00000001,5.5,F,F,F,F,F,F,Front,F,Main,95.9987716674805,Volt DC,100,T,2W,F,F,05/23/2022,18:03:38,.753929100
194,5.314304551973e-09,Amp DC,.00000001,5.5,F,F,F,F,F,F,Front,F,Main,96.4992141723633,Volt DC,100,T,2W,F,F,05/23/2022,18:03:39,.148801720
195,5.365826005743e-09,Amp DC,.00000001,5.5,F,F,F,F,F,F,Front,F,Main,96.9987564086914,Volt DC,100,T,2W,F,F,05/23/2022,18:03:39,.543678720
196,5.630800714584e-09,Amp DC,.00000001,5.5,F,F,F,F,F,F,Front,F,Main,97.4987564086914,Volt DC,100,T,2W,F,F,05/23/2022,18:03:39,.938554060
197,5.328028684914e-09,Amp DC,.00000001,5.5,F,F,F,F,F,F,Front,F,Main,97.9985961914063,Volt DC,100,T,2W,F,F,05/23/2022,18:03:40,.333409100
198,5.266099112333e-09,Amp DC,.00000001,5.5,F,F,F,F,F,F,Front,F,Main,98.4983978271484,Volt DC,100,T,2W,F,F,05/23/2022,18:03:40,.728278020
199,5.59516477594e-09,Amp DC,.00000001,5.5,F,F,F,F,F,F,Front,F,Main,98.9986419677734,Volt DC,100,T,2W,F,F,05/23/2022,18:03:41,.123126920
200,5.555082172037e-09,Amp DC,.00000001,5.5,F,F,F,F,F,F,Front,F,Main,99.4982376098633,Volt DC,100,T,2W,F,F,05/23/2022,18:03:41,.517966860
201,5.24899856913e-09,Amp DC,.00000001,5.5,F,F,F,F,F,F,Front,F,Main,99.9991302490234,Volt DC,100,T,2W,F,F,05/23/2022,18:03:41,.912826160
202,5.393297364265e-09,Amp DC,.00000001,5.5,F,F,F,F,F,F,Front,F,Main,100.4988403320313,Volt DC,100,T,2W,F,F,05/23/2022,18:03:42,.307698040
203,5.662031732356e-09,Amp DC,.00000001,5.5,F,F,F,F,F,F,Front,F,Main,100.9990768432617,Volt DC,100,T,2W,F,F,05/23/2022,18:03:42,.702554320
204,5.414563020167e-09,Amp DC,.00000001,5.5,F,F,F,F,F,F,Front,F,Main,101.4986877441406,Volt DC,100,T,2W,F,F,05/23/2022,18:03:43,.097413040
205,5.241442835313e-09,Amp DC,.00000001,5.5,F,F,F,F,F,F,Front,F,Main,101.9990844726563,Volt DC,100,T,2W,F,F,05/23/2022,18:03:43,.492290820
206,5.538649983095e-09,Amp DC,.00000001,5.5,F,F,F,F,F,F,Front,F,Main,102.4986343383789,Volt DC,100,T,2W,F,F,05/23/2022,18:03:43,.887144820
207,5.629860577727e-09,Amp DC,.00000001,5.5,F,F,F,F,F,F,Front,F,Main,102.9987030029297,Volt DC,100,T,2W,F,F,05/23/2022,18:03:44,.282017140
208,5.334419572733e-09,Amp DC,.00000001,5.5,F,F,F,F,F,F,Front,F,Main,103.4986114501953,Volt DC,100,T,2W,F,F,05/23/2022,18:03:44,.676890800
209,5.399964031483e-09,Amp DC,.00000001,5.5,F,F,F,F,F,F,Front,F,Main,103.9983291625977,Volt DC,100,T,2W,F,F,05/23/2022,18:03:45,.071761940
210,5.607402098207e-09,Amp DC,.00000001,5.5,F,F,F,F,F,F,Front,F,Main,104.4984664916992,Volt DC,100,T,2W,F,F,05/23/2022,18:03:45,.466621980
211,5.502970523708e-09,Amp DC,.00000001,5.5,F,F,F,F,F,F,Front,F,Main,104.9989700317383,Volt DC,100,T,2W,F,F,05/23/2022,18:03:45,.861472960
212,5.22035170647e-09,Amp DC,.00000001,5.5,F,F,F,F,F,F,Front,F,Main,105.4983673095703,Volt DC,100,T,2W,F,F,05/23/2022,18:03:46,.256344120
213,5.473405728651e-09,Amp DC,.00000001,5.5,F,F,F,F,F,F,Front,F,Main,105.9984130859375,Volt DC,100,T,2W,F,F,05/23/2022,18:03:46,.651207060
214,5.66707125671e-09,Amp DC,.00000001,5.5,F,F,F,F,F,F,Front,F,Main,106.4981460571289,Volt DC,100,T,2W,F,F,05/23/2022,18:03:47,.046084360
215,5.38984368248e-09,Amp DC,.00000001,5.5,F,F,F,F,F,F,Front,F,Main,106.9984588623047,Volt DC,100,T,2W,F,F,05/23/2022,18:03:47,.440942060
216,5.283258275313e-09,Amp DC,.00000001,5.5,F,F,F,F,F,F,Front,F,Main,107.4984283447266,Volt DC,100,T,2W,F,F,05/23/2022,18:03:47,.835804460
217,5.604321895447e-09,Amp DC,.00000001,5.5,F,F,F,F,F,F,Front,F,Main,107.9982299804688,Volt DC,100,T,2W,F,F,05/23/2022,18:03:48,.230664520
218,5.594321006441e-09,Amp DC,.00000001,5.5,F,F,F,F,F,F,Front,F,Main,108.4982223510742,Volt DC,100,T,2W,F,F,05/23/2022,18:03:48,.625526600
219,5.26911358989e-09,Amp DC,.00000001,5.5,F,F,F,F,F,F,Front,F,Main,108.9984970092773,Volt DC,100,T,2W,F,F,05/23/2022,18:03:49,.020406180
220,5.385074164366e-09,Amp DC,.00000001,5.5,F,F,F,F,F,F,Front,F,Main,109.4978942871094,Volt DC,100,T,2W,F,F,05/23/2022,18:03:49,.415266020
221,5.678153502942e-09,Amp DC,.00000001,5.5,F,F,F,F,F,F,Front,F,Main,109.9982833862305,Volt DC,100,T,2W,F,F,05/23/2022,18:03:49,.810138260
222,5.490965016008e-09,Amp DC,.00000001,5.5,F,F,F,F,F,F,Front,F,Main,110.4978179931641,Volt DC,100,T,2W,F,F,05/23/2022,18:03:50,.205009320
223,5.242818623685e-09,Amp DC,.00000001,5.5,F,F,F,F,F,F,Front,F,Main,110.9982452392578,Volt DC,100,T,2W,F,F,05/23/2022,18:03:50,.599882800
224,5.515663037414e-09,Amp DC,.00000001,5.5,F,F,F,F,F,F,Front,F,Main,111.4976959228516,Volt DC,100,T,2W,F,F,05/23/2022,18:03:50,.994747000
225,5.680037773459e-09,Amp DC,.00000001,5.5,F,F,F,F,F,F,Front,F,Main,111.9976959228516,Volt DC,100,T,2W,F,F,05/23/2022,18:03:51,.389611980
226,5.369098499131e-09,Amp DC,.00000001,5.5,F,F,F,F,F,F,Front,F,Main,112.4977188110352,Volt DC,100,T,2W,F,F,05/23/2022,18:03:51,.784489700
227,5.309790829244e-09,Amp DC,.00000001,5.5,F,F,F,F,F,F,Front,F,Main,112.9981994628906,Volt DC,100,T,2W,F,F,05/23/2022,18:03:52,.179337640
228,5.629503085913e-09,Amp DC,.00000001,5.5,F,F,F,F,F,F,Front,F,Main,113.4984588623047,Volt DC,100,T,2W,F,F,05/23/2022,18:03:52,.574191820
229,5.599540386925e-09,Amp DC,.00000001,5.5,F,F,F,F,F,F,Front,F,Main,113.9980926513672,Volt DC,100,T,2W,F,F,05/23/2022,18:03:52,.969066760
230,5.283670834189e-09,Amp DC,.00000001,5.5,F,F,F,F,F,F,Front,F,Main,114.4983139038086,Volt DC,100,T,2W,F,F,05/23/2022,18:03:53,.363926160
231,5.397439384325e-09,Amp DC,.00000001,5.5,F,F,F,F,F,F,Front,F,Main,114.9982833862305,Volt DC,100,T,2W,F,F,05/23/2022,18:03:53,.758792440
232,5.677048164898e-09,Amp DC,.00000001,5.5,F,F,F,F,F,F,Front,F,Main,115.4978027343750,Volt DC,100,T,2W,F,F,05/23/2022,18:03:54,.153652540
233,5.520492951661e-09,Amp DC,.00000001,5.5,F,F,F,F,F,F,Front,F,Main,115.9984893798828,Volt DC,100,T,2W,F,F,05/23/2022,18:03:54,.548511980
234,5.242015710394e-09,Amp DC,.00000001,5.5,F,F,F,F,F,F,Front,F,Main,116.4977951049805,Volt DC,100,T,2W,F,F,05/23/2022,18:03:54,.943377900
235,5.526998414496e-09,Amp DC,.00000001,5.5,F,F,F,F,F,F,Front,F,Main,116.9983367919922,Volt DC,100,T,2W,F,F,05/23/2022,18:03:55,.338234200
236,5.684761106295e-09,Amp DC,.00000001,5.5,F,F,F,F,F,F,Front,F,Main,117.4976272583008,Volt DC,100,T,2W,F,F,05/23/2022,18:03:55,.733096840
237,5.395055957536e-09,Amp DC,.00000001,5.5,F,F,F,F,F,F,Front,F,Main,117.9978256225586,Volt DC,100,T,2W,F,F,05/23/2022,18:03:56,.127968420
238,5.298971927914e-09,Amp DC,.00000001,5.5,F,F,F,F,F,F,Front,F,Main,118.4978561401367,Volt DC,100,T,2W,F,F,05/23/2022,18:03:56,.522832300
239,5.618332021839e-09,Amp DC,.00000001,5.5,F,F,F,F,F,F,Front,F,Main,118.9977340698242,Volt DC,100,T,2W,F,F,05/23/2022,18:03:56,.917707840
240,5.625723886737e-09,Amp DC,.00000001,5.5,F,F,F,F,F,F,Front,F,Main,119.4976577758789,Volt DC,100,T,2W,F,F,05/23/2022,18:03:57,.312581880
241,5.30243049468e-09,Amp DC,.00000001,5.5,F,F,F,F,F,F,Front,F,Main,119.9977340698242,Volt DC,100,T,2W,F,F,05/23/2022,18:03:57,.707434520
242,5.397484237335e-09,Amp DC,.00000001,5.5,F,F,F,F,F,F,Front,F,Main,120.4975204467773,Volt DC,100,T,2W,F,F,05/23/2022,18:03:58,.102295680
243,5.689032356315e-09,Amp DC,.00000001,5.5,F,F,F,F,F,F,Front,F,Main,120.9976348876953,Volt DC,100,T,2W,F,F,05/23/2022,18:03:58,.497159160
244,5.531371805034e-09,Amp DC,.00000001,5.5,F,F,F,F,F,F,Front,F,Main,121.4979095458984,Volt DC,100,T,2W,F,F,05/23/2022,18:03:58,.892020680
245,5.251604040524e-09,Amp DC,.00000001,5.5,F,F,F,F,F,F,Front,F,Main,121.9975128173828,Volt DC,100,T,2W,F,F,05/23/2022,18:03:59,.286900700
246,5.509180667218e-09,Amp DC,.00000001,5.5,F,F,F,F,F,F,Front,F,Main,122.4969787597656,Volt DC,100,T,2W,F,F,05/23/2022,18:03:59,.681764260
247,5.715280249063e-09,Amp DC,.00000001,5.5,F,F,F,F,F,F,Front,F,Main,122.9974746704102,Volt DC,100,T,2W,F,F,05/23/2022,18:04:00,.076629340
248,5.399327207556e-09,Amp DC,.00000001,5.5,F,F,F,F,F,F,Front,F,Main,123.4970245361328,Volt DC,100,T,2W,F,F,05/23/2022,18:04:00,.471466860
249,5.326863838917e-09,Amp DC,.00000001,5.5,F,F,F,F,F,F,Front,F,Main,123.9973068237305,Volt DC,100,T,2W,F,F,05/23/2022,18:04:00,.866323060
250,5.633986610576e-09,Amp DC,.00000001,5.5,F,F,F,F,F,F,Front,F,Main,124.4972000122070,Volt DC,100,T,2W,F,F,05/23/2022,18:04:01,.261195340
251,5.634817057398e-09,Amp DC,.00000001,5.5,F,F,F,F,F,F,Front,F,Main,124.9974899291992,Volt DC,100,T,2W,F,F,05/23/2022,18:04:01,.656055500
252,5.294714888748e-09,Amp DC,.00000001,5.5,F,F,F,F,F,F,Front,F,Main,125.4970245361328,Volt DC,100,T,2W,F,F,05/23/2022,18:04:02,.050923320
253,5.408846259769e-09,Amp DC,.00000001,5.5,F,F,F,F,F,F,Front,F,Main,125.9968414306641,Volt DC,100,T,2W,F,F,05/23/2022,18:04:02,.445789080
254,5.701031202676e-09,Amp DC,.00000001,5.5,F,F,F,F,F,F,Front,F,Main,126.4969329833984,Volt DC,100,T,2W,F,F,05/23/2022,18:04:02,.840634460
255,5.564341432063e-09,Amp DC,.00000001,5.5,F,F,F,F,F,F,Front,F,Main,126.9976882934570,Volt DC,100,T,2W,F,F,05/23/2022,18:04:03,.235497380
256,5.255431201334e-09,Amp DC,.00000001,5.5,F,F,F,F,F,F,Front,F,Main,127.4972076416016,Volt DC,100,T,2W,F,F,05/23/2022,18:04:03,.630367640
257,5.553763227084e-09,Amp DC,.00000001,5.5,F,F,F,F,F,F,Front,F,Main,127.9973983764648,Volt DC,100,T,2W,F,F,05/23/2022,18:04:04,.025234480
258,5.707963435242e-09,Amp DC,.00000001,5.5,F,F,F,F,F,F,Front,F,Main,128.4974365234375,Volt DC,100,T,2W,F,F,05/23/2022,18:04:04,.420084740
259,5.395223379168e-09,Amp DC,.00000001,5.5,F,F,F,F,F,F,Front,F,Main,128.9974060058594,Volt DC,100,T,2W,F,F,05/23/2022,18:04:04,.814952660
260,5.318999019011e-09,Amp DC,.00000001,5.5,F,F,F,F,F,F,Front,F,Main,129.4971923828125,Volt DC,100,T,2W,F,F,05/23/2022,18:04:05,.209827740
261,5.652481593899e-09,Amp DC,.00000001,5.5,F,F,F,F,F,F,Front,F,Main,129.9971618652344,Volt DC,100,T,2W,F,F,05/23/2022,18:04:05,.604685000
262,5.639159805781e-09,Amp DC,.00000001,5.5,F,F,F,F,F,F,Front,F,Main,130.4972229003906,Volt DC,100,T,2W,F,F,05/23/2022,18:04:05,.999553880
263,5.302930095041e-09,Amp DC,.00000001,5.5,F,F,F,F,F,F,Front,F,Main,130.9970703125000,Volt DC,100,T,2W,F,F,05/23/2022,18:04:06,.394410440
264,5.43217026916e-09,Amp DC,.00000001,5.5,F,F,F,F,F,F,Front,F,Main,131.4966888427734,Volt DC,100,T,2W,F,F,05/23/2022,18:04:06,.789292660
265,5.71764280366e-09,Amp DC,.00000001,5.5,F,F,F,F,F,F,Front,F,Main,131.9970855712891,Volt DC,100,T,2W,F,F,05/23/2022,18:04:07,.184190160
266,5.519867674053e-09,Amp DC,.00000001,5.5,F,F,F,F,F,F,Front,F,Main,132.4969940185547,Volt DC,100,T,2W,F,F,05/23/2022,18:04:07,.579070100
267,5.291164839605e-09,Amp DC,.00000001,5.5,F,F,F,F,F,F,Front,F,Main,132.9974517822266,Volt DC,100,T,2W,F,F,05/23/2022,18:04:07,.973944540
268,5.563209004578e-09,Amp DC,.00000001,5.5,F,F,F,F,F,F,Front,F,Main,133.4967193603516,Volt DC,100,T,2W,F,F,05/23/2022,18:04:08,.368799460
269,5.720680817944e-09,Amp DC,.00000001,5.5,F,F,F,F,F,F,Front,F,Main,133.9973144531250,Volt DC,100,T,2W,F,F,05/23/2022,18:04:08,.763663980
270,5.384056311897e-09,Amp DC,.00000001,5.5,F,F,F,F,F,F,Front,F,Main,134.4964141845703,Volt DC,100,T,2W,F,F,05/23/2022,18:04:09,.158514980
271,5.360502708385e-09,Amp DC,.00000001,5.5,F,F,F,F,F,F,Front,F,Main,134.9969482421875,Volt DC,100,T,2W,F,F,05/23/2022,18:04:09,.553364660
272,5.676435321789e-09,Amp DC,.00000001,5.5,F,F,F,F,F,F,Front,F,Main,135.4970397949219,Volt DC,100,T,2W,F,F,05/23/2022,18:04:09,.948244020
273,5.627922572415e-09,Amp DC,.00000001,5.5,F,F,F,F,F,F,Front,F,Main,135.9964599609375,Volt DC,100,T,2W,F,F,05/23/2022,18:04:10,.343101060
274,5.302625005754e-09,Amp DC,.00000001,5.5,F,F,F,F,F,F,Front,F,Main,136.4967193603516,Volt DC,100,T,2W,F,F,05/23/2022,18:04:10,.737958660
275,5.462485574981e-09,Amp DC,.00000001,5.5,F,F,F,F,F,F,Front,F,Main,136.9968872070313,Volt DC,100,T,2W,F,F,05/23/2022,18:04:11,.132812760
276,5.7244320395e-09,Amp DC,.00000001,5.5,F,F,F,F,F,F,Front,F,Main,137.4967041015625,Volt DC,100,T,2W,F,F,05/23/2022,18:04:11,.527672920
277,5.504464883899e-09,Amp DC,.00000001,5.5,F,F,F,F,F,F,Front,F,Main,137.9966125488281,Volt DC,100,T,2W,F,F,05/23/2022,18:04:11,.922520860
278,5.295324179144e-09,Amp DC,.00000001,5.5,F,F,F,F,F,F,Front,F,Main,138.4963073730469,Volt DC,100,T,2W,F,F,05/23/2022,18:04:12,.317392060
279,5.601465513649e-09,Amp DC,.00000001,5.5,F,F,F,F,F,F,Front,F,Main,138.9967346191406,Volt DC,100,T,2W,F,F,05/23/2022,18:04:12,.712261020
280,5.705466321615e-09,Amp DC,.00000001,5.5,F,F,F,F,F,F,Front,F,Main,139.4962310791016,Volt DC,100,T,2W,F,F,05/23/2022,18:04:13,.107114720
281,5.376379341726e-09,Amp DC,.00000001,5.5,F,F,F,F,F,F,Front,F,Main,139.9964294433594,Volt DC,100,T,2W,F,F,05/23/2022,18:04:13,.501986100
282,5.384221957172e-09,Amp DC,.00000001,5.5,F,F,F,F,F,F,Front,F,Main,140.4962768554688,Volt DC,100,T,2W,F,F,05/23/2022,18:04:13,.896834700
283,5.714071438234e-09,Amp DC,.00000001,5.5,F,F,F,F,F,F,Front,F,Main,140.9975280761719,Volt DC,100,T,2W,F,F,05/23/2022,18:04:14,.291684540
284,5.6031961293e-09,Amp DC,.00000001,5.5,F,F,F,F,F,F,Front,F,Main,141.4967346191406,Volt DC,100,T,2W,F,F,05/23/2022,18:04:14,.686559140
285,5.300799355012e-09,Amp DC,.00000001,5.5,F,F,F,F,F,F,Front,F,Main,141.9966888427734,Volt DC,100,T,2W,F,F,05/23/2022,18:04:15,.081416760
286,5.501869182467e-09,Amp DC,.00000001,5.5,F,F,F,F,F,F,Front,F,Main,142.4963989257813,Volt DC,100,T,2W,F,F,05/23/2022,18:04:15,.476275860
287,5.743756137377e-09,Amp DC,.00000001,5.5,F,F,F,F,F,F,Front,F,Main,142.9966125488281,Volt DC,100,T,2W,F,F,05/23/2022,18:04:15,.871128540
288,5.459112717432e-09,Amp DC,.00000001,5.5,F,F,F,F,F,F,Front,F,Main,143.4964904785156,Volt DC,100,T,2W,F,F,05/23/2022,18:04:16,.266014180
289,5.330618613186e-09,Amp DC,.00000001,5.5,F,F,F,F,F,F,Front,F,Main,143.9969177246094,Volt DC,100,T,2W,F,F,05/23/2022,18:04:16,.660877260
290,5.637093458688e-09,Amp DC,.00000001,5.5,F,F,F,F,F,F,Front,F,Main,144.4964752197266,Volt DC,100,T,2W,F,F,05/23/2022,18:04:17,.055729360
291,5.680151904386e-09,Amp DC,.00000001,5.5,F,F,F,F,F,F,Front,F,Main,144.9969329833984,Volt DC,100,T,2W,F,F,05/23/2022,18:04:17,.450593380
292,5.338497199858e-09,Amp DC,.00000001,5.5,F,F,F,F,F,F,Front,F,Main,145.4963531494141,Volt DC,100,T,2W,F,F,05/23/2022,18:04:17,.845447260
293,5.438293371185e-09,Amp DC,.00000001,5.5,F,F,F,F,F,F,Front,F,Main,145.9960021972656,Volt DC,100,T,2W,F,F,05/23/2022,18:04:18,.240322360
294,5.733914232309e-09,Amp DC,.00000001,5.5,F,F,F,F,F,F,Front,F,Main,146.4966278076172,Volt DC,100,T,2W,F,F,05/23/2022,18:04:18,.635195940
295,5.554132265218e-09,Amp DC,.00000001,5.5,F,F,F,F,F,F,Front,F,Main,146.9964599609375,Volt DC,100,T,2W,F,F,05/23/2022,18:04:19,.030068060
296,5.301496130983e-09,Amp DC,.00000001,5.5,F,F,F,F,F,F,Front,F,Main,147.4961853027344,Volt DC,100,T,2W,F,F,05/23/2022,18:04:19,.424951280
297,5.588288498615e-09,Amp DC,.00000001,5.5,F,F,F,F,F,F,Front,F,Main,147.9962615966797,Volt DC,100,T,2W,F,F,05/23/2022,18:04:19,.819821820
298,5.73427882955e-09,Amp DC,.00000001,5.5,F,F,F,F,F,F,Front,F,Main,148.4960479736328,Volt DC,100,T,2W,F,F,05/23/2022,18:04:20,.214688280
299,5.42670131054e-09,Amp DC,.00000001,5.5,F,F,F,F,F,F,Front,F,Main,148.9968566894531,Volt DC,100,T,2W,F,F,05/23/2022,18:04:20,.609565280
300,5.378866241301e-09,Amp DC,.00000001,5.5,F,F,F,F,F,F,Front,F,Main,149.4957427978516,Volt DC,100,T,2W,F,F,05/23/2022,18:04:21,.004452460
301,5.742154751687e-09,Amp DC,.00000001,5.5,F,F,F,F,F,F,Front,F,Main,149.9962310791016,Volt DC,100,T,2W,F,F,05/23/2022,18:04:21,.399328440
302,5.620263365813e-09,Amp DC,.00000001,5.5,F,F,F,F,F,F,Front,F,Main,150.4957580566406,Volt DC,100,T,2W,F,F,05/23/2022,18:04:21,.794192400
303,5.296501903729e-09,Amp DC,.00000001,5.5,F,F,F,F,F,F,Front,F,Main,150.9959564208984,Volt DC,100,T,2W,F,F,05/23/2022,18:04:22,.189055900
304,5.492025501042e-09,Amp DC,.00000001,5.5,F,F,F,F,F,F,Front,F,Main,151.4955596923828,Volt DC,100,T,2W,F,F,05/23/2022,18:04:22,.583910900
305,5.794319246633e-09,Amp DC,.00000001,5.5,F,F,F,F,F,F,Front,F,Main,151.9960479736328,Volt DC,100,T,2W,F,F,05/23/2022,18:04:22,.978784120
306,5.472524211569e-09,Amp DC,.00000001,5.5,F,F,F,F,F,F,Front,F,Main,152.4958648681641,Volt DC,100,T,2W,F,F,05/23/2022,18:04:23,.373637140
307,5.303521621869e-09,Amp DC,.00000001,5.5,F,F,F,F,F,F,Front,F,Main,152.9985351562500,Volt DC,100,T,2W,F,F,05/23/2022,18:04:23,.768514140
308,5.682543324781e-09,Amp DC,.00000001,5.5,F,F,F,F,F,F,Front,F,Main,153.4996948242188,Volt DC,100,T,2W,F,F,05/23/2022,18:04:24,.163374700
309,5.654972046187e-09,Amp DC,.00000001,5.5,F,F,F,F,F,F,Front,F,Main,153.9989471435547,Volt DC,100,T,2W,F,F,05/23/2022,18:04:24,.558221160
310,5.375891287684e-09,Amp DC,.00000001,5.5,F,F,F,F,F,F,Front,F,Main,154.4993438720703,Volt DC,100,T,2W,F,F,05/23/2022,18:04:24,.953099620
311,5.435375705076e-09,Amp DC,.00000001,5.5,F,F,F,F,F,F,Front,F,Main,154.9994964599609,Volt DC,100,T,2W,F,F,05/23/2022,18:04:25,.347967600
312,5.727820440171e-09,Amp DC,.00000001,5.5,F,F,F,F,F,F,Front,F,Main,155.4993591308594,Volt DC,100,T,2W,F,F,05/23/2022,18:04:25,.742840360
313,5.593329355236e-09,Amp DC,.00000001,5.5,F,F,F,F,F,F,Front,F,Main,155.9991912841797,Volt DC,100,T,2W,F,F,05/23/2022,18:04:26,.137703180
314,5.28764898533e-09,Amp DC,.00000001,5.5,F,F,F,F,F,F,Front,F,Main,156.4988403320313,Volt DC,100,T,2W,F,F,05/23/2022,18:04:26,.532556740
315,5.558787208315e-09,Amp DC,.00000001,5.5,F,F,F,F,F,F,Front,F,Main,156.9991607666016,Volt DC,100,T,2W,F,F,05/23/2022,18:04:26,.927425860
316,5.750204312704e-09,Amp DC,.00000001,5.5,F,F,F,F,F,F,Front,F,Main,157.4997863769531,Volt DC,100,T,2W,F,F,05/23/2022,18:04:27,.322308780
317,5.402884362127e-09,Amp DC,.00000001,5.5,F,F,F,F,F,F,Front,F,Main,157.9989624023438,Volt DC,100,T,2W,F,F,05/23/2022,18:04:27,.717183260
318,5.384678924969e-09,Amp DC,.00000001,5.5,F,F,F,F,F,F,Front,F,Main,158.4990234375000,Volt DC,100,T,2W,F,F,05/23/2022,18:04:28,.112054460
319,5.688824522565e-09,Amp DC,.00000001,5.5,F,F,F,F,F,F,Front,F,Main,158.9991149902344,Volt DC,100,T,2W,F,F,05/23/2022,18:04:28,.506914140
320,5.669247737927e-09,Amp DC,.00000001,5.5,F,F,F,F,F,F,Front,F,Main,159.4989166259766,Volt DC,100,T,2W,F,F,05/23/2022,18:04:28,.901772960
321,5.341667996817e-09,Amp DC,.00000001,5.5,F,F,F,F,F,F,Front,F,Main,159.9987945556641,Volt DC,100,T,2W,F,F,05/23/2022,18:04:29,.296629300
322,5.506469058503e-09,Amp DC,.00000001,5.5,F,F,F,F,F,F,Front,F,Main,160.4992370605469,Volt DC,100,T,2W,F,F,05/23/2022,18:04:29,.691505100
323,5.763392874059e-09,Amp DC,.00000001,5.5,F,F,F,F,F,F,Front,F,Main,160.9991607666016,Volt DC,100,T,2W,F,F,05/23/2022,18:04:30,.086370900
324,5.538139280503e-09,Amp DC,.00000001,5.5,F,F,F,F,F,F,Front,F,Main,161.4994354248047,Volt DC,100,T,2W,F,F,05/23/2022,18:04:30,.481240680
325,5.335320185651e-09,Amp DC,.00000001,5.5,F,F,F,F,F,F,Front,F,Main,161.9987792968750,Volt DC,100,T,2W,F,F,05/23/2022,18:04:30,.876098940
326,5.639624323095e-09,Amp DC,.00000001,5.5,F,F,F,F,F,F,Front,F,Main,162.4989013671875,Volt DC,100,T,2W,F,F,05/23/2022,18:04:31,.270955360
327,5.730642183011e-09,Amp DC,.00000001,5.5,F,F,F,F,F,F,Front,F,Main,162.9986419677734,Volt DC,100,T,2W,F,F,05/23/2022,18:04:31,.665815440
328,5.417912785077e-09,Amp DC,.00000001,5.5,F,F,F,F,F,F,Front,F,Main,163.4990081787109,Volt DC,100,T,2W,F,F,05/23/2022,18:04:32,.060677880
329,5.426798566077e-09,Amp DC,.00000001,5.5,F,F,F,F,F,F,Front,F,Main,163.9985351562500,Volt DC,100,T,2W,F,F,05/23/2022,18:04:32,.455546440
330,5.750200315902e-09,Amp DC,.00000001,5.5,F,F,F,F,F,F,Front,F,Main,164.4988708496094,Volt DC,100,T,2W,F,F,05/23/2022,18:04:32,.850418840
331,5.629504418181e-09,Amp DC,.00000001,5.5,F,F,F,F,F,F,Front,F,Main,164.9983062744141,Volt DC,100,T,2W,F,F,05/23/2022,18:04:33,.245275020
332,5.340685227395e-09,Amp DC,.00000001,5.5,F,F,F,F,F,F,Front,F,Main,165.4988555908203,Volt DC,100,T,2W,F,F,05/23/2022,18:04:33,.640128900
333,5.557749371832e-09,Amp DC,.00000001,5.5,F,F,F,F,F,F,Front,F,Main,165.9993438720703,Volt DC,100,T,2W,F,F,05/23/2022,18:04:34,.034989920
334,5.768102440129e-09,Amp DC,.00000001,5.5,F,F,F,F,F,F,Front,F,Main,166.4982757568359,Volt DC,100,T,2W,F,F,05/23/2022,18:04:34,.429870140
335,5.504628752817e-09,Amp DC,.00000001,5.5,F,F,F,F,F,F,Front,F,Main,166.9983978271484,Volt DC,100,T,2W,F,F,05/23/2022,18:04:34,.824734540
336,5.366594724165e-09,Amp DC,.00000001,5.5,F,F,F,F,F,F,Front,F,Main,167.4986877441406,Volt DC,100,T,2W,F,F,05/23/2022,18:04:35,.219591400
337,5.680066639258e-09,Amp DC,.00000001,5.5,F,F,F,F,F,F,Front,F,Main,167.9987030029297,Volt DC,100,T,2W,F,F,05/23/2022,18:04:35,.614441280
338,5.714586137628e-09,Amp DC,.00000001,5.5,F,F,F,F,F,F,Front,F,Main,168.4987030029297,Volt DC,100,T,2W,F,F,05/23/2022,18:04:36,.009318040
339,5.381049383857e-09,Amp DC,.00000001,5.5,F,F,F,F,F,F,Front,F,Main,168.9986419677734,Volt DC,100,T,2W,F,F,05/23/2022,18:04:36,.404164120
340,5.485693677088e-09,Amp DC,.00000001,5.5,F,F,F,F,F,F,Front,F,Main,169.4996185302734,Volt DC,100,T,2W,F,F,05/23/2022,18:04:36,.799030800
341,5.749573706026e-09,Amp DC,.00000001,5.5,F,F,F,F,F,F,Front,F,Main,169.9985046386719,Volt DC,100,T,2W,F,F,05/23/2022,18:04:37,.193903240
342,5.610787834343e-09,Amp DC,.00000001,5.5,F,F,F,F,F,F,Front,F,Main,170.4985809326172,Volt DC,100,T,2W,F,F,05/23/2022,18:04:37,.588759340
343,5.337931430205e-09,Amp DC,.00000001,5.5,F,F,F,F,F,F,Front,F,Main,170.9985961914063,Volt DC,100,T,2W,F,F,05/23/2022,18:04:37,.983622500
344,5.620202081502e-09,Amp DC,.00000001,5.5,F,F,F,F,F,F,Front,F,Main,171.4990234375000,Volt DC,100,T,2W,F,F,05/23/2022,18:04:38,.378479440
345,5.77047387651e-09,Amp DC,.00000001,5.5,F,F,F,F,F,F,Front,F,Main,171.9985656738281,Volt DC,100,T,2W,F,F,05/23/2022,18:04:38,.773324900
346,5.464600327798e-09,Amp DC,.00000001,5.5,F,F,F,F,F,F,Front,F,Main,172.4982910156250,Volt DC,100,T,2W,F,F,05/23/2022,18:04:39,.168173580
347,5.408940406681e-09,Amp DC,.00000001,5.5,F,F,F,F,F,F,Front,F,Main,172.9986267089844,Volt DC,100,T,2W,F,F,05/23/2022,18:04:39,.563035840
348,5.725396157175e-09,Amp DC,.00000001,5.5,F,F,F,F,F,F,Front,F,Main,173.4986114501953,Volt DC,100,T,2W,F,F,05/23/2022,18:04:39,.957902960
349,5.697063709675e-09,Amp DC,.00000001,5.5,F,F,F,F,F,F,Front,F,Main,173.9985046386719,Volt DC,100,T,2W,F,F,05/23/2022,18:04:40,.352784180
350,5.375885958614e-09,Amp DC,.00000001,5.5,F,F,F,F,F,F,Front,F,Main,174.4989471435547,Volt DC,100,T,2W,F,F,05/23/2022,18:04:40,.747655660
351,5.5035140889e-09,Amp DC,.00000001,5.5,F,F,F,F,F,F,Front,F,Main,174.9981842041016,Volt DC,100,T,2W,F,F,05/23/2022,18:04:41,.142529720
352,5.787333279272e-09,Amp DC,.00000001,5.5,F,F,F,F,F,F,Front,F,Main,175.4985351562500,Volt DC,100,T,2W,F,F,05/23/2022,18:04:41,.537424440
353,5.561028970646e-09,Amp DC,.00000001,5.5,F,F,F,F,F,F,Front,F,Main,175.9981079101563,Volt DC,100,T,2W,F,F,05/23/2022,18:04:41,.932276820
354,5.36768229864e-09,Amp DC,.00000001,5.5,F,F,F,F,F,F,Front,F,Main,176.4985198974609,Volt DC,100,T,2W,F,F,05/23/2022,18:04:42,.327135160
355,5.656930923692e-09,Amp DC,.00000001,5.5,F,F,F,F,F,F,Front,F,Main,176.9982910156250,Volt DC,100,T,2W,F,F,05/23/2022,18:04:42,.721992240
356,5.771671585109e-09,Amp DC,.00000001,5.5,F,F,F,F,F,F,Front,F,Main,177.4985198974609,Volt DC,100,T,2W,F,F,05/23/2022,18:04:43,.116842880
357,5.430550231722e-09,Amp DC,.00000001,5.5,F,F,F,F,F,F,Front,F,Main,177.9982452392578,Volt DC,100,T,2W,F,F,05/23/2022,18:04:43,.511723420
358,5.449225071175e-09,Amp DC,.00000001,5.5,F,F,F,F,F,F,Front,F,Main,178.4982452392578,Volt DC,100,T,2W,F,F,05/23/2022,18:04:43,.906570940
359,5.752137877124e-09,Amp DC,.00000001,5.5,F,F,F,F,F,F,Front,F,Main,178.9976348876953,Volt DC,100,T,2W,F,F,05/23/2022,18:04:44,.301419700
360,5.682327497425e-09,Amp DC,.00000001,5.5,F,F,F,F,F,F,Front,F,Main,179.4982604980469,Volt DC,100,T,2W,F,F,05/23/2022,18:04:44,.696281020
361,5.367045918803e-09,Amp DC,.00000001,5.5,F,F,F,F,F,F,Front,F,Main,179.9978332519531,Volt DC,100,T,2W,F,F,05/23/2022,18:04:45,.091147320
362,5.560819804629e-09,Amp DC,.00000001,5.5,F,F,F,F,F,F,Front,F,Main,180.4981231689453,Volt DC,100,T,2W,F,F,05/23/2022,18:04:45,.485993980
363,5.800626201591e-09,Amp DC,.00000001,5.5,F,F,F,F,F,F,Front,F,Main,180.9978942871094,Volt DC,100,T,2W,F,F,05/23/2022,18:04:45,.880876380
364,5.549499082491e-09,Amp DC,.00000001,5.5,F,F,F,F,F,F,Front,F,Main,181.4987487792969,Volt DC,100,T,2W,F,F,05/23/2022,18:04:46,.275746900
365,5.367098321329e-09,Amp DC,.00000001,5.5,F,F,F,F,F,F,Front,F,Main,181.9982452392578,Volt DC,100,T,2W,F,F,05/23/2022,18:04:46,.670609220
366,5.686887849521e-09,Amp DC,.00000001,5.5,F,F,F,F,F,F,Front,F,Main,182.4983520507813,Volt DC,100,T,2W,F,F,05/23/2022,18:04:47,.065467100
367,5.761235488677e-09,Amp DC,.00000001,5.5,F,F,F,F,F,F,Front,F,Main,182.9982757568359,Volt DC,100,T,2W,F,F,05/23/2022,18:04:47,.460346140
368,5.430839333798e-09,Amp DC,.00000001,5.5,F,F,F,F,F,F,Front,F,Main,183.4980926513672,Volt DC,100,T,2W,F,F,05/23/2022,18:04:47,.855207660
369,5.465080388234e-09,Amp DC,.00000001,5.5,F,F,F,F,F,F,Front,F,Main,183.9981231689453,Volt DC,100,T,2W,F,F,05/23/2022,18:04:48,.250087160
370,5.778267198053e-09,Amp DC,.00000001,5.5,F,F,F,F,F,F,Front,F,Main,184.4981231689453,Volt DC,100,T,2W,F,F,05/23/2022,18:04:48,.644939940
371,5.675541814298e-09,Amp DC,.00000001,5.5,F,F,F,F,F,F,Front,F,Main,184.9980163574219,Volt DC,100,T,2W,F,F,05/23/2022,18:04:49,.039813580
372,5.388277823926e-09,Amp DC,.00000001,5.5,F,F,F,F,F,F,Front,F,Main,185.4994659423828,Volt DC,100,T,2W,F,F,05/23/2022,18:04:49,.434683760
373,5.545005343777e-09,Amp DC,.00000001,5.5,F,F,F,F,F,F,Front,F,Main,185.9979705810547,Volt DC,100,T,2W,F,F,05/23/2022,18:04:49,.829557840
374,5.812470504907e-09,Amp DC,.00000001,5.5,F,F,F,F,F,F,Front,F,Main,186.4981842041016,Volt DC,100,T,2W,F,F,05/23/2022,18:04:50,.224430120
375,5.556831883524e-09,Amp DC,.00000001,5.5,F,F,F,F,F,F,Front,F,Main,186.9976501464844,Volt DC,100,T,2W,F,F,05/23/2022,18:04:50,.619273880
376,5.389266366507e-09,Amp DC,.00000001,5.5,F,F,F,F,F,F,Front,F,Main,187.4985046386719,Volt DC,100,T,2W,F,F,05/23/2022,18:04:51,.014137060
377,5.686289217266e-09,Amp DC,.00000001,5.5,F,F,F,F,F,F,Front,F,Main,187.9982452392578,Volt DC,100,T,2W,F,F,05/23/2022,18:04:51,.408998380
378,5.774318800889e-09,Amp DC,.00000001,5.5,F,F,F,F,F,F,Front,F,Main,188.4977264404297,Volt DC,100,T,2W,F,F,05/23/2022,18:04:51,.803865200
379,5.45886091885e-09,Amp DC,.00000001,5.5,F,F,F,F,F,F,Front,F,Main,188.9977874755859,Volt DC,100,T,2W,F,F,05/23/2022,18:04:52,.198746300
380,5.466219921146e-09,Amp DC,.00000001,5.5,F,F,F,F,F,F,Front,F,Main,189.4979858398438,Volt DC,100,T,2W,F,F,05/23/2022,18:04:52,.593605960
381,5.767966548831e-09,Amp DC,.00000001,5.5,F,F,F,F,F,F,Front,F,Main,189.9973907470703,Volt DC,100,T,2W,F,F,05/23/2022,18:04:52,.988485240
382,5.707519346032e-09,Amp DC,.00000001,5.5,F,F,F,F,F,F,Front,F,Main,190.4972534179688,Volt DC,100,T,2W,F,F,05/23/2022,18:04:53,.383340280
383,5.390738522237e-09,Amp DC,.00000001,5.5,F,F,F,F,F,F,Front,F,Main,190.9976959228516,Volt DC,100,T,2W,F,F,05/23/2022,18:04:53,.778216360
384,5.547244441573e-09,Amp DC,.00000001,5.5,F,F,F,F,F,F,Front,F,Main,191.4978179931641,Volt DC,100,T,2W,F,F,05/23/2022,18:04:54,.173074440
385,5.80058712174e-09,Amp DC,.00000001,5.5,F,F,F,F,F,F,Front,F,Main,191.9969177246094,Volt DC,100,T,2W,F,F,05/23/2022,18:04:54,.567938620
386,5.617512233158e-09,Amp DC,.00000001,5.5,F,F,F,F,F,F,Front,F,Main,192.4975891113281,Volt DC,100,T,2W,F,F,05/23/2022,18:04:54,.962820240
387,5.374624301169e-09,Amp DC,.00000001,5.5,F,F,F,F,F,F,Front,F,Main,192.9970397949219,Volt DC,100,T,2W,F,F,05/23/2022,18:04:55,.357682040
388,5.696319860249e-09,Amp DC,.00000001,5.5,F,F,F,F,F,F,Front,F,Main,193.4977569580078,Volt DC,100,T,2W,F,F,05/23/2022,18:04:55,.752545840
389,5.796873647768e-09,Amp DC,.00000001,5.5,F,F,F,F,F,F,Front,F,Main,193.9973754882813,Volt DC,100,T,2W,F,F,05/23/2022,18:04:56,.147397940
390,5.515922829602e-09,Amp DC,.00000001,5.5,F,F,F,F,F,F,Front,F,Main,194.4974060058594,Volt DC,100,T,2W,F,F,05/23/2022,18:04:56,.542259640
391,5.439420913689e-09,Amp DC,.00000001,5.5,F,F,F,F,F,F,Front,F,Main,194.9975738525391,Volt DC,100,T,2W,F,F,05/23/2022,18:04:56,.937124300
392,5.758983068205e-09,Amp DC,.00000001,5.5,F,F,F,F,F,F,Front,F,Main,195.4975891113281,Volt DC,100,T,2W,F,F,05/23/2022,18:04:57,.331992340
393,5.733018060283e-09,Amp DC,.00000001,5.5,F,F,F,F,F,F,Front,F,Main,195.9972839355469,Volt DC,100,T,2W,F,F,05/23/2022,18:04:57,.726876720
394,5.415383697027e-09,Amp DC,.00000001,5.5,F,F,F,F,F,F,Front,F,Main,196.4979553222656,Volt DC,100,T,2W,F,F,05/23/2022,18:04:58,.121711800
395,5.53085710564e-09,Amp DC,.00000001,5.5,F,F,F,F,F,F,Front,F,Main,196.9971618652344,Volt DC,100,T,2W,F,F,05/23/2022,18:04:58,.516576540
396,5.824718041225e-09,Amp DC,.00000001,5.5,F,F,F,F,F,F,Front,F,Main,197.4978027343750,Volt DC,100,T,2W,F,F,05/23/2022,18:04:58,.911456280
397,5.634623434503e-09,Amp DC,.00000001,5.5,F,F,F,F,F,F,Front,F,Main,197.9978332519531,Volt DC,100,T,2W,F,F,05/23/2022,18:04:59,.306310020
398,5.379446665899e-09,Amp DC,.00000001,5.5,F,F,F,F,F,F,Front,F,Main,198.4971466064453,Volt DC,100,T,2W,F,F,05/23/2022,18:04:59,.701185820
399,5.665179436676e-09,Amp DC,.00000001,5.5,F,F,F,F,F,F,Front,F,Main,198.9970855712891,Volt DC,100,T,2W,F,F,05/23/2022,18:05:00,.096039560
400,5.830643523552e-09,Amp DC,.00000001,5.5,F,F,F,F,F,F,Front,F,Main,199.4979400634766,Volt DC,100,T,2W,F,F,05/23/2022,18:05:00,.490918020
401,5.511454403972e-09,Amp DC,.00000001,5.5,F,F,F,F,F,F,Front,F,Main,199.9971923828125,Volt DC,100,T,2W,F,F,05/23/2022,18:05:00,.885770220
402,5.457401641706e-09,Amp DC,.00000001,5.5,F,F,F,F,F,F,Front,F,Main,200.4971923828125,Volt DC,100,T,2W,F,F,05/23/2022,18:05:01,.280644580
403,5.774515532408e-09,Amp DC,.00000001,5.5,F,F,F,F,F,F,Front,F,Main,200.9972076416016,Volt DC,100,T,2W,F,F,05/23/2022,18:05:01,.675493940
404,5.750026677021e-09,Amp DC,.00000001,5.5,F,F,F,F,F,F,Front,F,Main,201.4984436035156,Volt DC,100,T,2W,F,F,05/23/2022,18:05:02,.070367300
405,5.399523494987e-09,Amp DC,.00000001,5.5,F,F,F,F,F,F,Front,F,Main,201.9969177246094,Volt DC,100,T,2W,F,F,05/23/2022,18:05:02,.465250820
406,5.568534966471e-09,Amp DC,.00000001,5.5,F,F,F,F,F,F,Front,F,Main,202.4971923828125,Volt DC,100,T,2W,F,F,05/23/2022,18:05:02,.860103720
407,5.823253435011e-09,Amp DC,.00000001,5.5,F,F,F,F,F,F,Front,F,Main,202.9965209960938,Volt DC,100,T,2W,F,F,05/23/2022,18:05:03,.254997480
408,5.621151988322e-09,Amp DC,.00000001,5.5,F,F,F,F,F,F,Front,F,Main,203.4972381591797,Volt DC,100,T,2W,F,F,05/23/2022,18:05:03,.649858880
409,5.391282975609e-09,Amp DC,.00000001,5.5,F,F,F,F,F,F,Front,F,Main,203.9961395263672,Volt DC,100,T,2W,F,F,05/23/2022,18:05:04,.044731480
410,5.707096129015e-09,Amp DC,.00000001,5.5,F,F,F,F,F,F,Front,F,Main,204.4965667724609,Volt DC,100,T,2W,F,F,05/23/2022,18:05:04,.439589820
411,5.833548755163e-09,Amp DC,.00000001,5.5,F,F,F,F,F,F,Front,F,Main,204.9974365234375,Volt DC,100,T,2W,F,F,05/23/2022,18:05:04,.834455280
412,5.48006662271e-09,Amp DC,.00000001,5.5,F,F,F,F,F,F,Front,F,Main,205.4966430664063,Volt DC,100,T,2W,F,F,05/23/2022,18:05:05,.229321200
413,5.492447385791e-09,Amp DC,.00000001,5.5,F,F,F,F,F,F,Front,F,Main,205.9964447021484,Volt DC,100,T,2W,F,F,05/23/2022,18:05:05,.624183840
414,5.810832259812e-09,Amp DC,.00000001,5.5,F,F,F,F,F,F,Front,F,Main,206.4964599609375,Volt DC,100,T,2W,F,F,05/23/2022,18:05:06,.019041720
415,5.711171091605e-09,Amp DC,.00000001,5.5,F,F,F,F,F,F,Front,F,Main,206.9962310791016,Volt DC,100,T,2W,F,F,05/23/2022,18:05:06,.413886880
416,5.417788440099e-09,Amp DC,.00000001,5.5,F,F,F,F,F,F,Front,F,Main,207.4968109130859,Volt DC,100,T,2W,F,F,05/23/2022,18:05:06,.808738000
417,5.62305269014e-09,Amp DC,.00000001,5.5,F,F,F,F,F,F,Front,F,Main,207.9961242675781,Volt DC,100,T,2W,F,F,05/23/2022,18:05:07,.203579800
418,5.863804997119e-09,Amp DC,.00000001,5.5,F,F,F,F,F,F,Front,F,Main,208.4974365234375,Volt DC,100,T,2W,F,F,05/23/2022,18:05:07,.598417100
419,5.555469861918e-09,Amp DC,.00000001,5.5,F,F,F,F,F,F,Front,F,Main,208.9965972900391,Volt DC,100,T,2W,F,F,05/23/2022,18:05:07,.993291060
420,5.455608853566e-09,Amp DC,.00000001,5.5,F,F,F,F,F,F,Front,F,Main,209.4973144531250,Volt DC,100,T,2W,F,F,05/23/2022,18:05:08,.388160940
421,5.764082988691e-09,Amp DC,.00000001,5.5,F,F,F,F,F,F,Front,F,Main,209.9966583251953,Volt DC,100,T,2W,F,F,05/23/2022,18:05:08,.783036240
