x-axis,1
second,Volt
-250.0000E-06,-353.0150801E-03
-249.7500E-06,-403.2663368E-03
-249.5000E-06,-152.0100534E-03
-249.2500E-06,+48.9949733E-03
-249.0000E-06,+250.0000000E-03
-248.7500E-06,+250.0000000E-03
-248.5000E-06,+250.0000000E-03
-248.2500E-06,+250.0000000E-03
-248.0000E-06,+451.0050267E-03
-247.7500E-06,+451.0050267E-03
-247.5000E-06,+451.0050267E-03
-247.2500E-06,+250.0000000E-03
-247.0000E-06,-152.0100534E-03
-246.7500E-06,-353.0150801E-03
-246.5000E-06,-755.0251335E-03
-246.2500E-06,-1.0062814169E+00
-246.0000E-06,-956.0301602E-03
-245.7500E-06,-905.7789035E-03
-245.5000E-06,-453.5175935E-03
-245.2500E-06,-152.0100534E-03
-245.0000E-06,+48.9949733E-03
-244.7500E-06,+451.0050267E-03
-244.5000E-06,+451.0050267E-03
-244.2500E-06,+652.0100534E-03
-244.0000E-06,+451.0050267E-03
-243.7500E-06,+250.0000000E-03
-243.5000E-06,-152.0100534E-03
-243.2500E-06,-503.7688501E-03
-243.0000E-06,-554.0201068E-03
-242.7500E-06,-554.0201068E-03
-242.5000E-06,-453.5175934E-03
-242.2500E-06,-403.2663368E-03
-242.0000E-06,-152.0100534E-03
-241.7500E-06,-101.7587967E-03
-241.5000E-06,+48.9949733E-03
-241.2500E-06,+250.0000000E-03
-241.0000E-06,+250.0000000E-03
-240.7500E-06,+199.7487433E-03
-240.5000E-06,+48.9949733E-03
-240.2500E-06,+48.9949733E-03
-240.0000E-06,+48.9949733E-03
-239.7500E-06,-1.2562834E-03
-239.5000E-06,+48.9949733E-03
-239.2500E-06,+48.9949733E-03
-239.0000E-06,+48.9949733E-03
-238.7500E-06,+48.9949733E-03
-238.5000E-06,-152.0100534E-03
-238.2500E-06,-353.0150801E-03
-238.0000E-06,-554.0201068E-03
-237.7500E-06,-554.0201068E-03
-237.5000E-06,-453.5175934E-03
-237.2500E-06,-152.0100534E-03
-237.0000E-06,-152.0100534E-03
-236.7500E-06,+48.9949733E-03
-236.5000E-06,+149.4974867E-03
-236.2500E-06,+250.0000000E-03
-236.0000E-06,+48.9949733E-03
-235.7500E-06,-152.0100534E-03
-235.5000E-06,-152.0100534E-03
-235.2500E-06,-152.0100534E-03
-235.0000E-06,-152.0100534E-03
-234.7500E-06,-152.0100534E-03
-234.5000E-06,-152.0100534E-03
-234.2500E-06,+48.9949733E-03
-234.0000E-06,+48.9949733E-03
-233.7500E-06,+250.0000000E-03
-233.5000E-06,+250.0000000E-03
-233.2500E-06,+99.2462300E-03
-233.0000E-06,+48.9949733E-03
-232.7500E-06,-152.0100534E-03
-232.5000E-06,-554.0201068E-03
-232.2500E-06,-654.5226202E-03
-232.0000E-06,-755.0251335E-03
-231.7500E-06,-554.0201068E-03
-231.5000E-06,-353.0150801E-03
-231.2500E-06,-353.0150801E-03
-231.0000E-06,-152.0100534E-03
-230.7500E-06,+48.9949733E-03
-230.5000E-06,+48.9949733E-03
-230.2500E-06,+199.7487433E-03
-230.0000E-06,+48.9949733E-03
-229.7500E-06,-152.0100534E-03
-229.5000E-06,-152.0100534E-03
-229.2500E-06,-1.2562834E-03
-229.0000E-06,+48.9949733E-03
-228.7500E-06,+99.2462300E-03
-228.5000E-06,+451.0050267E-03
-228.2500E-06,+451.0050267E-03
-228.0000E-06,+451.0050267E-03
-227.7500E-06,+400.7537700E-03
-227.5000E-06,+48.9949733E-03
-227.2500E-06,-152.0100534E-03
-227.0000E-06,-152.0100534E-03
-226.7500E-06,-353.0150801E-03
-226.5000E-06,-453.5175934E-03
-226.2500E-06,-604.2713635E-03
-226.0000E-06,-755.0251335E-03
-225.7500E-06,-704.7738768E-03
-225.5000E-06,-252.5125667E-03
-225.2500E-06,+48.9949733E-03
-225.0000E-06,+250.0000000E-03
-224.7500E-06,+300.2512567E-03
-224.5000E-06,+451.0050267E-03
-224.2500E-06,+300.2512567E-03
-224.0000E-06,+250.0000000E-03
-223.7500E-06,+48.9949733E-03
-223.5000E-06,+48.9949733E-03
-223.2500E-06,-152.0100534E-03
-223.0000E-06,-353.0150801E-03
-222.7500E-06,-554.0201068E-03
-222.5000E-06,-554.0201068E-03
-222.2500E-06,-503.7688501E-03
-222.0000E-06,-152.0100534E-03
-221.7500E-06,+48.9949733E-03
-221.5000E-06,+149.4974867E-03
-221.2500E-06,+250.0000000E-03
-221.0000E-06,+451.0050267E-03
-220.7500E-06,+250.0000000E-03
-220.5000E-06,+250.0000000E-03
-220.2500E-06,+48.9949733E-03
-220.0000E-06,+48.9949733E-03
-219.7500E-06,-152.0100534E-03
-219.5000E-06,-152.0100534E-03
-219.2500E-06,-202.2613101E-03
-219.0000E-06,-554.0201068E-03
-218.7500E-06,-554.0201068E-03
-218.5000E-06,-654.5226201E-03
-218.2500E-06,-403.2663368E-03
-218.0000E-06,-353.0150801E-03
-217.7500E-06,+48.9949733E-03
-217.5000E-06,+149.4974867E-03
-217.2500E-06,+250.0000000E-03
-217.0000E-06,+250.0000000E-03
-216.7500E-06,+250.0000000E-03
-216.5000E-06,+48.9949733E-03
-216.2500E-06,-152.0100534E-03
-216.0000E-06,-152.0100534E-03
-215.7500E-06,-353.0150801E-03
-215.5000E-06,-554.0201068E-03
-215.2500E-06,-554.0201068E-03
-215.0000E-06,-554.0201068E-03
-214.7500E-06,-202.2613101E-03
-214.5000E-06,+48.9949733E-03
-214.2500E-06,+250.0000000E-03
-214.0000E-06,+451.0050267E-03
-213.7500E-06,+501.2562834E-03
-213.5000E-06,+551.5075401E-03
-213.2500E-06,+451.0050267E-03
-213.0000E-06,+250.0000000E-03
-212.7500E-06,-101.7587967E-03
-212.5000E-06,-353.0150801E-03
-212.2500E-06,-353.0150801E-03
-212.0000E-06,-554.0201068E-03
-211.7500E-06,-403.2663368E-03
-211.5000E-06,-353.0150801E-03
-211.2500E-06,-152.0100534E-03
-211.0000E-06,-152.0100534E-03
-210.7500E-06,-353.0150801E-03
-210.5000E-06,-353.0150801E-03
-210.2500E-06,-403.2663368E-03
-210.0000E-06,-152.0100534E-03
-209.7500E-06,-152.0100534E-03
-209.5000E-06,+48.9949733E-03
-209.2500E-06,-101.7587967E-03
-209.0000E-06,-152.0100534E-03
-208.7500E-06,-152.0100534E-03
-208.5000E-06,-252.5125667E-03
-208.2500E-06,-152.0100534E-03
-208.0000E-06,+48.9949733E-03
-207.7500E-06,+199.7487433E-03
-207.5000E-06,+250.0000000E-03
-207.2500E-06,+199.7487433E-03
-207.0000E-06,+48.9949733E-03
-206.7500E-06,+48.9949733E-03
-206.5000E-06,-252.5125668E-03
-206.2500E-06,-152.0100534E-03
-206.0000E-06,+48.9949733E-03
-205.7500E-06,+48.9949733E-03
-205.5000E-06,+350.5025133E-03
-205.2500E-06,+199.7487433E-03
-205.0000E-06,+250.0000000E-03
-204.7500E-06,+48.9949733E-03
-204.5000E-06,+48.9949733E-03
-204.2500E-06,-353.0150801E-03
-204.0000E-06,-755.0251335E-03
-203.7500E-06,-805.2763902E-03
-203.5000E-06,-654.5226201E-03
-203.2500E-06,-152.0100534E-03
-203.0000E-06,+48.9949733E-03
-202.7500E-06,+451.0050267E-03
-202.5000E-06,+250.0000000E-03
-202.2500E-06,+48.9949733E-03
-202.0000E-06,-152.0100534E-03
-201.7500E-06,-353.0150801E-03
-201.5000E-06,-554.0201068E-03
-201.2500E-06,-554.0201068E-03
-201.0000E-06,-554.0201068E-03
-200.7500E-06,-353.0150801E-03
-200.5000E-06,-152.0100534E-03
-200.2500E-06,+250.0000000E-03
-200.0000E-06,+451.0050267E-03
-199.7500E-06,+451.0050267E-03
-199.5000E-06,+350.5025133E-03
-199.2500E-06,+250.0000000E-03
-199.0000E-06,+48.9949733E-03
-198.7500E-06,-152.0100534E-03
-198.5000E-06,-353.0150801E-03
-198.2500E-06,-554.0201068E-03
-198.0000E-06,-554.0201068E-03
-197.7500E-06,-554.0201068E-03
-197.5000E-06,-554.0201068E-03
-197.2500E-06,-704.7738768E-03
-197.0000E-06,-554.0201068E-03
-196.7500E-06,-302.7638234E-03
-196.5000E-06,+48.9949733E-03
-196.2500E-06,+250.0000000E-03
-196.0000E-06,+853.0150801E-03
-195.7500E-06,+1.0540201068E+00
-195.5000E-06,+1.1545226201E+00
-195.2500E-06,+1.1042713635E+00
-195.0000E-06,+652.0100534E-03
-194.7500E-06,+451.0050267E-03
-194.5000E-06,-152.0100534E-03
-194.2500E-06,-604.2713634E-03
-194.0000E-06,-956.0301602E-03
-193.7500E-06,-1.3077889569E+00
-193.5000E-06,-1.2575377002E+00
-193.2500E-06,-956.0301602E-03
-193.0000E-06,-353.0150801E-03
-192.7500E-06,-1.2562834E-03
-192.5000E-06,+250.0000000E-03
-192.2500E-06,+652.0100534E-03
-192.0000E-06,+853.0150801E-03
-191.7500E-06,+853.0150801E-03
-191.5000E-06,+752.5125667E-03
-191.2500E-06,+250.0000000E-03
-191.0000E-06,-152.0100534E-03
-190.7500E-06,-755.0251335E-03
-190.5000E-06,-1.0565326736E+00
-190.2500E-06,-956.0301602E-03
-190.0000E-06,-956.0301602E-03
-189.7500E-06,-353.0150801E-03
-189.5000E-06,-51.5075400E-03
-189.2500E-06,+48.9949733E-03
-189.0000E-06,+451.0050267E-03
-188.7500E-06,+451.0050267E-03
-188.5000E-06,+652.0100534E-03
-188.2500E-06,+451.0050267E-03
-188.0000E-06,+48.9949733E-03
-187.7500E-06,-152.0100534E-03
-187.5000E-06,-554.0201068E-03
-187.2500E-06,-755.0251335E-03
-187.0000E-06,-554.0201068E-03
-186.7500E-06,-403.2663368E-03
-186.5000E-06,-252.5125668E-03
-186.2500E-06,-101.7587967E-03
-186.0000E-06,+48.9949733E-03
-185.7500E-06,+250.0000000E-03
-185.5000E-06,+250.0000000E-03
-185.2500E-06,+250.0000000E-03
-185.0000E-06,+250.0000000E-03
-184.7500E-06,+48.9949733E-03
-184.5000E-06,-51.5075400E-03
-184.2500E-06,-152.0100534E-03
-184.0000E-06,-152.0100534E-03
-183.7500E-06,-152.0100534E-03
-183.5000E-06,+48.9949733E-03
-183.2500E-06,-152.0100534E-03
-183.0000E-06,-152.0100534E-03
-182.7500E-06,-152.0100534E-03
-182.5000E-06,-152.0100534E-03
-182.2500E-06,-101.7587967E-03
-182.0000E-06,+48.9949733E-03
-181.7500E-06,+48.9949733E-03
-181.5000E-06,+48.9949733E-03
-181.2500E-06,+48.9949733E-03
-181.0000E-06,+48.9949733E-03
-180.7500E-06,-353.0150801E-03
-180.5000E-06,-252.5125668E-03
-180.2500E-06,-353.0150801E-03
-180.0000E-06,-152.0100534E-03
-179.7500E-06,-152.0100534E-03
-179.5000E-06,-152.0100534E-03
-179.2500E-06,-152.0100534E-03
-179.0000E-06,-353.0150801E-03
-178.7500E-06,-101.7587967E-03
-178.5000E-06,-51.5075400E-03
-178.2500E-06,-152.0100534E-03
-178.0000E-06,-353.0150801E-03
-177.7500E-06,-554.0201068E-03
-177.5000E-06,-554.0201068E-03
-177.2500E-06,-554.0201068E-03
-177.0000E-06,-152.0100534E-03
-176.7500E-06,+199.7487433E-03
-176.5000E-06,+350.5025133E-03
-176.2500E-06,+99.2462299E-03
-176.0000E-06,+48.9949733E-03
-175.7500E-06,-1.2562834E-03
-175.5000E-06,-152.0100534E-03
-175.2500E-06,+48.9949733E-03
-175.0000E-06,+48.9949733E-03
-174.7500E-06,+99.2462300E-03
-174.5000E-06,+48.9949733E-03
-174.2500E-06,+48.9949733E-03
-174.0000E-06,-152.0100534E-03
-173.7500E-06,-202.2613101E-03
-173.5000E-06,-353.0150801E-03
-173.2500E-06,-353.0150801E-03
-173.0000E-06,-152.0100534E-03
-172.7500E-06,-101.7587967E-03
-172.5000E-06,+149.4974866E-03
-172.2500E-06,+250.0000000E-03
-172.0000E-06,+250.0000000E-03
-171.7500E-06,+250.0000000E-03
-171.5000E-06,+48.9949733E-03
-171.2500E-06,-101.7587968E-03
-171.0000E-06,-353.0150801E-03
-170.7500E-06,-403.2663368E-03
-170.5000E-06,-353.0150801E-03
-170.2500E-06,-152.0100534E-03
-170.0000E-06,+48.9949733E-03
-169.7500E-06,-1.2562834E-03
-169.5000E-06,+48.9949733E-03
-169.2500E-06,+199.7487434E-03
-169.0000E-06,+250.0000000E-03
-168.7500E-06,-1.2562834E-03
-168.5000E-06,-152.0100534E-03
-168.2500E-06,-353.0150801E-03
-168.0000E-06,-353.0150801E-03
-167.7500E-06,-554.0201068E-03
-167.5000E-06,-353.0150801E-03
-167.2500E-06,-353.0150801E-03
-167.0000E-06,+48.9949733E-03
-166.7500E-06,+400.7537700E-03
-166.5000E-06,+451.0050267E-03
-166.2500E-06,+250.0000000E-03
-166.0000E-06,-152.0100534E-03
-165.7500E-06,-202.2613101E-03
-165.5000E-06,-252.5125667E-03
-165.2500E-06,-353.0150801E-03
-165.0000E-06,-353.0150801E-03
-164.7500E-06,-1.2562834E-03
-164.5000E-06,+48.9949733E-03
-164.2500E-06,+451.0050267E-03
-164.0000E-06,+451.0050267E-03
-163.7500E-06,+250.0000000E-03
-163.5000E-06,+48.9949733E-03
-163.2500E-06,-152.0100534E-03
-163.0000E-06,-554.0201068E-03
-162.7500E-06,-755.0251335E-03
-162.5000E-06,-755.0251335E-03
-162.2500E-06,-554.0201068E-03
-162.0000E-06,-353.0150801E-03
-161.7500E-06,+48.9949733E-03
-161.5000E-06,+350.5025134E-03
-161.2500E-06,+451.0050267E-03
-161.0000E-06,+250.0000000E-03
-160.7500E-06,+99.2462300E-03
-160.5000E-06,-51.5075401E-03
-160.2500E-06,-152.0100534E-03
-160.0000E-06,-152.0100534E-03
-159.7500E-06,-353.0150801E-03
-159.5000E-06,-252.5125668E-03
-159.2500E-06,-152.0100534E-03
-159.0000E-06,-152.0100534E-03
-158.7500E-06,-152.0100534E-03
-158.5000E-06,-152.0100534E-03
-158.2500E-06,-152.0100534E-03
-158.0000E-06,-152.0100534E-03
-157.7500E-06,+48.9949733E-03
-157.5000E-06,+149.4974867E-03
-157.2500E-06,+199.7487434E-03
-157.0000E-06,+250.0000000E-03
-156.7500E-06,+48.9949733E-03
-156.5000E-06,-152.0100534E-03
-156.2500E-06,-152.0100534E-03
-156.0000E-06,-554.0201068E-03
-155.7500E-06,-554.0201068E-03
-155.5000E-06,-554.0201068E-03
-155.2500E-06,-353.0150801E-03
-155.0000E-06,-152.0100534E-03
-154.7500E-06,+48.9949733E-03
-154.5000E-06,+48.9949733E-03
-154.2500E-06,+48.9949733E-03
-154.0000E-06,+48.9949733E-03
-153.7500E-06,+48.9949733E-03
-153.5000E-06,+48.9949733E-03
-153.2500E-06,+250.0000000E-03
-153.0000E-06,+48.9949733E-03
-152.7500E-06,+250.0000000E-03
-152.5000E-06,-51.5075401E-03
-152.2500E-06,-302.7638235E-03
-152.0000E-06,-353.0150801E-03
-151.7500E-06,-554.0201068E-03
-151.5000E-06,-554.0201068E-03
-151.2500E-06,-503.7688502E-03
-151.0000E-06,-353.0150801E-03
-150.7500E-06,-101.7587967E-03
-150.5000E-06,+48.9949733E-03
-150.2500E-06,+250.0000000E-03
-150.0000E-06,+250.0000000E-03
-149.7500E-06,+451.0050267E-03
-149.5000E-06,+350.5025133E-03
-149.2500E-06,+250.0000000E-03
-149.0000E-06,+48.9949733E-03
-148.7500E-06,-353.0150801E-03
-148.5000E-06,-353.0150801E-03
-148.2500E-06,-554.0201068E-03
-148.0000E-06,-554.0201068E-03
-147.7500E-06,-704.7738768E-03
-147.5000E-06,-554.0201068E-03
-147.2500E-06,-554.0201068E-03
-147.0000E-06,-353.0150801E-03
-146.7500E-06,+48.9949733E-03
-146.5000E-06,+149.4974867E-03
-146.2500E-06,+300.2512566E-03
-146.0000E-06,+250.0000000E-03
-145.7500E-06,+300.2512567E-03
-145.5000E-06,+149.4974866E-03
-145.2500E-06,+48.9949733E-03
-145.0000E-06,-152.0100534E-03
-144.7500E-06,-503.7688501E-03
-144.5000E-06,-554.0201068E-03
-144.2500E-06,-554.0201068E-03
-144.0000E-06,-554.0201068E-03
-143.7500E-06,-503.7688501E-03
-143.5000E-06,-252.5125668E-03
-143.2500E-06,-101.7587968E-03
-143.0000E-06,+48.9949733E-03
-142.7500E-06,+48.9949733E-03
-142.5000E-06,+250.0000000E-03
-142.2500E-06,+48.9949733E-03
-142.0000E-06,+48.9949733E-03
-141.7500E-06,-101.7587967E-03
-141.5000E-06,-51.5075401E-03
-141.2500E-06,-1.2562833E-03
-141.0000E-06,-152.0100533E-03
-140.7500E-06,-152.0100534E-03
-140.5000E-06,-152.0100534E-03
-140.2500E-06,-1.2562833E-03
-140.0000E-06,+48.9949733E-03
-139.7500E-06,+48.9949733E-03
-139.5000E-06,+250.0000000E-03
-139.2500E-06,+250.0000000E-03
-139.0000E-06,+249.9999999E-03
-138.7500E-06,+250.0000000E-03
-138.5000E-06,+48.9949733E-03
-138.2500E-06,-101.7587968E-03
-138.0000E-06,-152.0100534E-03
-137.7500E-06,-302.7638234E-03
-137.5000E-06,-353.0150801E-03
-137.2500E-06,-755.0251335E-03
-137.0000E-06,-755.0251335E-03
-136.7500E-06,-905.7789035E-03
-136.5000E-06,-453.5175934E-03
-136.2500E-06,-353.0150801E-03
-136.0000E-06,+48.9949733E-03
-135.7500E-06,+300.2512567E-03
-135.5000E-06,+451.0050267E-03
-135.2500E-06,+451.0050267E-03
-135.0000E-06,+451.0050266E-03
-134.7500E-06,+199.7487433E-03
-134.5000E-06,-51.5075400E-03
-134.2500E-06,-152.0100534E-03
-134.0000E-06,-353.0150801E-03
-133.7500E-06,-554.0201068E-03
-133.5000E-06,-654.5226202E-03
-133.2500E-06,-604.2713634E-03
-133.0000E-06,-554.0201068E-03
-132.7500E-06,-353.0150801E-03
-132.5000E-06,-51.5075400E-03
-132.2500E-06,+250.0000000E-03
-132.0000E-06,+451.0050267E-03
-131.7500E-06,+250.0000000E-03
-131.5000E-06,+48.9949733E-03
-131.2500E-06,+48.9949733E-03
-131.0000E-06,-152.0100534E-03
-130.7500E-06,-152.0100534E-03
-130.5000E-06,-152.0100534E-03
-130.2500E-06,+48.9949733E-03
-130.0000E-06,+249.9999999E-03
-129.7500E-06,+250.0000000E-03
-129.5000E-06,+250.0000000E-03
-129.2500E-06,+250.0000000E-03
-129.0000E-06,+249.9999999E-03
-128.7500E-06,+48.9949733E-03
-128.5000E-06,-51.5075400E-03
-128.2500E-06,-152.0100534E-03
-128.0000E-06,-353.0150801E-03
-127.7500E-06,-353.0150801E-03
-127.5000E-06,-353.0150801E-03
-127.2500E-06,-302.7638235E-03
-127.0000E-06,-152.0100534E-03
-126.7500E-06,-152.0100534E-03
-126.5000E-06,-51.5075400E-03
-126.2500E-06,+48.9949733E-03
-126.0000E-06,+48.9949733E-03
-125.7500E-06,+48.9949733E-03
-125.5000E-06,+250.0000000E-03
-125.2500E-06,+48.9949733E-03
-125.0000E-06,+48.9949733E-03
-124.7500E-06,+48.9949733E-03
-124.5000E-06,-51.5075401E-03
-124.2500E-06,-152.0100534E-03
-124.0000E-06,-353.0150801E-03
-123.7500E-06,-152.0100534E-03
-123.5000E-06,-353.0150801E-03
-123.2500E-06,-353.0150801E-03
-123.0000E-06,-353.0150801E-03
-122.7500E-06,-353.0150801E-03
-122.5000E-06,-353.0150801E-03
-122.2500E-06,-152.0100534E-03
-122.0000E-06,+48.9949733E-03
-121.7500E-06,+250.0000000E-03
-121.5000E-06,+350.5025134E-03
-121.2500E-06,+451.0050267E-03
-121.0000E-06,+451.0050267E-03
-120.7500E-06,+250.0000000E-03
-120.5000E-06,+48.9949733E-03
-120.2500E-06,-152.0100534E-03
-120.0000E-06,-353.0150801E-03
-119.7500E-06,-353.0150801E-03
-119.5000E-06,-152.0100534E-03
-119.2500E-06,+199.7487434E-03
-119.0000E-06,+451.0050267E-03
-118.7500E-06,+451.0050267E-03
-118.5000E-06,+149.4974866E-03
-118.2500E-06,-152.0100534E-03
-118.0000E-06,-554.0201068E-03
-117.7500E-06,-905.7789034E-03
-117.5000E-06,-956.0301602E-03
-117.2500E-06,-956.0301602E-03
-117.0000E-06,-755.0251335E-03
-116.7500E-06,-554.0201068E-03
-116.5000E-06,-152.0100534E-03
-116.2500E-06,+250.0000000E-03
-116.0000E-06,+451.0050267E-03
-115.7500E-06,+451.0050267E-03
-115.5000E-06,+451.0050267E-03
-115.2500E-06,+300.2512566E-03
-115.0000E-06,+249.9999999E-03
-114.7500E-06,-152.0100534E-03
-114.5000E-06,-252.5125668E-03
-114.2500E-06,-403.2663367E-03
-114.0000E-06,-554.0201067E-03
-113.7500E-06,-302.7638234E-03
-113.5000E-06,-152.0100534E-03
-113.2500E-06,+199.7487434E-03
-113.0000E-06,+48.9949733E-03
-112.7500E-06,+48.9949733E-03
-112.5000E-06,-152.0100534E-03
-112.2500E-06,+48.9949733E-03
-112.0000E-06,+48.9949733E-03
-111.7500E-06,-1.2562834E-03
-111.5000E-06,+48.9949733E-03
-111.2500E-06,-302.7638235E-03
-111.0000E-06,-353.0150801E-03
-110.7500E-06,-353.0150801E-03
-110.5000E-06,-353.0150801E-03
-110.2500E-06,-202.2613100E-03
-110.0000E-06,-152.0100535E-03
-109.7500E-06,-152.0100534E-03
-109.5000E-06,+48.9949733E-03
-109.2500E-06,+199.7487434E-03
-109.0000E-06,+250.0000000E-03
-108.7500E-06,+250.0000000E-03
-108.5000E-06,+250.0000000E-03
-108.2500E-06,+48.9949733E-03
-108.0000E-06,-152.0100534E-03
-107.7500E-06,-503.7688500E-03
-107.5000E-06,-453.5175935E-03
-107.2500E-06,-554.0201068E-03
-107.0000E-06,-554.0201068E-03
-106.7500E-06,-353.0150801E-03
-106.5000E-06,-152.0100534E-03
-106.2500E-06,-101.7587968E-03
-106.0000E-06,+48.9949733E-03
-105.7500E-06,+48.9949733E-03
-105.5000E-06,+48.9949733E-03
-105.2500E-06,+48.9949733E-03
-105.0000E-06,+250.0000000E-03
-104.7500E-06,+451.0050267E-03
-104.5000E-06,+250.0000000E-03
-104.2500E-06,+99.2462299E-03
-104.0000E-06,+48.9949733E-03
-103.7500E-06,-152.0100534E-03
-103.5000E-06,-554.0201068E-03
-103.2500E-06,-755.0251335E-03
-103.0000E-06,-755.0251335E-03
-102.7500E-06,-554.0201068E-03
-102.5000E-06,-353.0150801E-03
-102.2500E-06,-1.2562833E-03
-102.0000E-06,+451.0050266E-03
-101.7500E-06,+451.0050267E-03
-101.5000E-06,+551.5075401E-03
-101.2500E-06,+451.0050267E-03
-101.0000E-06,+48.9949733E-03
-100.7500E-06,-152.0100534E-03
-100.5000E-06,-453.5175935E-03
-100.2500E-06,-403.2663367E-03
-100.0000E-06,-554.0201068E-03
-99.7500E-06,-302.7638233E-03
-99.5000E-06,-152.0100534E-03
-99.2500E-06,-101.7587968E-03
-99.0000E-06,+48.9949733E-03
-98.7500E-06,+48.9949733E-03
-98.5000E-06,+48.9949733E-03
-98.2500E-06,-101.7587968E-03
-98.0000E-06,-152.0100534E-03
-97.7500E-06,-152.0100534E-03
-97.5000E-06,-51.5075400E-03
-97.2500E-06,+48.9949733E-03
-97.0000E-06,+48.9949733E-03
-96.7500E-06,+250.0000000E-03
-96.5000E-06,+250.0000000E-03
-96.2500E-06,+250.0000000E-03
-96.0000E-06,+48.9949734E-03
-95.7500E-06,-152.0100534E-03
-95.5000E-06,-353.0150801E-03
-95.2500E-06,-604.2713634E-03
-95.0000E-06,-956.0301601E-03
-94.7500E-06,-805.2763902E-03
-94.5000E-06,-654.5226201E-03
-94.2500E-06,-152.0100534E-03
-94.0000E-06,+48.9949733E-03
-93.7500E-06,+300.2512568E-03
-93.5000E-06,+451.0050267E-03
-93.2500E-06,+451.0050267E-03
-93.0000E-06,+451.0050267E-03
-92.7500E-06,+250.0000000E-03
-92.5000E-06,+48.9949733E-03
-92.2500E-06,-152.0100534E-03
-92.0000E-06,-554.0201068E-03
-91.7500E-06,-554.0201068E-03
-91.5000E-06,-554.0201068E-03
-91.2500E-06,-554.0201068E-03
-91.0000E-06,-353.0150801E-03
-90.7500E-06,-152.0100534E-03
-90.5000E-06,-152.0100534E-03
-90.2500E-06,-1.2562833E-03
-90.0000E-06,+48.9949733E-03
-89.7500E-06,+48.9949733E-03
-89.5000E-06,+250.0000000E-03
-89.2500E-06,+99.2462299E-03
-89.0000E-06,+48.9949734E-03
-88.7500E-06,+48.9949733E-03
-88.5000E-06,-51.5075400E-03
-88.2500E-06,-152.0100534E-03
-88.0000E-06,-353.0150801E-03
-87.7500E-06,-353.0150801E-03
-87.5000E-06,-353.0150801E-03
-87.2500E-06,-353.0150801E-03
-87.0000E-06,-353.0150801E-03
-86.7500E-06,-152.0100534E-03
-86.5000E-06,-152.0100534E-03
-86.2500E-06,+48.9949733E-03
-86.0000E-06,+250.0000000E-03
-85.7500E-06,+400.7537699E-03
-85.5000E-06,+451.0050267E-03
-85.2500E-06,+601.7587968E-03
-85.0000E-06,+250.0000000E-03
-84.7500E-06,+199.7487432E-03
-84.5000E-06,-51.5075401E-03
-84.2500E-06,-503.7688502E-03
-84.0000E-06,-755.0251336E-03
-83.7500E-06,-1.1067839301E+00
-83.5000E-06,-956.0301602E-03
-83.2500E-06,-755.0251335E-03
-83.0000E-06,-554.0201068E-03
-82.7500E-06,-302.7638233E-03
-82.5000E-06,+48.9949733E-03
-82.2500E-06,+300.2512566E-03
-82.0000E-06,+652.0100534E-03
-81.7500E-06,+853.0150801E-03
-81.5000E-06,+853.0150801E-03
-81.2500E-06,+652.0100534E-03
-81.0000E-06,+250.0000000E-03
-80.7500E-06,+48.9949733E-03
-80.5000E-06,-252.5125668E-03
-80.2500E-06,-403.2663367E-03
-80.0000E-06,-755.0251335E-03
-79.7500E-06,-956.0301602E-03
-79.5000E-06,-956.0301602E-03
-79.2500E-06,-956.0301602E-03
-79.0000E-06,-755.0251334E-03
-78.7500E-06,-353.0150801E-03
-78.5000E-06,+48.9949733E-03
-78.2500E-06,+451.0050267E-03
-78.0000E-06,+652.0100534E-03
-77.7500E-06,+601.7587966E-03
-77.5000E-06,+551.5075401E-03
-77.2500E-06,+451.0050267E-03
-77.0000E-06,+451.0050267E-03
-76.7500E-06,+250.0000000E-03
-76.5000E-06,+48.9949733E-03
-76.2500E-06,-152.0100534E-03
-76.0000E-06,-353.0150801E-03
-75.7500E-06,-604.2713636E-03
-75.5000E-06,-755.0251335E-03
-75.2500E-06,-805.2763901E-03
-75.0000E-06,-554.0201069E-03
-74.7500E-06,-202.2613102E-03
-74.5000E-06,+48.9949733E-03
-74.2500E-06,+250.0000000E-03
-74.0000E-06,+451.0050267E-03
-73.7500E-06,+451.0050267E-03
-73.5000E-06,+451.0050267E-03
-73.2500E-06,+250.0000000E-03
-73.0000E-06,+48.9949734E-03
-72.7500E-06,+250.0000000E-03
-72.5000E-06,+149.4974866E-03
-72.2500E-06,+48.9949733E-03
-72.0000E-06,-152.0100534E-03
-71.7500E-06,-202.2613102E-03
-71.5000E-06,-554.0201068E-03
-71.2500E-06,-554.0201068E-03
-71.0000E-06,-554.0201068E-03
-70.7500E-06,-403.2663369E-03
-70.5000E-06,-252.5125667E-03
-70.2500E-06,-152.0100534E-03
-70.0000E-06,+48.9949732E-03
-69.7500E-06,+48.9949733E-03
-69.5000E-06,-51.5075401E-03
-69.2500E-06,+48.9949733E-03
-69.0000E-06,-152.0100533E-03
-68.7500E-06,+250.0000000E-03
-68.5000E-06,+250.0000000E-03
-68.2500E-06,+451.0050267E-03
-68.0000E-06,+652.0100534E-03
-67.7500E-06,+601.7587966E-03
-67.5000E-06,+250.0000000E-03
-67.2500E-06,-353.0150801E-03
-67.0000E-06,-554.0201069E-03
-66.7500E-06,-956.0301602E-03
-66.5000E-06,-1.0565326736E+00
-66.2500E-06,-956.0301602E-03
-66.0000E-06,-554.0201068E-03
-65.7500E-06,+48.9949733E-03
-65.5000E-06,+250.0000000E-03
-65.2500E-06,+501.2562833E-03
-65.0000E-06,+652.0100533E-03
-64.7500E-06,+652.0100534E-03
-64.5000E-06,+451.0050267E-03
-64.2500E-06,+250.0000000E-03
-64.0000E-06,+48.9949732E-03
-63.7500E-06,-302.7638233E-03
-63.5000E-06,-554.0201068E-03
-63.2500E-06,-403.2663367E-03
-63.0000E-06,-353.0150801E-03
-62.7500E-06,-152.0100534E-03
-62.5000E-06,+48.9949733E-03
-62.2500E-06,+48.9949733E-03
-62.0000E-06,-152.0100533E-03
-61.7500E-06,-1.2562835E-03
-61.5000E-06,-353.0150801E-03
-61.2500E-06,-353.0150801E-03
-61.0000E-06,-353.0150801E-03
-60.7500E-06,-353.0150801E-03
-60.5000E-06,-353.0150801E-03
-60.2500E-06,-202.2613100E-03
-60.0000E-06,+48.9949732E-03
-59.7500E-06,+48.9949733E-03
-59.5000E-06,+48.9949733E-03
-59.2500E-06,-1.2562833E-03
-59.0000E-06,-152.0100534E-03
-58.7500E-06,-353.0150801E-03
-58.5000E-06,-152.0100534E-03
-58.2500E-06,+48.9949733E-03
-58.0000E-06,+48.9949733E-03
-57.7500E-06,-101.7587966E-03
-57.5000E-06,+48.9949733E-03
-57.2500E-06,+48.9949733E-03
-57.0000E-06,+250.0000001E-03
-56.7500E-06,+451.0050267E-03
-56.5000E-06,+551.5075399E-03
-56.2500E-06,+250.0000000E-03
-56.0000E-06,-152.0100534E-03
-55.7500E-06,-503.7688500E-03
-55.5000E-06,-554.0201068E-03
-55.2500E-06,-704.7738769E-03
-55.0000E-06,-554.0201068E-03
-54.7500E-06,-353.0150801E-03
-54.5000E-06,-252.5125666E-03
-54.2500E-06,-152.0100534E-03
-54.0000E-06,+48.9949733E-03
-53.7500E-06,+48.9949733E-03
-53.5000E-06,+250.0000000E-03
-53.2500E-06,+48.9949733E-03
-53.0000E-06,+48.9949733E-03
-52.7500E-06,-1.2562835E-03
-52.5000E-06,-252.5125668E-03
-52.2500E-06,-302.7638235E-03
-52.0000E-06,-353.0150801E-03
-51.7500E-06,-353.0150801E-03
-51.5000E-06,-353.0150801E-03
-51.2500E-06,-152.0100534E-03
-51.0000E-06,-152.0100534E-03
-50.7500E-06,+48.9949733E-03
-50.5000E-06,+48.9949733E-03
-50.2500E-06,+48.9949733E-03
-50.0000E-06,+249.9999999E-03
-49.7500E-06,+199.7487432E-03
-49.5000E-06,+250.0000000E-03
-49.2500E-06,+48.9949733E-03
-49.0000E-06,+48.9949733E-03
-48.7500E-06,+48.9949733E-03
-48.5000E-06,-51.5075401E-03
-48.2500E-06,-152.0100534E-03
-48.0000E-06,-353.0150801E-03
-47.7500E-06,-353.0150801E-03
-47.5000E-06,-353.0150801E-03
-47.2500E-06,-403.2663367E-03
-47.0000E-06,-353.0150801E-03
-46.7500E-06,-101.7587966E-03
-46.5000E-06,+48.9949733E-03
-46.2500E-06,+199.7487434E-03
-46.0000E-06,+48.9949733E-03
-45.7500E-06,+48.9949733E-03
-45.5000E-06,-51.5075399E-03
-45.2500E-06,-152.0100534E-03
-45.0000E-06,-152.0100534E-03
-44.7500E-06,-1.2562835E-03
-44.5000E-06,-152.0100534E-03
-44.2500E-06,-152.0100534E-03
-44.0000E-06,-152.0100534E-03
-43.7500E-06,+99.2462301E-03
-43.5000E-06,+48.9949733E-03
-43.2500E-06,+48.9949733E-03
-43.0000E-06,+48.9949733E-03
-42.7500E-06,+199.7487432E-03
-42.5000E-06,+48.9949733E-03
-42.2500E-06,+48.9949733E-03
-42.0000E-06,-152.0100534E-03
-41.7500E-06,-302.7638233E-03
-41.5000E-06,-152.0100534E-03
-41.2500E-06,-152.0100534E-03
-41.0000E-06,-152.0100534E-03
-40.7500E-06,+48.9949733E-03
-40.5000E-06,+48.9949733E-03
-40.2500E-06,-101.7587968E-03
-40.0000E-06,+48.9949733E-03
-39.7500E-06,+48.9949733E-03
-39.5000E-06,-152.0100534E-03
-39.2500E-06,-202.2613100E-03
-39.0000E-06,-152.0100535E-03
-38.7500E-06,-202.2613102E-03
-38.5000E-06,-152.0100534E-03
-38.2500E-06,-353.0150801E-03
-38.0000E-06,-152.0100535E-03
-37.7500E-06,-353.0150801E-03
-37.5000E-06,-353.0150801E-03
-37.2500E-06,-202.2613100E-03
-37.0000E-06,-152.0100534E-03
-36.7500E-06,-152.0100534E-03
-36.5000E-06,+48.9949733E-03
-36.2500E-06,+99.2462299E-03
-36.0000E-06,+250.0000001E-03
-35.7500E-06,+451.0050267E-03
-35.5000E-06,+350.5025133E-03
-35.2500E-06,+250.0000000E-03
-35.0000E-06,+48.9949733E-03
-34.7500E-06,-353.0150801E-03
-34.5000E-06,-453.5175935E-03
-34.2500E-06,-554.0201068E-03
-34.0000E-06,-554.0201068E-03
-33.7500E-06,-554.0201068E-03
-33.5000E-06,-353.0150801E-03
-33.2500E-06,-152.0100534E-03
-33.0000E-06,+48.9949733E-03
-32.7500E-06,+48.9949733E-03
-32.5000E-06,+250.0000000E-03
-32.2500E-06,+250.0000000E-03
-32.0000E-06,+250.0000000E-03
-31.7500E-06,+400.7537699E-03
-31.5000E-06,+250.0000000E-03
-31.2500E-06,+250.0000000E-03
-31.0000E-06,+48.9949734E-03
-30.7500E-06,+48.9949733E-03
-30.5000E-06,-252.5125668E-03
-30.2500E-06,-202.2613100E-03
-30.0000E-06,-353.0150802E-03
-29.7500E-06,-353.0150801E-03
-29.5000E-06,-353.0150801E-03
-29.2500E-06,-353.0150801E-03
-29.0000E-06,-152.0100535E-03
-28.7500E-06,-152.0100534E-03
-28.5000E-06,-51.5075399E-03
-28.2500E-06,+48.9949733E-03
-28.0000E-06,-152.0100533E-03
-27.7500E-06,+48.9949733E-03
-27.5000E-06,+48.9949733E-03
-27.2500E-06,-1.2562833E-03
-27.0000E-06,+48.9949733E-03
-26.7500E-06,-152.0100534E-03
-26.5000E-06,-51.5075399E-03
-26.2500E-06,-152.0100534E-03
-26.0000E-06,-152.0100534E-03
-25.7500E-06,-353.0150801E-03
-25.5000E-06,-353.0150801E-03
-25.2500E-06,-403.2663367E-03
-25.0000E-06,-353.0150801E-03
-24.7500E-06,-1.2562835E-03
-24.5000E-06,-51.5075400E-03
-24.2500E-06,-152.0100534E-03
-24.0000E-06,+48.9949732E-03
-23.7500E-06,-202.2613102E-03
-23.5000E-06,-252.5125666E-03
-23.2500E-06,-353.0150801E-03
-23.0000E-06,-152.0100535E-03
-22.7500E-06,-152.0100534E-03
-22.5000E-06,-51.5075401E-03
-22.2500E-06,-101.7587968E-03
-22.0000E-06,+250.0000000E-03
-21.7500E-06,+250.0000000E-03
-21.5000E-06,+350.5025134E-03
-21.2500E-06,+199.7487434E-03
-21.0000E-06,+250.0000000E-03
-20.7500E-06,+48.9949733E-03
-20.5000E-06,-51.5075400E-03
-20.2500E-06,-353.0150801E-03
-20.0000E-06,-353.0150801E-03
-19.7500E-06,-503.7688500E-03
-19.5000E-06,-353.0150801E-03
-19.2500E-06,-353.0150801E-03
-19.0000E-06,-353.0150801E-03
-18.7500E-06,-152.0100534E-03
-18.5000E-06,-152.0100534E-03
-18.2500E-06,-1.2562833E-03
-18.0000E-06,-152.0100534E-03
-17.7500E-06,+48.9949733E-03
-17.5000E-06,+250.0000000E-03
-17.2500E-06,+250.0000000E-03
-17.0000E-06,+250.0000000E-03
-16.7500E-06,+250.0000000E-03
-16.5000E-06,+149.4974866E-03
-16.2500E-06,-101.7587968E-03
-16.0000E-06,-353.0150801E-03
-15.7500E-06,-554.0201068E-03
-15.5000E-06,-654.5226202E-03
-15.2500E-06,-503.7688502E-03
-15.0000E-06,-353.0150801E-03
-14.7500E-06,-302.7638233E-03
-14.5000E-06,-152.0100534E-03
-14.2500E-06,+48.9949733E-03
-14.0000E-06,+48.9949734E-03
-13.7500E-06,+250.0000000E-03
-13.5000E-06,+250.0000000E-03
-13.2500E-06,+250.0000000E-03
-13.0000E-06,+48.9949733E-03
-12.7500E-06,-152.0100534E-03
-12.5000E-06,-353.0150801E-03
-12.2500E-06,-604.2713634E-03
-12.0000E-06,-755.0251335E-03
-11.7500E-06,-554.0201068E-03
-11.5000E-06,-353.0150801E-03
-11.2500E-06,+48.9949733E-03
-11.0000E-06,+48.9949734E-03
-10.7500E-06,+451.0050267E-03
-10.5000E-06,+652.0100534E-03
-10.2500E-06,+652.0100534E-03
-10.0000E-06,+250.0000000E-03
-9.7500E-06,+48.9949733E-03
-9.5000E-06,-152.0100534E-03
-9.2500E-06,-554.0201068E-03
-9.0000E-06,-554.0201068E-03
-8.7500E-06,-403.2663369E-03
-8.5000E-06,-554.0201068E-03
-8.2500E-06,-353.0150801E-03
-8.0000E-06,-152.0100534E-03
-7.7500E-06,+48.9949733E-03
-7.5000E-06,+250.0000000E-03
-7.2500E-06,+250.0000000E-03
-7.0000E-06,+250.0000000E-03
-6.7500E-06,+199.7487432E-03
-6.5000E-06,-51.5075401E-03
-6.2500E-06,-101.7587968E-03
-6.0000E-06,-152.0100534E-03
-5.7500E-06,-152.0100534E-03
-5.5000E-06,-152.0100534E-03
-5.2500E-06,-353.0150801E-03
-5.0000E-06,-152.0100534E-03
-4.7500E-06,-1.2562835E-03
-4.5000E-06,-51.5075400E-03
-4.2500E-06,-1.2562833E-03
-4.0000E-06,-152.0100533E-03
-3.7500E-06,+99.2462301E-03
-3.5000E-06,+250.0000000E-03
-3.2500E-06,+400.7537701E-03
-3.0000E-06,+451.0050266E-03
-2.7500E-06,+250.0000000E-03
-2.5000E-06,+48.9949733E-03
-2.2500E-06,-152.0100534E-03
-2.0000E-06,-353.0150801E-03
-1.7500E-06,-704.7738767E-03
-1.5000E-06,-755.0251335E-03
-1.2500E-06,-604.2713634E-03
-1.0000E-06,-353.0150801E-03
-750.0E-09,-152.0100534E-03
-500.0E-09,+48.9949733E-03
-250.0E-09,+1.0540201068E+00
+0.0E+00,+3.0640703738E+00
+250.0E-09,+4.6721105874E+00
+500.0E-09,+5.2751256675E+00
+750.0E-09,+5.1243718973E+00
+1.0000E-06,+4.2701005339E+00
+1.2500E-06,+2.6620603204E+00
+1.5000E-06,+1.0540201068E+00
+1.7500E-06,-554.0201068E-03
+2.0000E-06,-1.7600502671E+00
+2.2500E-06,-2.9158291704E+00
+2.5000E-06,-3.2675879673E+00
+2.7500E-06,-3.0163316837E+00
+3.0000E-06,-2.3630653472E+00
+3.2500E-06,-1.5590452403E+00
+3.5000E-06,-654.5226200E-03
+3.7500E-06,+250.0000000E-03
+4.0000E-06,+1.0540201068E+00
+4.2500E-06,+1.2550251335E+00
+4.5000E-06,-554.0201068E-03
+4.7500E-06,-3.7198492774E+00
+5.0000E-06,-6.9861809612E+00
+5.2500E-06,-9.8002513349E+00
+5.5000E-06,-9.9007538484E+00
+5.7500E-06,-7.5891960412E+00
+6.0000E-06,-5.7801508009E+00
+6.2500E-06,-2.9660804272E+00
+6.5000E-06,-51.5075400E-03
+6.7500E-06,+2.6118090638E+00
+7.0000E-06,+4.4711055607E+00
+7.2500E-06,+5.2751256675E+00
+7.5000E-06,+5.0741206408E+00
+7.7500E-06,+4.3203517905E+00
+8.0000E-06,+2.8630653471E+00
+8.2500E-06,+1.4560301602E+00
+8.5000E-06,+1.4560301602E+00
+8.7500E-06,+1.4560301602E+00
+9.0000E-06,+853.0150801E-03
+9.2500E-06,+48.9949733E-03
+9.5000E-06,-1.5590452403E+00
+9.7500E-06,-3.3178392240E+00
+10.0000E-06,-4.1721105875E+00
+10.2500E-06,-4.5741206408E+00
+10.5000E-06,-4.1721105874E+00
+10.7500E-06,-3.3178392240E+00
+11.0000E-06,-1.7600502670E+00
+11.2500E-06,-503.7688500E-03
+11.5000E-06,+752.5125668E-03
+11.7500E-06,+1.6570351869E+00
+12.0000E-06,+2.2600502670E+00
+12.2500E-06,+2.6620603204E+00
+12.5000E-06,+2.9635678605E+00
+12.7500E-06,+5.2248744109E+00
+13.0000E-06,+8.0891960411E+00
+13.2500E-06,+9.4962312281E+00
+13.5000E-06,+8.9937186613E+00
+13.7500E-06,+6.1293970308E+00
+14.0000E-06,+2.6620603203E+00
+14.2500E-06,-1.1570351869E+00
+14.5000E-06,-4.4736181275E+00
+14.7500E-06,-7.7399498113E+00
+15.0000E-06,-10.6042714418E+00
+15.2500E-06,-12.2123116553E+00
+15.5000E-06,-12.0113066286E+00
+15.7500E-06,-10.2022613883E+00
+16.0000E-06,-6.9861809610E+00
+16.2500E-06,-2.3630653471E+00
+16.5000E-06,+1.3555276469E+00
+16.7500E-06,+3.0640703738E+00
+17.0000E-06,+1.6570351868E+00
+17.2500E-06,-554.0201068E-03
+17.5000E-06,-2.4635678603E+00
+17.7500E-06,-3.6193467638E+00
+18.0000E-06,-4.1721105874E+00
+18.2500E-06,-3.9711055607E+00
+18.5000E-06,-3.4685929938E+00
+18.7500E-06,-2.3630653471E+00
+19.0000E-06,-956.0301602E-03
+19.2500E-06,+250.0000000E-03
+19.5000E-06,+1.2550251335E+00
+19.7500E-06,+2.0087939837E+00
+20.0000E-06,+2.2600502670E+00
+20.2500E-06,+2.0590452403E+00
+20.5000E-06,+1.6570351869E+00
+20.7500E-06,+1.0540201068E+00
+21.0000E-06,+250.0000000E-03
+21.2500E-06,-353.0150801E-03
+21.5000E-06,-855.5276469E-03
+21.7500E-06,-805.2763901E-03
+22.0000E-06,+1.0540201069E+00
+22.2500E-06,+3.9183417373E+00
+22.5000E-06,+6.9836683945E+00
+22.7500E-06,+9.0942211747E+00
+23.0000E-06,+9.0942211747E+00
+23.2500E-06,+7.4861809611E+00
+23.5000E-06,+4.9736181273E+00
+23.7500E-06,+2.0590452403E+00
+24.0000E-06,-755.0251335E-03
+24.2500E-06,-3.1670854539E+00
+24.5000E-06,-4.8756281807E+00
+24.7500E-06,-5.3781407475E+00
+25.0000E-06,-5.1771357208E+00
+25.2500E-06,-4.3731156141E+00
+25.5000E-06,-2.8655779137E+00
+25.7500E-06,-1.1570351869E+00
+26.0000E-06,+451.0050267E-03
+26.2500E-06,+1.6570351869E+00
+26.5000E-06,+2.6620603204E+00
+26.7500E-06,+3.0640703738E+00
+27.0000E-06,+2.8630653470E+00
+27.2500E-06,+2.2600502670E+00
+27.5000E-06,+1.2550251335E+00
+27.7500E-06,+451.0050267E-03
+28.0000E-06,-554.0201068E-03
+28.2500E-06,-1.9610552937E+00
+28.5000E-06,-4.8756281809E+00
+28.7500E-06,-7.9912060946E+00
+29.0000E-06,-11.0062814951E+00
+29.2500E-06,-12.2123116553E+00
+29.5000E-06,-11.8103016019E+00
+29.7500E-06,-9.8002513349E+00
+30.0000E-06,-6.1821608543E+00
+30.2500E-06,-1.9108040369E+00
+30.5000E-06,+1.6570351869E+00
+30.7500E-06,+4.4208543041E+00
+31.0000E-06,+5.8781407475E+00
+31.2500E-06,+6.2298995442E+00
+31.5000E-06,+5.5766332074E+00
+31.7500E-06,+4.0690955073E+00
+32.0000E-06,+2.0590452403E+00
+32.2500E-06,+48.9949733E-03
+32.5000E-06,-1.5590452403E+00
+32.7500E-06,-2.7650754005E+00
+33.0000E-06,-3.5690955074E+00
+33.2500E-06,-3.7701005340E+00
+33.5000E-06,-3.3680904806E+00
+33.7500E-06,-2.3630653471E+00
+34.0000E-06,-1.3580402136E+00
+34.2500E-06,-152.0100534E-03
+34.5000E-06,+853.0150801E-03
+34.7500E-06,+1.8580402136E+00
+35.0000E-06,+3.6670854539E+00
+35.2500E-06,+6.4811558276E+00
+35.5000E-06,+7.2851759344E+00
+35.7500E-06,+5.3253769240E+00
+36.0000E-06,+2.2600502669E+00
+36.2500E-06,-1.1570351869E+00
+36.5000E-06,-4.4736181275E+00
+36.7500E-06,-6.9861809611E+00
+37.0000E-06,-6.5841709077E+00
+37.2500E-06,-6.3831658810E+00
+37.5000E-06,-4.7751256675E+00
+37.7500E-06,-1.8103015236E+00
+38.0000E-06,+1.2550251335E+00
+38.2500E-06,+4.3203517907E+00
+38.5000E-06,+7.3856784479E+00
+38.7500E-06,+10.0992463082E+00
+39.0000E-06,+8.8932161480E+00
+39.2500E-06,+5.8278894908E+00
+39.5000E-06,+2.3605527802E+00
+39.7500E-06,-1.1067839303E+00
+40.0000E-06,-4.1721105874E+00
+40.2500E-06,-6.9861809611E+00
+40.5000E-06,-5.3781407475E+00
+40.7500E-06,-1.4082914702E+00
+41.0000E-06,+652.0100535E-03
+41.2500E-06,+2.2600502670E+00
+41.5000E-06,+3.1645728872E+00
+41.7500E-06,+3.4660804272E+00
+42.0000E-06,+2.6620603204E+00
+42.2500E-06,-1.2562835E-03
+42.5000E-06,-3.1670854539E+00
+42.7500E-06,-6.3831658810E+00
+43.0000E-06,-8.3932161480E+00
+43.2500E-06,-7.1871859878E+00
+43.5000E-06,-5.0766332074E+00
+43.7500E-06,-2.1620603204E+00
+44.0000E-06,+853.0150802E-03
+44.2500E-06,+4.1193467640E+00
+44.5000E-06,+7.0841709077E+00
+44.7500E-06,+8.8429648914E+00
+45.0000E-06,+7.8881910144E+00
+45.2500E-06,+4.8731156141E+00
+45.5000E-06,+1.4560301602E+00
+45.7500E-06,-1.9108040371E+00
+46.0000E-06,-5.1771357209E+00
+46.2500E-06,-8.2424623781E+00
+46.5000E-06,-7.8907035812E+00
+46.7500E-06,-4.7751256675E+00
+47.0000E-06,-1.9610552936E+00
+47.2500E-06,+652.0100534E-03
+47.5000E-06,+2.9635678605E+00
+47.7500E-06,+4.6721105874E+00
+48.0000E-06,+5.0741206408E+00
+48.2500E-06,+3.8680904806E+00
+48.5000E-06,+1.4560301602E+00
+48.7500E-06,-1.3580402136E+00
+49.0000E-06,-4.3731156141E+00
+49.2500E-06,-6.1821608543E+00
+49.5000E-06,-6.5841709077E+00
+49.7500E-06,-5.9309045711E+00
+50.0000E-06,-3.7701005339E+00
+50.2500E-06,-805.2763903E-03
+50.5000E-06,+1.8580402136E+00
+50.7500E-06,+4.4711055607E+00
+51.0000E-06,+5.6771357208E+00
+51.2500E-06,+5.2751256675E+00
+51.5000E-06,+3.6670854539E+00
+51.7500E-06,+1.3052763901E+00
+52.0000E-06,-1.1570351869E+00
+52.2500E-06,-3.2173367106E+00
+52.5000E-06,-4.7751256675E+00
+52.7500E-06,-5.1771357208E+00
+53.0000E-06,-4.5741206408E+00
+53.2500E-06,-3.1168341971E+00
+53.5000E-06,-1.0565326734E+00
+53.7500E-06,+1.0540201068E+00
+54.0000E-06,+2.8630653471E+00
+54.2500E-06,+3.7173367106E+00
+54.5000E-06,+3.5665829406E+00
+54.7500E-06,+2.6620603204E+00
+55.0000E-06,+1.0540201069E+00
+55.2500E-06,-353.0150801E-03
+55.5000E-06,-1.7600502670E+00
+55.7500E-06,-2.7148241439E+00
+56.0000E-06,-2.5640703738E+00
+56.2500E-06,-1.9610552937E+00
+56.5000E-06,-855.5276469E-03
+56.7500E-06,+99.2462299E-03
+57.0000E-06,+1.2550251334E+00
+57.2500E-06,+1.8580402136E+00
+57.5000E-06,+1.7575377001E+00
+57.7500E-06,+1.3052763901E+00
+58.0000E-06,+250.0000000E-03
+58.2500E-06,-755.0251335E-03
+58.5000E-06,-1.5590452403E+00
+58.7500E-06,-1.7600502670E+00
+59.0000E-06,-1.5590452403E+00
+59.2500E-06,-956.0301602E-03
+59.5000E-06,-152.0100534E-03
+59.7500E-06,+652.0100534E-03
+60.0000E-06,+1.4560301603E+00
+60.2500E-06,+1.8580402136E+00
+60.5000E-06,+1.7575377003E+00
+60.7500E-06,+1.4560301602E+00
+61.0000E-06,+1.0540201068E+00
+61.2500E-06,+451.0050267E-03
+61.5000E-06,-152.0100534E-03
+61.7500E-06,-755.0251335E-03
+62.0000E-06,-1.3580402136E+00
+62.2500E-06,-1.3580402136E+00
+62.5000E-06,-956.0301602E-03
+62.7500E-06,-353.0150801E-03
+63.0000E-06,+250.0000001E-03
+63.2500E-06,+903.2663369E-03
+63.5000E-06,+1.3555276467E+00
+63.7500E-06,+1.3052763901E+00
+64.0000E-06,+1.0540201068E+00
+64.2500E-06,+652.0100534E-03
+64.5000E-06,+48.9949733E-03
+64.7500E-06,-554.0201068E-03
+65.0000E-06,-956.0301602E-03
+65.2500E-06,-1.1067839301E+00
+65.5000E-06,-956.0301602E-03
+65.7500E-06,-755.0251335E-03
+66.0000E-06,-353.0150801E-03
+66.2500E-06,+48.9949733E-03
+66.5000E-06,+250.0000000E-03
+66.7500E-06,+601.7587968E-03
+67.0000E-06,+652.0100534E-03
+67.2500E-06,+652.0100534E-03
+67.5000E-06,+350.5025133E-03
+67.7500E-06,-152.0100534E-03
+68.0000E-06,-554.0201068E-03
+68.2500E-06,-956.0301602E-03
+68.5000E-06,-956.0301602E-03
+68.7500E-06,-956.0301602E-03
+69.0000E-06,-755.0251335E-03
+69.2500E-06,-353.0150801E-03
+69.5000E-06,-252.5125668E-03
+69.7500E-06,+48.9949733E-03
+70.0000E-06,+48.9949733E-03
+70.2500E-06,-101.7587966E-03
+70.5000E-06,-152.0100534E-03
+70.7500E-06,-353.0150801E-03
+71.0000E-06,-554.0201068E-03
+71.2500E-06,-956.0301602E-03
+71.5000E-06,-956.0301602E-03
+71.7500E-06,-755.0251335E-03
+72.0000E-06,-152.0100535E-03
+72.2500E-06,+48.9949733E-03
+72.5000E-06,+250.0000000E-03
+72.7500E-06,+451.0050267E-03
+73.0000E-06,+451.0050266E-03
+73.2500E-06,+250.0000000E-03
+73.5000E-06,-252.5125668E-03
+73.7500E-06,-755.0251335E-03
+74.0000E-06,-1.1570351869E+00
+74.2500E-06,-1.1570351869E+00
+74.5000E-06,-956.0301602E-03
+74.7500E-06,-755.0251335E-03
+75.0000E-06,-353.0150801E-03
+75.2500E-06,-101.7587966E-03
+75.5000E-06,+250.0000000E-03
+75.7500E-06,+451.0050267E-03
+76.0000E-06,+451.0050267E-03
+76.2500E-06,+300.2512568E-03
+76.5000E-06,+149.4974868E-03
+76.7500E-06,-152.0100534E-03
+77.0000E-06,-554.0201068E-03
+77.2500E-06,-956.0301602E-03
+77.5000E-06,-1.1570351869E+00
+77.7500E-06,-956.0301602E-03
+78.0000E-06,-755.0251335E-03
+78.2500E-06,-554.0201068E-03
+78.5000E-06,-353.0150801E-03
+78.7500E-06,+48.9949733E-03
+79.0000E-06,+250.0000001E-03
+79.2500E-06,+652.0100534E-03
+79.5000E-06,+752.5125666E-03
+79.7500E-06,+802.7638235E-03
+80.0000E-06,+652.0100534E-03
+80.2500E-06,+451.0050267E-03
+80.5000E-06,+48.9949733E-03
+80.7500E-06,-152.0100534E-03
+81.0000E-06,-353.0150802E-03
+81.2500E-06,-604.2713636E-03
+81.5000E-06,-755.0251335E-03
+81.7500E-06,-554.0201068E-03
+82.0000E-06,-353.0150802E-03
+82.2500E-06,-202.2613102E-03
+82.5000E-06,-51.5075399E-03
+82.7500E-06,+99.2462299E-03
+83.0000E-06,+250.0000000E-03
+83.2500E-06,+199.7487432E-03
+83.5000E-06,+149.4974865E-03
+83.7500E-06,+99.2462299E-03
+84.0000E-06,+250.0000000E-03
+84.2500E-06,+250.0000000E-03
+84.5000E-06,+250.0000000E-03
+84.7500E-06,+250.0000000E-03
+85.0000E-06,+48.9949734E-03
+85.2500E-06,+250.0000000E-03
+85.5000E-06,+48.9949733E-03
+85.7500E-06,+48.9949733E-03
+86.0000E-06,+48.9949733E-03
+86.2500E-06,-1.2562835E-03
+86.5000E-06,-152.0100534E-03
+86.7500E-06,-152.0100534E-03
+87.0000E-06,+48.9949732E-03
+87.2500E-06,-1.2562835E-03
+87.5000E-06,-51.5075402E-03
+87.7500E-06,-152.0100534E-03
+88.0000E-06,-152.0100534E-03
+88.2500E-06,-152.0100534E-03
+88.5000E-06,-152.0100534E-03
+88.7500E-06,-152.0100534E-03
+89.0000E-06,+48.9949733E-03
+89.2500E-06,+250.0000000E-03
+89.5000E-06,+350.5025132E-03
+89.7500E-06,+501.2562833E-03
+90.0000E-06,+652.0100534E-03
+90.2500E-06,+652.0100534E-03
+90.5000E-06,+652.0100534E-03
+90.7500E-06,+501.2562833E-03
+91.0000E-06,+451.0050267E-03
+91.2500E-06,+48.9949733E-03
+91.5000E-06,-353.0150801E-03
+91.7500E-06,-755.0251335E-03
+92.0000E-06,-1.1570351869E+00
+92.2500E-06,-1.3580402136E+00
+92.5000E-06,-1.4585427268E+00
+92.7500E-06,-1.3580402136E+00
+93.0000E-06,-1.1570351869E+00
+93.2500E-06,-704.7738767E-03
+93.5000E-06,-152.0100534E-03
+93.7500E-06,+400.7537701E-03
+94.0000E-06,+652.0100534E-03
+94.2500E-06,+853.0150801E-03
+94.5000E-06,+652.0100534E-03
+94.7500E-06,+250.0000000E-03
+95.0000E-06,-152.0100534E-03
+95.2500E-06,-403.2663369E-03
+95.5000E-06,-554.0201068E-03
+95.7500E-06,-353.0150801E-03
+96.0000E-06,-353.0150801E-03
+96.2500E-06,-353.0150801E-03
+96.5000E-06,-453.5175936E-03
+96.7500E-06,-704.7738769E-03
+97.0000E-06,-755.0251335E-03
+97.2500E-06,-956.0301602E-03
+97.5000E-06,-554.0201068E-03
+97.7500E-06,-353.0150801E-03
+98.0000E-06,-152.0100532E-03
+98.2500E-06,+451.0050267E-03
+98.5000E-06,+752.5125669E-03
+98.7500E-06,+853.0150801E-03
+99.0000E-06,+853.0150801E-03
+99.2500E-06,+451.0050267E-03
+99.5000E-06,+48.9949733E-03
+99.7500E-06,-704.7738769E-03
+100.0000E-06,-956.0301603E-03
+100.2500E-06,-1.3580402136E+00
+100.5000E-06,-1.3580402136E+00
+100.7500E-06,-956.0301602E-03
+101.0000E-06,-554.0201068E-03
+101.2500E-06,+48.9949733E-03
+101.5000E-06,+451.0050267E-03
+101.7500E-06,+702.2613100E-03
+102.0000E-06,+853.0150801E-03
+102.2500E-06,+601.7587966E-03
+102.5000E-06,+48.9949733E-03
+102.7500E-06,-353.0150801E-03
+103.0000E-06,-755.0251334E-03
+103.2500E-06,-755.0251335E-03
+103.5000E-06,-755.0251335E-03
+103.7500E-06,-353.0150801E-03
+104.0000E-06,-152.0100534E-03
+104.2500E-06,+250.0000000E-03
+104.5000E-06,+250.0000000E-03
+104.7500E-06,+250.0000000E-03
+105.0000E-06,+48.9949733E-03
+105.2500E-06,-1.2562835E-03
+105.5000E-06,-353.0150801E-03
+105.7500E-06,-554.0201068E-03
+106.0000E-06,-554.0201068E-03
+106.2500E-06,-353.0150801E-03
+106.5000E-06,-252.5125666E-03
+106.7500E-06,+48.9949733E-03
+107.0000E-06,+48.9949734E-03
+107.2500E-06,+451.0050267E-03
+107.5000E-06,+551.5075402E-03
+107.7500E-06,+300.2512566E-03
+108.0000E-06,+48.9949734E-03
+108.2500E-06,-101.7587966E-03
+108.5000E-06,-152.0100534E-03
+108.7500E-06,-302.7638235E-03
+109.0000E-06,-353.0150801E-03
+109.2500E-06,-152.0100534E-03
+109.5000E-06,-252.5125669E-03
+109.7500E-06,-353.0150801E-03
+110.0000E-06,-353.0150801E-03
+110.2500E-06,-403.2663369E-03
+110.5000E-06,-353.0150801E-03
+110.7500E-06,-152.0100534E-03
+111.0000E-06,+48.9949733E-03
+111.2500E-06,+48.9949733E-03
+111.5000E-06,+149.4974865E-03
+111.7500E-06,+400.7537701E-03
+112.0000E-06,+250.0000000E-03
+112.2500E-06,+48.9949733E-03
+112.5000E-06,-152.0100534E-03
+112.7500E-06,-353.0150801E-03
+113.0000E-06,-554.0201068E-03
+113.2500E-06,-554.0201068E-03
+113.5000E-06,-453.5175936E-03
+113.7500E-06,-353.0150801E-03
+114.0000E-06,-152.0100534E-03
+114.2500E-06,-152.0100534E-03
+114.5000E-06,+48.9949733E-03
+114.7500E-06,+48.9949733E-03
+115.0000E-06,+48.9949734E-03
+115.2500E-06,+48.9949733E-03
+115.5000E-06,+48.9949733E-03
+115.7500E-06,-152.0100534E-03
+116.0000E-06,-353.0150801E-03
+116.2500E-06,-755.0251335E-03
+116.5000E-06,-855.5276470E-03
+116.7500E-06,-604.2713633E-03
+117.0000E-06,-353.0150801E-03
+117.2500E-06,+48.9949733E-03
+117.5000E-06,+451.0050267E-03
+117.7500E-06,+702.2613099E-03
+118.0000E-06,+1.0540201067E+00
+118.2500E-06,+702.2613102E-03
+118.5000E-06,+551.5075402E-03
+118.7500E-06,+250.0000000E-03
+119.0000E-06,-152.0100533E-03
+119.2500E-06,-202.2613102E-03
+119.5000E-06,-453.5175936E-03
+119.7500E-06,-755.0251335E-03
+120.0000E-06,-956.0301602E-03
+120.2500E-06,-956.0301602E-03
+120.5000E-06,-654.5226200E-03
+120.7500E-06,-503.7688502E-03
+121.0000E-06,-353.0150801E-03
+121.2500E-06,+48.9949733E-03
+121.5000E-06,+250.0000000E-03
+121.7500E-06,+652.0100534E-03
+122.0000E-06,+652.0100535E-03
+122.2500E-06,+652.0100534E-03
+122.5000E-06,+451.0050267E-03
+122.7500E-06,+48.9949733E-03
+123.0000E-06,-353.0150801E-03
+123.2500E-06,-554.0201068E-03
+123.5000E-06,-755.0251335E-03
+123.7500E-06,-755.0251335E-03
+124.0000E-06,-755.0251335E-03
+124.2500E-06,-554.0201068E-03
+124.5000E-06,-353.0150801E-03
+124.7500E-06,-101.7587969E-03
+125.0000E-06,+250.0000000E-03
+125.2500E-06,+451.0050267E-03
+125.5000E-06,+652.0100534E-03
+125.7500E-06,+652.0100534E-03
+126.0000E-06,+451.0050267E-03
+126.2500E-06,+400.7537699E-03
+126.5000E-06,+48.9949733E-03
+126.7500E-06,-353.0150801E-03
+127.0000E-06,-353.0150801E-03
+127.2500E-06,-403.2663369E-03
+127.5000E-06,-453.5175933E-03
+127.7500E-06,-353.0150801E-03
+128.0000E-06,-353.0150801E-03
+128.2500E-06,-353.0150801E-03
+128.5000E-06,-152.0100534E-03
+128.7500E-06,-1.2562832E-03
+129.0000E-06,+48.9949733E-03
+129.2500E-06,-1.2562835E-03
+129.5000E-06,+48.9949733E-03
+129.7500E-06,+48.9949733E-03
+130.0000E-06,+48.9949734E-03
+130.2500E-06,+48.9949733E-03
+130.5000E-06,+48.9949733E-03
+130.7500E-06,+48.9949733E-03
+131.0000E-06,-152.0100533E-03
+131.2500E-06,-152.0100534E-03
+131.5000E-06,-152.0100534E-03
+131.7500E-06,-152.0100534E-03
+132.0000E-06,-152.0100534E-03
+132.2500E-06,-353.0150801E-03
+132.5000E-06,-353.0150801E-03
+132.7500E-06,-302.7638236E-03
+133.0000E-06,-152.0100534E-03
+133.2500E-06,+48.9949733E-03
+133.5000E-06,+350.5025132E-03
+133.7500E-06,+451.0050267E-03
+134.0000E-06,+451.0050267E-03
+134.2500E-06,+451.0050267E-03
+134.5000E-06,+149.4974865E-03
+134.7500E-06,-101.7587969E-03
+135.0000E-06,-554.0201068E-03
+135.2500E-06,-755.0251335E-03
+135.5000E-06,-755.0251335E-03
+135.7500E-06,-704.7738770E-03
+136.0000E-06,-152.0100534E-03
+136.2500E-06,-152.0100534E-03
+136.5000E-06,+48.9949733E-03
+136.7500E-06,+199.7487435E-03
+137.0000E-06,+250.0000000E-03
+137.2500E-06,+48.9949733E-03
+137.5000E-06,-152.0100534E-03
+137.7500E-06,-302.7638236E-03
+138.0000E-06,-353.0150801E-03
+138.2500E-06,-202.2613102E-03
+138.5000E-06,-51.5075399E-03
+138.7500E-06,+48.9949733E-03
+139.0000E-06,+249.9999999E-03
+139.2500E-06,+48.9949733E-03
+139.5000E-06,+149.4974868E-03
+139.7500E-06,+48.9949733E-03
+140.0000E-06,-152.0100534E-03
+140.2500E-06,-403.2663369E-03
+140.5000E-06,-654.5226203E-03
+140.7500E-06,-604.2713633E-03
+141.0000E-06,-755.0251334E-03
+141.2500E-06,-503.7688500E-03
+141.5000E-06,-152.0100534E-03
+141.7500E-06,+199.7487435E-03
+142.0000E-06,+451.0050267E-03
+142.2500E-06,+451.0050267E-03
+142.5000E-06,+451.0050267E-03
+142.7500E-06,+652.0100534E-03
+143.0000E-06,+451.0050267E-03
+143.2500E-06,+99.2462301E-03
+143.5000E-06,-152.0100534E-03
+143.7500E-06,-503.7688503E-03
+144.0000E-06,-554.0201068E-03
+144.2500E-06,-554.0201068E-03
+144.5000E-06,-755.0251335E-03
+144.7500E-06,-554.0201068E-03
+145.0000E-06,-353.0150801E-03
+145.2500E-06,+48.9949733E-03
+145.5000E-06,+250.0000000E-03
+145.7500E-06,+451.0050267E-03
+146.0000E-06,+250.0000001E-03
+146.2500E-06,+451.0050267E-03
+146.5000E-06,+350.5025132E-03
+146.7500E-06,+300.2512565E-03
+147.0000E-06,+451.0050266E-03
+147.2500E-06,-1.2562835E-03
+147.5000E-06,-152.0100534E-03
+147.7500E-06,-554.0201068E-03
+148.0000E-06,-554.0201069E-03
+148.2500E-06,-755.0251335E-03
+148.5000E-06,-654.5226200E-03
+148.7500E-06,-554.0201068E-03
+149.0000E-06,-353.0150802E-03
+149.2500E-06,-152.0100534E-03
+149.5000E-06,-152.0100534E-03
+149.7500E-06,+250.0000000E-03
+150.0000E-06,+451.0050267E-03
+150.2500E-06,+601.7587966E-03
+150.5000E-06,+451.0050267E-03
+150.7500E-06,+250.0000000E-03
+151.0000E-06,+48.9949733E-03
+151.2500E-06,-152.0100534E-03
+151.5000E-06,-252.5125666E-03
+151.7500E-06,-403.2663366E-03
+152.0000E-06,-554.0201068E-03
+152.2500E-06,-755.0251335E-03
+152.5000E-06,-654.5226200E-03
+152.7500E-06,-554.0201068E-03
+153.0000E-06,-554.0201066E-03
+153.2500E-06,-202.2613102E-03
+153.5000E-06,+48.9949733E-03
+153.7500E-06,+250.0000000E-03
+154.0000E-06,+451.0050267E-03
+154.2500E-06,+400.7537699E-03
+154.5000E-06,+250.0000000E-03
+154.7500E-06,+250.0000000E-03
+155.0000E-06,-152.0100532E-03
+155.2500E-06,-353.0150801E-03
+155.5000E-06,-453.5175936E-03
+155.7500E-06,-353.0150801E-03
+156.0000E-06,-353.0150801E-03
+156.2500E-06,-152.0100534E-03
+156.5000E-06,-51.5075402E-03
+156.7500E-06,-152.0100534E-03
+157.0000E-06,-353.0150799E-03
+157.2500E-06,-302.7638233E-03
+157.5000E-06,-353.0150801E-03
+157.7500E-06,-152.0100534E-03
+158.0000E-06,-152.0100534E-03
+158.2500E-06,+48.9949733E-03
+158.5000E-06,+250.0000000E-03
+158.7500E-06,+250.0000000E-03
+159.0000E-06,+250.0000000E-03
+159.2500E-06,-1.2562835E-03
+159.5000E-06,-152.0100534E-03
+159.7500E-06,-202.2613099E-03
+160.0000E-06,-554.0201068E-03
+160.2500E-06,-403.2663369E-03
+160.5000E-06,-453.5175936E-03
+160.7500E-06,-353.0150801E-03
+161.0000E-06,-152.0100534E-03
+161.2500E-06,+99.2462301E-03
+161.5000E-06,+250.0000000E-03
+161.7500E-06,+250.0000000E-03
+162.0000E-06,+250.0000000E-03
+162.2500E-06,+250.0000000E-03
+162.5000E-06,+48.9949733E-03
+162.7500E-06,-1.2562832E-03
+163.0000E-06,-152.0100534E-03
+163.2500E-06,-302.7638233E-03
+163.5000E-06,-252.5125669E-03
+163.7500E-06,-554.0201068E-03
+164.0000E-06,-554.0201068E-03
+164.2500E-06,-554.0201068E-03
+164.5000E-06,-554.0201068E-03
+164.7500E-06,-353.0150801E-03
+165.0000E-06,-152.0100534E-03
+165.2500E-06,+48.9949733E-03
+165.5000E-06,+250.0000000E-03
+165.7500E-06,+451.0050267E-03
+166.0000E-06,+451.0050269E-03
+166.2500E-06,+652.0100534E-03
+166.5000E-06,+451.0050267E-03
+166.7500E-06,+400.7537702E-03
+167.0000E-06,+249.9999998E-03
+167.2500E-06,-1.2562835E-03
+167.5000E-06,-353.0150801E-03
+167.7500E-06,-704.7738770E-03
+168.0000E-06,-956.0301602E-03
+168.2500E-06,-1.1067839301E+00
+168.5000E-06,-956.0301602E-03
+168.7500E-06,-905.7789037E-03
+169.0000E-06,-554.0201068E-03
+169.2500E-06,-202.2613102E-03
+169.5000E-06,+48.9949733E-03
+169.7500E-06,+451.0050267E-03
+170.0000E-06,+451.0050267E-03
+170.2500E-06,+451.0050267E-03
+170.5000E-06,+250.0000000E-03
+170.7500E-06,+199.7487435E-03
+171.0000E-06,+48.9949733E-03
+171.2500E-06,-152.0100534E-03
+171.5000E-06,-152.0100534E-03
+171.7500E-06,-152.0100534E-03
+172.0000E-06,-152.0100536E-03
+172.2500E-06,-152.0100534E-03
+172.5000E-06,+48.9949733E-03
+172.7500E-06,+48.9949733E-03
+173.0000E-06,+48.9949733E-03
+173.2500E-06,+48.9949733E-03
+173.5000E-06,+48.9949733E-03
+173.7500E-06,+48.9949733E-03
+174.0000E-06,-152.0100532E-03
+174.2500E-06,-202.2613102E-03
+174.5000E-06,-353.0150801E-03
+174.7500E-06,-503.7688503E-03
+175.0000E-06,-353.0150801E-03
+175.2500E-06,-353.0150801E-03
+175.5000E-06,-252.5125666E-03
+175.7500E-06,-152.0100534E-03
+176.0000E-06,-152.0100534E-03
+176.2500E-06,+48.9949733E-03
+176.5000E-06,+250.0000000E-03
+176.7500E-06,+300.2512565E-03
+177.0000E-06,+250.0000000E-03
+177.2500E-06,+300.2512568E-03
+177.5000E-06,+451.0050267E-03
+177.7500E-06,+250.0000000E-03
+178.0000E-06,-152.0100536E-03
+178.2500E-06,-353.0150801E-03
+178.5000E-06,-654.5226200E-03
+178.7500E-06,-554.0201068E-03
+179.0000E-06,-353.0150803E-03
+179.2500E-06,-152.0100534E-03
+179.5000E-06,-51.5075399E-03
+179.7500E-06,+48.9949733E-03
+180.0000E-06,+48.9949733E-03
+180.2500E-06,+48.9949733E-03
+180.5000E-06,-152.0100534E-03
+180.7500E-06,-1.2562832E-03
+181.0000E-06,+48.9949733E-03
+181.2500E-06,-152.0100534E-03
+181.5000E-06,-152.0100534E-03
+181.7500E-06,-152.0100534E-03
+182.0000E-06,-353.0150799E-03
+182.2500E-06,-152.0100534E-03
+182.5000E-06,+48.9949733E-03
+182.7500E-06,+99.2462298E-03
+183.0000E-06,+48.9949733E-03
+183.2500E-06,-152.0100534E-03
+183.5000E-06,-152.0100534E-03
+183.7500E-06,-202.2613099E-03
+184.0000E-06,-152.0100534E-03
+184.2500E-06,+48.9949733E-03
+184.5000E-06,+48.9949733E-03
+184.7500E-06,+199.7487435E-03
+185.0000E-06,+48.9949731E-03
+185.2500E-06,-101.7587966E-03
+185.5000E-06,+48.9949733E-03
+185.7500E-06,+48.9949733E-03
+186.0000E-06,+48.9949733E-03
+186.2500E-06,-101.7587966E-03
+186.5000E-06,-252.5125669E-03
+186.7500E-06,-503.7688503E-03
+187.0000E-06,-353.0150801E-03
+187.2500E-06,-353.0150801E-03
+187.5000E-06,-252.5125669E-03
+187.7500E-06,-1.2562832E-03
+188.0000E-06,+48.9949731E-03
+188.2500E-06,+48.9949733E-03
+188.5000E-06,+48.9949733E-03
+188.7500E-06,+48.9949733E-03
+189.0000E-06,+48.9949733E-03
+189.2500E-06,+48.9949733E-03
+189.5000E-06,+48.9949733E-03
+189.7500E-06,-152.0100534E-03
+190.0000E-06,-152.0100534E-03
+190.2500E-06,-202.2613102E-03
+190.5000E-06,-152.0100534E-03
+190.7500E-06,-152.0100534E-03
+191.0000E-06,-152.0100532E-03
+191.2500E-06,-101.7587965E-03
+191.5000E-06,-51.5075402E-03
+191.7500E-06,-152.0100534E-03
+192.0000E-06,-152.0100534E-03
+192.2500E-06,-403.2663369E-03
+192.5000E-06,-152.0100534E-03
+192.7500E-06,+451.0050267E-03
+193.0000E-06,+1.6570351871E+00
+193.2500E-06,+3.0640703738E+00
+193.5000E-06,+4.0690955073E+00
+193.7500E-06,+4.4711055607E+00
+194.0000E-06,+4.0690955073E+00
+194.2500E-06,+2.6620603204E+00
+194.5000E-06,+250.0000000E-03
+194.7500E-06,-2.1118090639E+00
+195.0000E-06,-4.5741206408E+00
+195.2500E-06,-5.6293970311E+00
+195.5000E-06,-6.5841709077E+00
+195.7500E-06,-6.5841709077E+00
+196.0000E-06,-5.5791457742E+00
+196.2500E-06,-3.9711055607E+00
+196.5000E-06,-2.1620603204E+00
+196.7500E-06,-202.2613099E-03
+197.0000E-06,+1.8580402136E+00
+197.2500E-06,+3.2650754005E+00
+197.5000E-06,+4.2701005340E+00
+197.7500E-06,+4.2701005340E+00
+198.0000E-06,+3.8680904806E+00
+198.2500E-06,+2.9133166039E+00
+198.5000E-06,+1.6570351869E+00
+198.7500E-06,+300.2512565E-03
+199.0000E-06,-755.0251335E-03
+199.2500E-06,-1.5590452403E+00
+199.5000E-06,-2.1620603204E+00
+199.7500E-06,-2.5138191173E+00
+200.0000E-06,-2.3630653469E+00
+200.2500E-06,-1.8103015238E+00
+200.5000E-06,-1.2575377001E+00
+200.7500E-06,-554.0201068E-03
+201.0000E-06,+48.9949733E-03
+201.2500E-06,+802.7638232E-03
+201.5000E-06,+1.3555276470E+00
+201.7500E-06,+1.6570351869E+00
+202.0000E-06,+1.4560301602E+00
+202.2500E-06,+1.0540201068E+00
+202.5000E-06,+451.0050267E-03
+202.7500E-06,-353.0150801E-03
+203.0000E-06,-755.0251335E-03
+203.2500E-06,-956.0301602E-03
+203.5000E-06,-956.0301602E-03
+203.7500E-06,-704.7738770E-03
+204.0000E-06,-353.0150801E-03
+204.2500E-06,-101.7587965E-03
+204.5000E-06,+250.0000000E-03
+204.7500E-06,+451.0050267E-03
+205.0000E-06,+451.0050265E-03
+205.2500E-06,-152.0100534E-03
+205.5000E-06,-152.0100534E-03
+205.7500E-06,-353.0150801E-03
+206.0000E-06,-353.0150801E-03
+206.2500E-06,-353.0150801E-03
+206.5000E-06,-353.0150801E-03
+206.7500E-06,-202.2613099E-03
+207.0000E-06,-152.0100534E-03
+207.2500E-06,-353.0150801E-03
+207.5000E-06,-353.0150801E-03
+207.7500E-06,-503.7688503E-03
+208.0000E-06,-353.0150803E-03
+208.2500E-06,-554.0201068E-03
+208.5000E-06,-252.5125669E-03
+208.7500E-06,+48.9949733E-03
+209.0000E-06,+250.0000000E-03
+209.2500E-06,+652.0100534E-03
+209.5000E-06,+652.0100534E-03
+209.7500E-06,+652.0100534E-03
+210.0000E-06,+451.0050267E-03
+210.2500E-06,+99.2462302E-03
+210.5000E-06,-252.5125669E-03
+210.7500E-06,-604.2713633E-03
+211.0000E-06,-956.0301602E-03
+211.2500E-06,-755.0251335E-03
+211.5000E-06,-554.0201068E-03
+211.7500E-06,-353.0150801E-03
+212.0000E-06,+48.9949733E-03
+212.2500E-06,+250.0000000E-03
+212.5000E-06,+350.5025135E-03
+212.7500E-06,+451.0050267E-03
+213.0000E-06,+451.0050267E-03
+213.2500E-06,+300.2512569E-03
+213.5000E-06,+250.0000000E-03
+213.7500E-06,+48.9949733E-03
+214.0000E-06,+48.9949733E-03
+214.2500E-06,-302.7638232E-03
+214.5000E-06,-453.5175933E-03
+214.7500E-06,-704.7738770E-03
+215.0000E-06,-554.0201068E-03
+215.2500E-06,-554.0201068E-03
+215.5000E-06,-353.0150801E-03
+215.7500E-06,-152.0100534E-03
+216.0000E-06,+48.9949733E-03
+216.2500E-06,+451.0050267E-03
+216.5000E-06,+451.0050267E-03
+216.7500E-06,+652.0100534E-03
+217.0000E-06,+652.0100534E-03
+217.2500E-06,+451.0050267E-03
+217.5000E-06,+48.9949733E-03
+217.7500E-06,-152.0100534E-03
+218.0000E-06,-554.0201066E-03
+218.2500E-06,-554.0201068E-03
+218.5000E-06,-755.0251335E-03
+218.7500E-06,-755.0251335E-03
+219.0000E-06,-755.0251335E-03
+219.2500E-06,-755.0251335E-03
+219.5000E-06,-554.0201068E-03
+219.7500E-06,-554.0201068E-03
+220.0000E-06,-152.0100536E-03
+220.2500E-06,+250.0000000E-03
+220.5000E-06,+551.5075402E-03
+220.7500E-06,+652.0100534E-03
+221.0000E-06,+451.0050267E-03
+221.2500E-06,+451.0050267E-03
+221.5000E-06,+250.0000000E-03
+221.7500E-06,+48.9949733E-03
+222.0000E-06,-152.0100532E-03
+222.2500E-06,-152.0100534E-03
+222.5000E-06,-353.0150801E-03
+222.7500E-06,-503.7688503E-03
+223.0000E-06,-554.0201068E-03
+223.2500E-06,-353.0150801E-03
+223.5000E-06,-152.0100534E-03
+223.7500E-06,+48.9949733E-03
+224.0000E-06,+250.0000000E-03
+224.2500E-06,+451.0050267E-03
+224.5000E-06,+350.5025135E-03
+224.7500E-06,+250.0000000E-03
+225.0000E-06,+48.9949731E-03
+225.2500E-06,-353.0150801E-03
+225.5000E-06,-252.5125666E-03
+225.7500E-06,-152.0100534E-03
+226.0000E-06,-152.0100534E-03
+226.2500E-06,+48.9949733E-03
+226.5000E-06,+48.9949733E-03
+226.7500E-06,+48.9949733E-03
+227.0000E-06,-152.0100534E-03
+227.2500E-06,-152.0100534E-03
+227.5000E-06,-353.0150801E-03
+227.7500E-06,-353.0150801E-03
+228.0000E-06,-353.0150801E-03
+228.2500E-06,-202.2613103E-03
+228.5000E-06,-152.0100534E-03
+228.7500E-06,-101.7587969E-03
+229.0000E-06,+249.9999998E-03
+229.2500E-06,+48.9949733E-03
+229.5000E-06,+149.4974865E-03
+229.7500E-06,+250.0000000E-03
+230.0000E-06,+250.0000000E-03
+230.2500E-06,+300.2512569E-03
+230.5000E-06,+149.4974868E-03
+230.7500E-06,-101.7587969E-03
+231.0000E-06,-353.0150801E-03
+231.2500E-06,-554.0201068E-03
+231.5000E-06,-554.0201068E-03
+231.7500E-06,-704.7738770E-03
+232.0000E-06,-554.0201066E-03
+232.2500E-06,-302.7638232E-03
+232.5000E-06,+48.9949733E-03
+232.7500E-06,+250.0000000E-03
+233.0000E-06,+451.0050267E-03
+233.2500E-06,+451.0050267E-03
+233.5000E-06,+350.5025132E-03
+233.7500E-06,+99.2462298E-03
+234.0000E-06,-152.0100534E-03
+234.2500E-06,-152.0100534E-03
+234.5000E-06,-152.0100534E-03
+234.7500E-06,-202.2613099E-03
+235.0000E-06,-353.0150801E-03
+235.2500E-06,-353.0150801E-03
+235.5000E-06,-554.0201068E-03
+235.7500E-06,-353.0150801E-03
+236.0000E-06,-554.0201066E-03
+236.2500E-06,-353.0150801E-03
+236.5000E-06,-353.0150801E-03
+236.7500E-06,-202.2613099E-03
+237.0000E-06,-152.0100534E-03
+237.2500E-06,+99.2462302E-03
+237.5000E-06,+149.4974869E-03
+237.7500E-06,+451.0050267E-03
+238.0000E-06,+250.0000000E-03
+238.2500E-06,+250.0000000E-03
+238.5000E-06,+250.0000000E-03
+238.7500E-06,+48.9949733E-03
+239.0000E-06,-152.0100534E-03
+239.2500E-06,-302.7638232E-03
+239.5000E-06,-152.0100534E-03
+239.7500E-06,-1.2562832E-03
+240.0000E-06,+48.9949733E-03
+240.2500E-06,+48.9949733E-03
+240.5000E-06,-51.5075398E-03
+240.7500E-06,+48.9949733E-03
+241.0000E-06,-152.0100534E-03
+241.2500E-06,-152.0100534E-03
+241.5000E-06,-152.0100534E-03
+241.7500E-06,-152.0100534E-03
+242.0000E-06,-353.0150801E-03
+242.2500E-06,-554.0201068E-03
+242.5000E-06,-453.5175932E-03
+242.7500E-06,-353.0150801E-03
+243.0000E-06,-152.0100534E-03
+243.2500E-06,+250.0000000E-03
+243.5000E-06,+652.0100534E-03
+243.7500E-06,+702.2613099E-03
+244.0000E-06,+652.0100534E-03
+244.2500E-06,+451.0050267E-03
+244.5000E-06,+250.0000000E-03
+244.7500E-06,-152.0100534E-03
+245.0000E-06,-152.0100536E-03
+245.2500E-06,-503.7688499E-03
+245.5000E-06,-453.5175936E-03
+245.7500E-06,-353.0150801E-03
+246.0000E-06,-554.0201068E-03
+246.2500E-06,-503.7688499E-03
+246.5000E-06,-252.5125665E-03
+246.7500E-06,-152.0100534E-03
+247.0000E-06,-152.0100534E-03
+247.2500E-06,+99.2462302E-03
+247.5000E-06,+48.9949733E-03
+247.7500E-06,+48.9949733E-03
+248.0000E-06,+48.9949733E-03
+248.2500E-06,+48.9949733E-03
+248.5000E-06,+48.9949733E-03
+248.7500E-06,-1.2562832E-03
+249.0000E-06,+48.9949731E-03
+249.2500E-06,-1.2562836E-03
+249.5000E-06,-252.5125666E-03
+249.7500E-06,-353.0150801E-03
