x-axis,1
second,Volt
-100.0000E-06,+221.0050263E-03
-99.9000E-06,+221.0050263E-03
-99.8000E-06,+422.0100529E-03
-99.7000E-06,+422.0100529E-03
-99.6000E-06,+623.0150796E-03
-99.5000E-06,+623.0150796E-03
-99.4000E-06,+623.0150796E-03
-99.3000E-06,+422.0100530E-03
-99.2000E-06,+536.8700682E-03
-99.1000E-06,+594.3000758E-03
-99.0000E-06,+422.0100529E-03
-98.9000E-06,+221.0050263E-03
-98.8000E-06,+221.0050263E-03
-98.7000E-06,+19.9999996E-03
-98.6000E-06,+19.9999996E-03
-98.5000E-06,-181.0050271E-03
-98.4000E-06,-181.0050271E-03
-98.3000E-06,-181.0050271E-03
-98.2000E-06,-324.5800462E-03
-98.1000E-06,-181.0050271E-03
-98.0000E-06,-267.1500386E-03
-97.9000E-06,-382.0100538E-03
-97.8000E-06,-181.0050271E-03
-97.7000E-06,-181.0050271E-03
-97.6000E-06,-181.0050271E-03
-97.5000E-06,-324.5800462E-03
-97.4000E-06,-181.0050271E-03
-97.3000E-06,-181.0050271E-03
-97.2000E-06,-181.0050271E-03
-97.1000E-06,-267.1500386E-03
-97.0000E-06,-181.0050271E-03
-96.9000E-06,-181.0050271E-03
-96.8000E-06,-324.5800462E-03
-96.7000E-06,-382.0100538E-03
-96.6000E-06,-382.0100538E-03
-96.5000E-06,-382.0100538E-03
-96.4000E-06,-382.0100538E-03
-96.3000E-06,-554.3000767E-03
-96.2000E-06,-382.0100538E-03
-96.1000E-06,-382.0100538E-03
-96.0000E-06,-382.0100538E-03
-95.9000E-06,-181.0050271E-03
-95.8000E-06,-181.0050271E-03
-95.7000E-06,-181.0050271E-03
-95.6000E-06,+19.9999996E-03
-95.5000E-06,+19.9999996E-03
-95.4000E-06,+19.9999996E-03
-95.3000E-06,+19.9999996E-03
-95.2000E-06,+221.0050263E-03
-95.1000E-06,+19.9999996E-03
-95.0000E-06,+19.9999996E-03
-94.9000E-06,+192.2900224E-03
-94.8000E-06,+19.9999996E-03
-94.7000E-06,+19.9999996E-03
-94.6000E-06,+19.9999996E-03
-94.5000E-06,+19.9999996E-03
-94.4000E-06,+19.9999996E-03
-94.3000E-06,+19.9999996E-03
-94.2000E-06,+19.9999996E-03
-94.1000E-06,+19.9999996E-03
-94.0000E-06,+77.4300072E-03
-93.9000E-06,+221.0050263E-03
-93.8000E-06,+221.0050263E-03
-93.7000E-06,+221.0050263E-03
-93.6000E-06,+221.0050263E-03
-93.5000E-06,+221.0050263E-03
-93.4000E-06,+221.0050263E-03
-93.3000E-06,+221.0050263E-03
-93.2000E-06,+221.0050263E-03
-93.1000E-06,+106.1450110E-03
-93.0000E-06,+19.9999996E-03
-92.9000E-06,+19.9999996E-03
-92.8000E-06,-8.7150043E-03
-92.7000E-06,-181.0050271E-03
-92.6000E-06,-181.0050271E-03
-92.5000E-06,-209.7200309E-03
-92.4000E-06,-382.0100538E-03
-92.3000E-06,-583.0150805E-03
-92.2000E-06,-468.1550653E-03
-92.1000E-06,-554.3000767E-03
-92.0000E-06,-583.0150805E-03
-91.9000E-06,-583.0150805E-03
-91.8000E-06,-554.3000767E-03
-91.7000E-06,-382.0100538E-03
-91.6000E-06,-382.0100538E-03
-91.5000E-06,-181.0050271E-03
-91.4000E-06,-181.0050271E-03
-91.3000E-06,-181.0050271E-03
-91.2000E-06,-123.5750195E-03
-91.1000E-06,-152.2900233E-03
-91.0000E-06,+19.9999996E-03
-90.9000E-06,+19.9999996E-03
-90.8000E-06,+19.9999996E-03
-90.7000E-06,-8.7150043E-03
-90.6000E-06,+163.5750186E-03
-90.5000E-06,-123.5750195E-03
-90.4000E-06,-181.0050271E-03
-90.3000E-06,+19.9999996E-03
-90.2000E-06,-181.0050271E-03
-90.1000E-06,-66.1450119E-03
-90.0000E-06,+19.9999996E-03
-89.9000E-06,-181.0050271E-03
-89.8000E-06,-37.4300081E-03
-89.7000E-06,-181.0050271E-03
-89.6000E-06,-94.8600157E-03
-89.5000E-06,-181.0050271E-03
-89.4000E-06,-181.0050271E-03
-89.3000E-06,-181.0050271E-03
-89.2000E-06,-238.4350348E-03
-89.1000E-06,-238.4350348E-03
-89.0000E-06,-382.0100538E-03
-88.9000E-06,-382.0100538E-03
-88.8000E-06,-181.0050271E-03
-88.7000E-06,-382.0100538E-03
-88.6000E-06,-209.7200310E-03
-88.5000E-06,-181.0050271E-03
-88.4000E-06,+19.9999996E-03
-88.3000E-06,+19.9999996E-03
-88.2000E-06,+19.9999996E-03
-88.1000E-06,+19.9999996E-03
-88.0000E-06,+19.9999996E-03
-87.9000E-06,+19.9999996E-03
-87.8000E-06,+19.9999996E-03
-87.7000E-06,+77.4300072E-03
-87.6000E-06,+221.0050263E-03
-87.5000E-06,+221.0050263E-03
-87.4000E-06,+221.0050263E-03
-87.3000E-06,+221.0050263E-03
-87.2000E-06,+221.0050263E-03
-87.1000E-06,+221.0050263E-03
-87.0000E-06,+221.0050263E-03
-86.9000E-06,+221.0050263E-03
-86.8000E-06,+221.0050263E-03
-86.7000E-06,+19.9999996E-03
-86.6000E-06,+221.0050263E-03
-86.5000E-06,+192.2900224E-03
-86.4000E-06,+19.9999996E-03
-86.3000E-06,-37.4300081E-03
-86.2000E-06,-8.7150042E-03
-86.1000E-06,-181.0050271E-03
-86.0000E-06,-181.0050271E-03
-85.9000E-06,-181.0050271E-03
-85.8000E-06,-209.7200310E-03
-85.7000E-06,-324.5800462E-03
-85.6000E-06,-382.0100538E-03
-85.5000E-06,-382.0100538E-03
-85.4000E-06,-382.0100538E-03
-85.3000E-06,-382.0100538E-03
-85.2000E-06,-583.0150805E-03
-85.1000E-06,-382.0100538E-03
-85.0000E-06,-583.0150805E-03
-84.9000E-06,-583.0150805E-03
-84.8000E-06,-554.3000767E-03
-84.7000E-06,-583.0150805E-03
-84.6000E-06,-583.0150805E-03
-84.5000E-06,-468.1550653E-03
-84.4000E-06,-382.0100538E-03
-84.3000E-06,-382.0100538E-03
-84.2000E-06,-382.0100538E-03
-84.1000E-06,-209.7200309E-03
-84.0000E-06,-181.0050271E-03
-83.9000E-06,-181.0050271E-03
-83.8000E-06,+19.9999996E-03
-83.7000E-06,-8.7150043E-03
-83.6000E-06,+19.9999996E-03
-83.5000E-06,+77.4300072E-03
-83.4000E-06,+221.0050263E-03
-83.3000E-06,+335.8650415E-03
-83.2000E-06,+221.0050263E-03
-83.1000E-06,+221.0050263E-03
-83.0000E-06,+221.0050263E-03
-82.9000E-06,+221.0050263E-03
-82.8000E-06,+221.0050263E-03
-82.7000E-06,+221.0050263E-03
-82.6000E-06,+19.9999996E-03
-82.5000E-06,+19.9999996E-03
-82.4000E-06,-66.1450119E-03
-82.3000E-06,+19.9999996E-03
-82.2000E-06,-37.4300081E-03
-82.1000E-06,-181.0050271E-03
-82.0000E-06,-181.0050271E-03
-81.9000E-06,-181.0050271E-03
-81.8000E-06,-181.0050271E-03
-81.7000E-06,-181.0050271E-03
-81.6000E-06,-181.0050271E-03
-81.5000E-06,-181.0050271E-03
-81.4000E-06,-181.0050271E-03
-81.3000E-06,-181.0050271E-03
-81.2000E-06,-94.8600157E-03
-81.1000E-06,-181.0050271E-03
-81.0000E-06,-181.0050271E-03
-80.9000E-06,-181.0050271E-03
-80.8000E-06,+19.9999996E-03
-80.7000E-06,-123.5750195E-03
-80.6000E-06,-181.0050271E-03
-80.5000E-06,-66.1450119E-03
-80.4000E-06,+19.9999995E-03
-80.3000E-06,-94.8600157E-03
-80.2000E-06,-181.0050271E-03
-80.1000E-06,-123.5750195E-03
-80.0000E-06,+19.9999996E-03
-79.9000E-06,+19.9999996E-03
-79.8000E-06,+19.9999996E-03
-79.7000E-06,+19.9999995E-03
-79.6000E-06,+19.9999996E-03
-79.5000E-06,+19.9999996E-03
-79.4000E-06,+19.9999996E-03
-79.3000E-06,+19.9999996E-03
-79.2000E-06,+19.9999996E-03
-79.1000E-06,+19.9999996E-03
-79.0000E-06,+19.9999996E-03
-78.9000E-06,-66.1450119E-03
-78.8000E-06,+19.9999996E-03
-78.7000E-06,+19.9999996E-03
-78.6000E-06,+19.9999996E-03
-78.5000E-06,+19.9999996E-03
-78.4000E-06,+19.9999996E-03
-78.3000E-06,+19.9999995E-03
-78.2000E-06,-94.8600157E-03
-78.1000E-06,-181.0050271E-03
-78.0000E-06,-181.0050271E-03
-77.9000E-06,-181.0050271E-03
-77.8000E-06,-382.0100538E-03
-77.7000E-06,-382.0100538E-03
-77.6000E-06,-382.0100538E-03
-77.5000E-06,-382.0100538E-03
-77.4000E-06,-382.0100538E-03
-77.3000E-06,-324.5800462E-03
-77.2000E-06,-382.0100538E-03
-77.1000E-06,-181.0050271E-03
-77.0000E-06,-382.0100538E-03
-76.9000E-06,-181.0050272E-03
-76.8000E-06,-181.0050271E-03
-76.7000E-06,-209.7200310E-03
-76.6000E-06,-181.0050271E-03
-76.5000E-06,-181.0050271E-03
-76.4000E-06,-181.0050271E-03
-76.3000E-06,-181.0050271E-03
-76.2000E-06,+19.9999996E-03
-76.1000E-06,+19.9999996E-03
-76.0000E-06,+221.0050263E-03
-75.9000E-06,+221.0050263E-03
-75.8000E-06,+221.0050263E-03
-75.7000E-06,+221.0050263E-03
-75.6000E-06,+221.0050263E-03
-75.5000E-06,+221.0050263E-03
-75.4000E-06,+134.8600148E-03
-75.3000E-06,+19.9999996E-03
-75.2000E-06,-181.0050271E-03
-75.1000E-06,-181.0050271E-03
-75.0000E-06,-181.0050271E-03
-74.9000E-06,-382.0100538E-03
-74.8000E-06,-382.0100538E-03
-74.7000E-06,-382.0100538E-03
-74.6000E-06,-382.0100538E-03
-74.5000E-06,-382.0100538E-03
-74.4000E-06,-238.4350348E-03
-74.3000E-06,-209.7200309E-03
-74.2000E-06,-181.0050271E-03
-74.1000E-06,+19.9999996E-03
-74.0000E-06,-94.8600157E-03
-73.9000E-06,+19.9999996E-03
-73.8000E-06,+221.0050263E-03
-73.7000E-06,+221.0050263E-03
-73.6000E-06,+249.7200300E-03
-73.5000E-06,+422.0100529E-03
-73.4000E-06,+422.0100529E-03
-73.3000E-06,+536.8700682E-03
-73.2000E-06,+422.0100529E-03
-73.1000E-06,+422.0100529E-03
-73.0000E-06,+422.0100529E-03
-72.9000E-06,+393.2950492E-03
-72.8000E-06,+221.0050263E-03
-72.7000E-06,+221.0050262E-03
-72.6000E-06,+106.1450110E-03
-72.5000E-06,+19.9999996E-03
-72.4000E-06,+19.9999996E-03
-72.3000E-06,-37.4300081E-03
-72.2000E-06,+19.9999996E-03
-72.1000E-06,-181.0050271E-03
-72.0000E-06,-181.0050271E-03
-71.9000E-06,-181.0050271E-03
-71.8000E-06,-382.0100538E-03
-71.7000E-06,-382.0100538E-03
-71.6000E-06,-382.0100538E-03
-71.5000E-06,-382.0100538E-03
-71.4000E-06,-382.0100538E-03
-71.3000E-06,-382.0100538E-03
-71.2000E-06,-496.8700691E-03
-71.1000E-06,-583.0150805E-03
-71.0000E-06,-583.0150805E-03
-70.9000E-06,-583.0150805E-03
-70.8000E-06,-583.0150805E-03
-70.7000E-06,-382.0100538E-03
-70.6000E-06,-382.0100538E-03
-70.5000E-06,-496.8700691E-03
-70.4000E-06,-554.3000767E-03
-70.3000E-06,-382.0100538E-03
-70.2000E-06,-382.0100538E-03
-70.1000E-06,-382.0100538E-03
-70.0000E-06,-382.0100538E-03
-69.9000E-06,-382.0100538E-03
-69.8000E-06,-382.0100538E-03
-69.7000E-06,-181.0050271E-03
-69.6000E-06,+19.9999996E-03
-69.5000E-06,-37.4300081E-03
-69.4000E-06,+221.0050263E-03
-69.3000E-06,+221.0050263E-03
-69.2000E-06,+221.0050263E-03
-69.1000E-06,+307.1500376E-03
-69.0000E-06,+422.0100529E-03
-68.9000E-06,+422.0100529E-03
-68.8000E-06,+422.0100529E-03
-68.7000E-06,+422.0100529E-03
-68.6000E-06,+422.0100529E-03
-68.5000E-06,+221.0050263E-03
-68.4000E-06,+422.0100529E-03
-68.3000E-06,+221.0050263E-03
-68.2000E-06,+221.0050263E-03
-68.1000E-06,+221.0050263E-03
-68.0000E-06,+221.0050263E-03
-67.9000E-06,+19.9999996E-03
-67.8000E-06,-181.0050271E-03
-67.7000E-06,-295.8650424E-03
-67.6000E-06,-353.2950500E-03
-67.5000E-06,-382.0100538E-03
-67.4000E-06,-583.0150805E-03
-67.3000E-06,-583.0150805E-03
-67.2000E-06,-583.0150805E-03
-67.1000E-06,-583.0150805E-03
-67.0000E-06,-669.1600919E-03
-66.9000E-06,-583.0150805E-03
-66.8000E-06,-583.0150805E-03
-66.7000E-06,-439.4400615E-03
-66.6000E-06,-382.0100538E-03
-66.5000E-06,-295.8650424E-03
-66.4000E-06,-181.0050271E-03
-66.3000E-06,-181.0050271E-03
-66.2000E-06,+19.9999996E-03
-66.1000E-06,-37.4300080E-03
-66.0000E-06,+221.0050263E-03
-65.9000E-06,+221.0050263E-03
-65.8000E-06,+221.0050263E-03
-65.7000E-06,+221.0050263E-03
-65.6000E-06,+422.0100529E-03
-65.5000E-06,+249.7200301E-03
-65.4000E-06,+422.0100529E-03
-65.3000E-06,+422.0100529E-03
-65.2000E-06,+221.0050263E-03
-65.1000E-06,+221.0050263E-03
-65.0000E-06,+221.0050263E-03
-64.9000E-06,+19.9999996E-03
-64.8000E-06,-8.7150043E-03
-64.7000E-06,-181.0050271E-03
-64.6000E-06,-324.5800462E-03
-64.5000E-06,-382.0100538E-03
-64.4000E-06,-382.0100538E-03
-64.3000E-06,-382.0100538E-03
-64.2000E-06,-295.8650425E-03
-64.1000E-06,-181.0050271E-03
-64.0000E-06,-181.0050271E-03
-63.9000E-06,-181.0050271E-03
-63.8000E-06,-8.7150042E-03
-63.7000E-06,-181.0050271E-03
-63.6000E-06,-181.0050271E-03
-63.5000E-06,-181.0050271E-03
-63.4000E-06,-181.0050271E-03
-63.3000E-06,-181.0050271E-03
-63.2000E-06,-181.0050271E-03
-63.1000E-06,-382.0100538E-03
-63.0000E-06,-382.0100538E-03
-62.9000E-06,-181.0050272E-03
-62.8000E-06,-382.0100538E-03
-62.7000E-06,-209.7200310E-03
-62.6000E-06,-181.0050271E-03
-62.5000E-06,-123.5750195E-03
-62.4000E-06,-181.0050271E-03
-62.3000E-06,-181.0050271E-03
-62.2000E-06,+19.9999996E-03
-62.1000E-06,+106.1450109E-03
-62.0000E-06,+19.9999996E-03
-61.9000E-06,+163.5750187E-03
-61.8000E-06,+19.9999996E-03
-61.7000E-06,+221.0050263E-03
-61.6000E-06,+134.8600148E-03
-61.5000E-06,+19.9999996E-03
-61.4000E-06,+19.9999996E-03
-61.3000E-06,+19.9999996E-03
-61.2000E-06,+19.9999996E-03
-61.1000E-06,-37.4300081E-03
-61.0000E-06,-152.2900234E-03
-60.9000E-06,-181.0050271E-03
-60.8000E-06,-181.0050271E-03
-60.7000E-06,-181.0050271E-03
-60.6000E-06,-181.0050271E-03
-60.5000E-06,+19.9999996E-03
-60.4000E-06,-37.4300081E-03
-60.3000E-06,+19.9999996E-03
-60.2000E-06,-94.8600156E-03
-60.1000E-06,+19.9999995E-03
-60.0000E-06,-66.1450118E-03
-59.9000E-06,-181.0050271E-03
-59.8000E-06,-181.0050271E-03
-59.7000E-06,-382.0100538E-03
-59.6000E-06,-382.0100538E-03
-59.5000E-06,-382.0100538E-03
-59.4000E-06,-382.0100538E-03
-59.3000E-06,-468.1550652E-03
-59.2000E-06,-382.0100538E-03
-59.1000E-06,-525.5850730E-03
-59.0000E-06,-382.0100538E-03
-58.9000E-06,-181.0050271E-03
-58.8000E-06,-181.0050271E-03
-58.7000E-06,-181.0050271E-03
-58.6000E-06,+19.9999996E-03
-58.5000E-06,+221.0050263E-03
-58.4000E-06,+364.5800454E-03
-58.3000E-06,+221.0050263E-03
-58.2000E-06,+422.0100529E-03
-58.1000E-06,+536.8700681E-03
-58.0000E-06,+422.0100529E-03
-57.9000E-06,+422.0100529E-03
-57.8000E-06,+221.0050263E-03
-57.7000E-06,+278.4350338E-03
-57.6000E-06,+221.0050263E-03
-57.5000E-06,+192.2900225E-03
-57.4000E-06,+19.9999996E-03
-57.3000E-06,-181.0050271E-03
-57.2000E-06,-267.1500385E-03
-57.1000E-06,-382.0100538E-03
-57.0000E-06,-382.0100538E-03
-56.9000E-06,-439.4400615E-03
-56.8000E-06,-410.7250576E-03
-56.7000E-06,-496.8700690E-03
-56.6000E-06,-583.0150805E-03
-56.5000E-06,-468.1550652E-03
-56.4000E-06,-583.0150805E-03
-56.3000E-06,-382.0100538E-03
-56.2000E-06,-382.0100538E-03
-56.1000E-06,-382.0100538E-03
-56.0000E-06,-382.0100538E-03
-55.9000E-06,-382.0100538E-03
-55.8000E-06,-382.0100538E-03
-55.7000E-06,-209.7200310E-03
-55.6000E-06,-181.0050271E-03
-55.5000E-06,-382.0100538E-03
-55.4000E-06,-181.0050271E-03
-55.3000E-06,-181.0050271E-03
-55.2000E-06,+19.9999996E-03
-55.1000E-06,+19.9999996E-03
-55.0000E-06,+19.9999996E-03
-54.9000E-06,+221.0050263E-03
-54.8000E-06,+221.0050263E-03
-54.7000E-06,+48.7150033E-03
-54.6000E-06,+221.0050263E-03
-54.5000E-06,+221.0050263E-03
-54.4000E-06,+221.0050263E-03
-54.3000E-06,+221.0050263E-03
-54.2000E-06,+19.9999996E-03
-54.1000E-06,+19.9999996E-03
-54.0000E-06,+19.9999996E-03
-53.9000E-06,-181.0050271E-03
-53.8000E-06,-181.0050271E-03
-53.7000E-06,-295.8650425E-03
-53.6000E-06,-181.0050271E-03
-53.5000E-06,-181.0050271E-03
-53.4000E-06,-238.4350348E-03
-53.3000E-06,-353.2950501E-03
-53.2000E-06,-382.0100538E-03
-53.1000E-06,-382.0100538E-03
-53.0000E-06,-583.0150805E-03
-52.9000E-06,-583.0150805E-03
-52.8000E-06,-583.0150805E-03
-52.7000E-06,-583.0150805E-03
-52.6000E-06,-583.0150805E-03
-52.5000E-06,-583.0150805E-03
-52.4000E-06,-583.0150805E-03
-52.3000E-06,-382.0100538E-03
-52.2000E-06,-209.7200310E-03
-52.1000E-06,-181.0050271E-03
-52.0000E-06,-181.0050271E-03
-51.9000E-06,+19.9999996E-03
-51.8000E-06,+221.0050263E-03
-51.7000E-06,+221.0050263E-03
-51.6000E-06,+422.0100529E-03
-51.5000E-06,+623.0150796E-03
-51.4000E-06,+565.5850721E-03
-51.3000E-06,+623.0150796E-03
-51.2000E-06,+623.0150796E-03
-51.1000E-06,+623.0150796E-03
-51.0000E-06,+623.0150796E-03
-50.9000E-06,+623.0150796E-03
-50.8000E-06,+422.0100529E-03
-50.7000E-06,+422.0100529E-03
-50.6000E-06,+221.0050263E-03
-50.5000E-06,+221.0050263E-03
-50.4000E-06,+221.0050263E-03
-50.3000E-06,+19.9999996E-03
-50.2000E-06,+19.9999996E-03
-50.1000E-06,+19.9999996E-03
-50.0000E-06,+19.9999996E-03
-49.9000E-06,+19.9999996E-03
-49.8000E-06,-181.0050271E-03
-49.7000E-06,-181.0050271E-03
-49.6000E-06,-181.0050271E-03
-49.5000E-06,-181.0050271E-03
-49.4000E-06,-181.0050271E-03
-49.3000E-06,-382.0100538E-03
-49.2000E-06,-382.0100538E-03
-49.1000E-06,-583.0150805E-03
-49.0000E-06,-583.0150805E-03
-48.9000E-06,-784.0201072E-03
-48.8000E-06,-583.0150805E-03
-48.7000E-06,-755.3051034E-03
-48.6000E-06,-583.0150805E-03
-48.5000E-06,-640.4450882E-03
-48.4000E-06,-784.0201072E-03
-48.3000E-06,-468.1550654E-03
-48.2000E-06,-382.0100539E-03
-48.1000E-06,-382.0100538E-03
-48.0000E-06,-353.2950500E-03
-47.9000E-06,-181.0050271E-03
-47.8000E-06,+19.9999996E-03
-47.7000E-06,+19.9999996E-03
-47.6000E-06,+221.0050263E-03
-47.5000E-06,+221.0050263E-03
-47.4000E-06,+221.0050263E-03
-47.3000E-06,+221.0050263E-03
-47.2000E-06,+221.0050263E-03
-47.1000E-06,+19.9999996E-03
-47.0000E-06,+19.9999996E-03
-46.9000E-06,+19.9999996E-03
-46.8000E-06,+19.9999996E-03
-46.7000E-06,-94.8600158E-03
-46.6000E-06,+19.9999996E-03
-46.5000E-06,-123.5750196E-03
-46.4000E-06,-181.0050271E-03
-46.3000E-06,-181.0050271E-03
-46.2000E-06,-267.1500387E-03
-46.1000E-06,-181.0050272E-03
-46.0000E-06,-382.0100538E-03
-45.9000E-06,-382.0100538E-03
-45.8000E-06,-382.0100538E-03
-45.7000E-06,-439.4400615E-03
-45.6000E-06,-382.0100538E-03
-45.5000E-06,-496.8700690E-03
-45.4000E-06,-382.0100538E-03
-45.3000E-06,-382.0100538E-03
-45.2000E-06,-554.3000767E-03
-45.1000E-06,-382.0100538E-03
-45.0000E-06,-181.0050271E-03
-44.9000E-06,+19.9999996E-03
-44.8000E-06,+221.0050263E-03
-44.7000E-06,+221.0050263E-03
-44.6000E-06,+221.0050263E-03
-44.5000E-06,+249.7200301E-03
-44.4000E-06,+565.5850721E-03
-44.3000E-06,+565.5850719E-03
-44.2000E-06,+450.7250567E-03
-44.1000E-06,+536.8700681E-03
-44.0000E-06,+422.0100529E-03
-43.9000E-06,+422.0100529E-03
-43.8000E-06,+221.0050263E-03
-43.7000E-06,+163.5750187E-03
-43.6000E-06,+163.5750185E-03
-43.5000E-06,-181.0050271E-03
-43.4000E-06,-382.0100538E-03
-43.3000E-06,-382.0100538E-03
-43.2000E-06,-496.8700692E-03
-43.1000E-06,-583.0150805E-03
-43.0000E-06,-583.0150805E-03
-42.9000E-06,-726.5900995E-03
-42.8000E-06,-583.0150805E-03
-42.7000E-06,-583.0150805E-03
-42.6000E-06,-382.0100538E-03
-42.5000E-06,-382.0100538E-03
-42.4000E-06,-410.7250577E-03
-42.3000E-06,-382.0100538E-03
-42.2000E-06,-324.5800461E-03
-42.1000E-06,-181.0050271E-03
-42.0000E-06,+19.9999996E-03
-41.9000E-06,+19.9999996E-03
-41.8000E-06,+134.8600149E-03
-41.7000E-06,+249.7200301E-03
-41.6000E-06,+221.0050263E-03
-41.5000E-06,+221.0050263E-03
-41.4000E-06,+221.0050263E-03
-41.3000E-06,+221.0050263E-03
-41.2000E-06,+221.0050263E-03
-41.1000E-06,+221.0050263E-03
-41.0000E-06,+221.0050263E-03
-40.9000E-06,+19.9999996E-03
-40.8000E-06,+19.9999996E-03
-40.7000E-06,-8.7150042E-03
-40.6000E-06,-181.0050271E-03
-40.5000E-06,-181.0050271E-03
-40.4000E-06,-181.0050271E-03
-40.3000E-06,-181.0050271E-03
-40.2000E-06,-181.0050271E-03
-40.1000E-06,-181.0050271E-03
-40.0000E-06,-181.0050271E-03
-39.9000E-06,-66.1450120E-03
-39.8000E-06,-181.0050271E-03
-39.7000E-06,-181.0050271E-03
-39.6000E-06,-181.0050271E-03
-39.5000E-06,-181.0050271E-03
-39.4000E-06,-382.0100538E-03
-39.3000E-06,-382.0100538E-03
-39.2000E-06,-496.8700690E-03
-39.1000E-06,-382.0100538E-03
-39.0000E-06,-468.1550652E-03
-38.9000E-06,-410.7250577E-03
-38.8000E-06,-583.0150805E-03
-38.7000E-06,-583.0150805E-03
-38.6000E-06,-410.7250576E-03
-38.5000E-06,-382.0100538E-03
-38.4000E-06,-382.0100538E-03
-38.3000E-06,-181.0050271E-03
-38.2000E-06,-181.0050271E-03
-38.1000E-06,-37.4300080E-03
-38.0000E-06,+19.9999996E-03
-37.9000E-06,+19.9999996E-03
-37.8000E-06,+106.1450111E-03
-37.7000E-06,+221.0050263E-03
-37.6000E-06,+221.0050263E-03
-37.5000E-06,+221.0050263E-03
-37.4000E-06,+221.0050263E-03
-37.3000E-06,+221.0050263E-03
-37.2000E-06,+221.0050263E-03
-37.1000E-06,+134.8600147E-03
-37.0000E-06,+221.0050263E-03
-36.9000E-06,+106.1450109E-03
-36.8000E-06,+19.9999996E-03
-36.7000E-06,+19.9999996E-03
-36.6000E-06,-123.5750194E-03
-36.5000E-06,+19.9999996E-03
-36.4000E-06,-181.0050271E-03
-36.3000E-06,-382.0100538E-03
-36.2000E-06,-181.0050271E-03
-36.1000E-06,-181.0050271E-03
-36.0000E-06,-181.0050271E-03
-35.9000E-06,-382.0100538E-03
-35.8000E-06,-181.0050271E-03
-35.7000E-06,-181.0050271E-03
-35.6000E-06,-382.0100538E-03
-35.5000E-06,-181.0050271E-03
-35.4000E-06,-181.0050271E-03
-35.3000E-06,-181.0050271E-03
-35.2000E-06,-123.5750194E-03
-35.1000E-06,-181.0050271E-03
-35.0000E-06,+19.9999996E-03
-34.9000E-06,+19.9999996E-03
-34.8000E-06,+221.0050263E-03
-34.7000E-06,+192.2900223E-03
-34.6000E-06,+221.0050263E-03
-34.5000E-06,+364.5800452E-03
-34.4000E-06,+422.0100529E-03
-34.3000E-06,+422.0100529E-03
-34.2000E-06,+422.0100529E-03
-34.1000E-06,+422.0100529E-03
-34.0000E-06,+422.0100529E-03
-33.9000E-06,+422.0100529E-03
-33.8000E-06,+278.4350340E-03
-33.7000E-06,+221.0050263E-03
-33.6000E-06,+19.9999996E-03
-33.5000E-06,+19.9999995E-03
-33.4000E-06,-181.0050271E-03
-33.3000E-06,-209.7200311E-03
-33.2000E-06,-382.0100538E-03
-33.1000E-06,-583.0150805E-03
-33.0000E-06,-583.0150805E-03
-32.9000E-06,-669.1600921E-03
-32.8000E-06,-784.0201072E-03
-32.7000E-06,-697.8750959E-03
-32.6000E-06,-784.0201072E-03
-32.5000E-06,-583.0150805E-03
-32.4000E-06,-382.0100538E-03
-32.3000E-06,-583.0150805E-03
-32.2000E-06,-468.1550654E-03
-32.1000E-06,-382.0100538E-03
-32.0000E-06,-382.0100538E-03
-31.9000E-06,-181.0050271E-03
-31.8000E-06,-37.4300080E-03
-31.7000E-06,+19.9999996E-03
-31.6000E-06,-181.0050271E-03
-31.5000E-06,-66.1450120E-03
-31.4000E-06,+19.9999996E-03
-31.3000E-06,+19.9999996E-03
-31.2000E-06,+48.7150035E-03
-31.1000E-06,+19.9999996E-03
-31.0000E-06,+19.9999996E-03
-30.9000E-06,-152.2900234E-03
-30.8000E-06,-181.0050271E-03
-30.7000E-06,+19.9999996E-03
-30.6000E-06,+19.9999996E-03
-30.5000E-06,-181.0050271E-03
-30.4000E-06,-37.4300080E-03
-30.3000E-06,+19.9999996E-03
-30.2000E-06,-152.2900234E-03
-30.1000E-06,+19.9999996E-03
-30.0000E-06,+19.9999996E-03
-29.9000E-06,+106.1450109E-03
-29.8000E-06,+221.0050263E-03
-29.7000E-06,+221.0050263E-03
-29.6000E-06,+221.0050263E-03
-29.5000E-06,+221.0050263E-03
-29.4000E-06,+221.0050263E-03
-29.3000E-06,+221.0050263E-03
-29.2000E-06,+221.0050263E-03
-29.1000E-06,+48.7150035E-03
-29.0000E-06,+19.9999996E-03
-28.9000E-06,+19.9999996E-03
-28.8000E-06,-181.0050271E-03
-28.7000E-06,-267.1500387E-03
-28.6000E-06,-181.0050272E-03
-28.5000E-06,-382.0100538E-03
-28.4000E-06,-583.0150805E-03
-28.3000E-06,-583.0150805E-03
-28.2000E-06,-583.0150805E-03
-28.1000E-06,-611.7300843E-03
-28.0000E-06,-583.0150805E-03
-27.9000E-06,-583.0150806E-03
-27.8000E-06,-583.0150805E-03
-27.7000E-06,-611.7300845E-03
-27.6000E-06,-583.0150805E-03
-27.5000E-06,-382.0100538E-03
-27.4000E-06,-209.7200309E-03
-27.3000E-06,-181.0050271E-03
-27.2000E-06,-181.0050271E-03
-27.1000E-06,+19.9999996E-03
-27.0000E-06,+221.0050263E-03
-26.9000E-06,+221.0050263E-03
-26.8000E-06,+422.0100529E-03
-26.7000E-06,+422.0100529E-03
-26.6000E-06,+623.0150796E-03
-26.5000E-06,+623.0150796E-03
-26.4000E-06,+737.8750950E-03
-26.3000E-06,+824.0201063E-03
-26.2000E-06,+623.0150796E-03
-26.1000E-06,+623.0150796E-03
-26.0000E-06,+594.3000759E-03
-25.9000E-06,+422.0100529E-03
-25.8000E-06,+221.0050263E-03
-25.7000E-06,+221.0050263E-03
-25.6000E-06,+48.7150035E-03
-25.5000E-06,-181.0050271E-03
-25.4000E-06,-181.0050271E-03
-25.3000E-06,-181.0050271E-03
-25.2000E-06,-267.1500387E-03
-25.1000E-06,-382.0100538E-03
-25.0000E-06,-583.0150805E-03
-24.9000E-06,-583.0150805E-03
-24.8000E-06,-640.4450881E-03
-24.7000E-06,-640.4450883E-03
-24.6000E-06,-784.0201072E-03
-24.5000E-06,-669.1600921E-03
-24.4000E-06,-583.0150805E-03
-24.3000E-06,-583.0150805E-03
-24.2000E-06,-583.0150805E-03
-24.1000E-06,-583.0150805E-03
-24.0000E-06,-525.5850728E-03
-23.9000E-06,-382.0100538E-03
-23.8000E-06,-382.0100538E-03
-23.7000E-06,-181.0050271E-03
-23.6000E-06,-181.0050271E-03
-23.5000E-06,-181.0050271E-03
-23.4000E-06,+19.9999996E-03
-23.3000E-06,+19.9999996E-03
-23.2000E-06,+221.0050263E-03
-23.1000E-06,+221.0050263E-03
-23.0000E-06,+422.0100529E-03
-22.9000E-06,+307.1500376E-03
-22.8000E-06,+221.0050263E-03
-22.7000E-06,+221.0050263E-03
-22.6000E-06,+221.0050263E-03
-22.5000E-06,+221.0050263E-03
-22.4000E-06,+307.1500378E-03
-22.3000E-06,+221.0050263E-03
-22.2000E-06,+221.0050263E-03
-22.1000E-06,+221.0050263E-03
-22.0000E-06,+221.0050263E-03
-21.9000E-06,+221.0050263E-03
-21.8000E-06,+221.0050263E-03
-21.7000E-06,+134.8600147E-03
-21.6000E-06,+19.9999996E-03
-21.5000E-06,+19.9999996E-03
-21.4000E-06,+19.9999996E-03
-21.3000E-06,-37.4300080E-03
-21.2000E-06,-181.0050271E-03
-21.1000E-06,-181.0050271E-03
-21.0000E-06,-181.0050271E-03
-20.9000E-06,-181.0050271E-03
-20.8000E-06,-382.0100538E-03
-20.7000E-06,-382.0100538E-03
-20.6000E-06,-439.4400614E-03
-20.5000E-06,-583.0150805E-03
-20.4000E-06,-583.0150805E-03
-20.3000E-06,-669.1600921E-03
-20.2000E-06,-784.0201072E-03
-20.1000E-06,-583.0150805E-03
-20.0000E-06,-611.7300844E-03
-19.9000E-06,-583.0150805E-03
-19.8000E-06,-382.0100538E-03
-19.7000E-06,-382.0100538E-03
-19.6000E-06,-382.0100538E-03
-19.5000E-06,-181.0050271E-03
-19.4000E-06,+19.9999996E-03
-19.3000E-06,+19.9999996E-03
-19.2000E-06,+19.9999996E-03
-19.1000E-06,+221.0050263E-03
-19.0000E-06,+221.0050263E-03
-18.9000E-06,+221.0050263E-03
-18.8000E-06,+422.0100529E-03
-18.7000E-06,+422.0100529E-03
-18.6000E-06,+221.0050263E-03
-18.5000E-06,+278.4350338E-03
-18.4000E-06,+278.4350340E-03
-18.3000E-06,+221.0050263E-03
-18.2000E-06,+106.1450111E-03
-18.1000E-06,+221.0050263E-03
-18.0000E-06,-181.0050271E-03
-17.9000E-06,-152.2900232E-03
-17.8000E-06,-181.0050271E-03
-17.7000E-06,-181.0050271E-03
-17.6000E-06,-181.0050271E-03
-17.5000E-06,-181.0050271E-03
-17.4000E-06,-181.0050271E-03
-17.3000E-06,-181.0050271E-03
-17.2000E-06,-152.2900232E-03
-17.1000E-06,+19.9999996E-03
-17.0000E-06,+19.9999996E-03
-16.9000E-06,+192.2900225E-03
-16.8000E-06,+19.9999996E-03
-16.7000E-06,+19.9999996E-03
-16.6000E-06,+19.9999996E-03
-16.5000E-06,-8.7150044E-03
-16.4000E-06,+19.9999996E-03
-16.3000E-06,-37.4300082E-03
-16.2000E-06,-209.7200309E-03
-16.1000E-06,-66.1450120E-03
-16.0000E-06,-382.0100538E-03
-15.9000E-06,-382.0100538E-03
-15.8000E-06,-382.0100538E-03
-15.7000E-06,-382.0100538E-03
-15.6000E-06,-382.0100538E-03
-15.5000E-06,-181.0050271E-03
-15.4000E-06,-382.0100538E-03
-15.3000E-06,-181.0050272E-03
-15.2000E-06,-295.8650425E-03
-15.1000E-06,-181.0050271E-03
-15.0000E-06,+19.9999996E-03
-14.9000E-06,+77.4300073E-03
-14.8000E-06,+19.9999996E-03
-14.7000E-06,+134.8600147E-03
-14.6000E-06,+221.0050263E-03
-14.5000E-06,+106.1450109E-03
-14.4000E-06,+192.2900223E-03
-14.3000E-06,+221.0050263E-03
-14.2000E-06,+221.0050263E-03
-14.1000E-06,+221.0050263E-03
-14.0000E-06,+134.8600147E-03
-13.9000E-06,+19.9999996E-03
-13.8000E-06,-66.1450118E-03
-13.7000E-06,+19.9999996E-03
-13.6000E-06,+19.9999996E-03
-13.5000E-06,-181.0050271E-03
-13.4000E-06,-181.0050271E-03
-13.3000E-06,-181.0050271E-03
-13.2000E-06,-181.0050271E-03
-13.1000E-06,-181.0050271E-03
-13.0000E-06,-209.7200310E-03
-12.9000E-06,-382.0100538E-03
-12.8000E-06,-382.0100538E-03
-12.7000E-06,-382.0100538E-03
-12.6000E-06,-382.0100538E-03
-12.5000E-06,-382.0100538E-03
-12.4000E-06,-382.0100538E-03
-12.3000E-06,-382.0100538E-03
-12.2000E-06,-382.0100538E-03
-12.1000E-06,-181.0050271E-03
-12.0000E-06,-382.0100538E-03
-11.9000E-06,-267.1500387E-03
-11.8000E-06,-382.0100538E-03
-11.7000E-06,-295.8650425E-03
-11.6000E-06,-209.7200310E-03
-11.5000E-06,-324.5800463E-03
-11.4000E-06,-324.5800461E-03
-11.3000E-06,-209.7200309E-03
-11.2000E-06,-181.0050271E-03
-11.1000E-06,-181.0050271E-03
-11.0000E-06,-66.1450118E-03
-10.9000E-06,-8.7150044E-03
-10.8000E-06,+19.9999996E-03
-10.7000E-06,+19.9999996E-03
-10.6000E-06,+19.9999996E-03
-10.5000E-06,+106.1450111E-03
-10.4000E-06,+221.0050263E-03
-10.3000E-06,+221.0050263E-03
-10.2000E-06,+221.0050263E-03
-10.1000E-06,+221.0050263E-03
-10.0000E-06,+19.9999996E-03
-9.9000E-06,+19.9999996E-03
-9.8000E-06,+221.0050263E-03
-9.7000E-06,+19.9999996E-03
-9.6000E-06,+19.9999996E-03
-9.5000E-06,+19.9999996E-03
-9.4000E-06,+19.9999996E-03
-9.3000E-06,+19.9999996E-03
-9.2000E-06,+19.9999996E-03
-9.1000E-06,-94.8600156E-03
-9.0000E-06,+19.9999996E-03
-8.9000E-06,-94.8600158E-03
-8.8000E-06,+19.9999996E-03
-8.7000E-06,+19.9999996E-03
-8.6000E-06,+19.9999996E-03
-8.5000E-06,-8.7150042E-03
-8.4000E-06,-94.8600156E-03
-8.3000E-06,-181.0050271E-03
-8.2000E-06,+19.9999996E-03
-8.1000E-06,-152.2900232E-03
-8.0000E-06,-181.0050271E-03
-7.9000E-06,-181.0050271E-03
-7.8000E-06,-181.0050271E-03
-7.7000E-06,-382.0100538E-03
-7.6000E-06,-382.0100538E-03
-7.5000E-06,-583.0150805E-03
-7.4000E-06,-554.3000766E-03
-7.3000E-06,-726.5900997E-03
-7.2000E-06,-583.0150805E-03
-7.1000E-06,-583.0150805E-03
-7.0000E-06,-468.1550654E-03
-6.9000E-06,-181.0050272E-03
-6.8000E-06,-267.1500385E-03
-6.7000E-06,+19.9999996E-03
-6.6000E-06,+19.9999996E-03
-6.5000E-06,+77.4300073E-03
-6.4000E-06,+221.0050263E-03
-6.3000E-06,+307.1500378E-03
-6.2000E-06,+221.0050263E-03
-6.1000E-06,+221.0050263E-03
-6.0000E-06,+221.0050263E-03
-5.9000E-06,+221.0050263E-03
-5.8000E-06,+364.5800452E-03
-5.7000E-06,+221.0050263E-03
-5.6000E-06,+221.0050263E-03
-5.5000E-06,+221.0050262E-03
-5.4000E-06,+19.9999996E-03
-5.3000E-06,+19.9999996E-03
-5.2000E-06,-181.0050271E-03
-5.1000E-06,-181.0050271E-03
-5.0000E-06,-181.0050271E-03
-4.9000E-06,-181.0050271E-03
-4.8000E-06,-181.0050271E-03
-4.7000E-06,-382.0100538E-03
-4.6000E-06,-209.7200311E-03
-4.5000E-06,-382.0100538E-03
-4.4000E-06,-324.5800461E-03
-4.3000E-06,-382.0100538E-03
-4.2000E-06,-267.1500387E-03
-4.1000E-06,-181.0050272E-03
-4.0000E-06,-267.1500385E-03
-3.9000E-06,-382.0100538E-03
-3.8000E-06,-181.0050271E-03
-3.7000E-06,-324.5800461E-03
-3.6000E-06,-181.0050271E-03
-3.5000E-06,+19.9999996E-03
-3.4000E-06,+19.9999996E-03
-3.3000E-06,-181.0050271E-03
-3.2000E-06,-8.7150044E-03
-3.1000E-06,-123.5750196E-03
-3.0000E-06,-181.0050271E-03
-2.9000E-06,+19.9999996E-03
-2.8000E-06,-94.8600156E-03
-2.7000E-06,-382.0100538E-03
-2.6000E-06,-583.0150805E-03
-2.5000E-06,-1.1860301606E+00
-2.4000E-06,-1.5880402140E+00
-2.3000E-06,-2.1910552941E+00
-2.2000E-06,-2.9950754009E+00
-2.1000E-06,-3.3970854543E+00
-2.0000E-06,-3.7990955077E+00
-1.9000E-06,-4.2011055611E+00
-1.8000E-06,-4.5744006106E+00
-1.7000E-06,-4.6031156145E+00
-1.6000E-06,-4.8041206412E+00
-1.5000E-06,-4.7754056375E+00
-1.4000E-06,-4.4021105878E+00
-1.3000E-06,-4.2011055611E+00
-1.2000E-06,-3.7990955077E+00
-1.1000E-06,-3.3970854543E+00
-1.0000E-06,-2.8515003818E+00
-900.0E-09,-2.3346303131E+00
-800.0E-09,-1.7890452407E+00
-700.0E-09,-1.1860301606E+00
-600.0E-09,-583.0150805E-03
-500.0E-09,+19.9999996E-03
-400.0E-09,+422.0100529E-03
-300.0E-09,+967.5951255E-03
-200.0E-09,+1.2260301597E+00
-100.0E-09,+1.6280402131E+00
+0.0E+00,+2.0300502665E+00
+100.0E-09,+2.2310552932E+00
+200.0E-09,+2.4320603199E+00
+300.0E-09,+2.4320603199E+00
+400.0E-09,+2.4320603199E+00
+500.0E-09,+2.4320603199E+00
+600.0E-09,+2.4320603199E+00
+700.0E-09,+2.2310552932E+00
+800.0E-09,+2.0300502665E+00
+900.0E-09,+1.8290452398E+00
+1.0000E-06,+1.4270351864E+00
+1.1000E-06,+1.2260301597E+00
+1.2000E-06,+623.0150796E-03
+1.3000E-06,+422.0100529E-03
+1.4000E-06,+106.1450111E-03
+1.5000E-06,-181.0050271E-03
+1.6000E-06,-382.0100538E-03
+1.7000E-06,-784.0201072E-03
+1.8000E-06,-985.0251339E-03
+1.9000E-06,-1.1860301606E+00
+2.0000E-06,-1.2147451644E+00
+2.1000E-06,-1.3870351873E+00
+2.2000E-06,-1.5880402140E+00
+2.3000E-06,-1.5880402140E+00
+2.4000E-06,-1.5880402140E+00
+2.5000E-06,-1.5306102065E+00
+2.6000E-06,-1.5880402140E+00
+2.7000E-06,-1.3870351873E+00
+2.8000E-06,-1.1860301606E+00
+2.9000E-06,-985.0251339E-03
+3.0000E-06,-784.0201072E-03
+3.1000E-06,-583.0150805E-03
+3.2000E-06,-583.0150805E-03
+3.3000E-06,-382.0100538E-03
+3.4000E-06,-181.0050271E-03
+3.5000E-06,+19.9999996E-03
+3.6000E-06,+221.0050263E-03
+3.7000E-06,+307.1500376E-03
+3.8000E-06,+422.0100529E-03
+3.9000E-06,+623.0150796E-03
+4.0000E-06,+967.5951253E-03
+4.1000E-06,+1.1973151560E+00
+4.2000E-06,+1.6280402131E+00
+4.3000E-06,+1.8290452398E+00
+4.4000E-06,+2.2310552932E+00
+4.5000E-06,+2.2597702971E+00
+4.6000E-06,+2.4320603199E+00
+4.7000E-06,+2.4320603199E+00
+4.8000E-06,+2.4320603199E+00
+4.9000E-06,+2.2310552932E+00
+5.0000E-06,+2.2310552932E+00
+5.1000E-06,+2.0300502665E+00
+5.2000E-06,+1.8290452398E+00
+5.3000E-06,+1.2834601673E+00
+5.4000E-06,+824.0201063E-03
+5.5000E-06,+450.7250567E-03
+5.6000E-06,+106.1450111E-03
+5.7000E-06,-382.0100538E-03
+5.8000E-06,-583.0150805E-03
+5.9000E-06,-784.0201072E-03
+6.0000E-06,-985.0251339E-03
+6.1000E-06,-1.1860301606E+00
+6.2000E-06,-1.0137401377E+00
+6.3000E-06,-1.1860301606E+00
+6.4000E-06,-1.1860301606E+00
+6.5000E-06,-1.1860301606E+00
+6.6000E-06,-985.0251339E-03
+6.7000E-06,-985.0251339E-03
+6.8000E-06,-784.0201072E-03
+6.9000E-06,-583.0150805E-03
+7.0000E-06,-583.0150805E-03
+7.1000E-06,-382.0100539E-03
+7.2000E-06,-382.0100538E-03
+7.3000E-06,-382.0100538E-03
+7.4000E-06,-181.0050271E-03
+7.5000E-06,-123.5750194E-03
+7.6000E-06,+19.9999996E-03
+7.7000E-06,+134.8600147E-03
+7.8000E-06,+221.0050263E-03
+7.9000E-06,+422.0100529E-03
+8.0000E-06,+623.0150796E-03
+8.1000E-06,+680.4450872E-03
+8.2000E-06,+824.0201063E-03
+8.3000E-06,+1.0250251330E+00
+8.4000E-06,+1.2260301597E+00
+8.5000E-06,+1.4270351864E+00
+8.6000E-06,+1.4270351864E+00
+8.7000E-06,+1.4270351864E+00
+8.8000E-06,+1.6280402131E+00
+8.9000E-06,+1.6280402131E+00
+9.0000E-06,+1.6280402131E+00
+9.1000E-06,+1.7141852247E+00
+9.2000E-06,+1.6280402131E+00
+9.3000E-06,+1.6280402131E+00
+9.4000E-06,+1.6567552170E+00
+9.5000E-06,+1.6854702207E+00
+9.6000E-06,+1.6280402131E+00
+9.7000E-06,+1.6280402131E+00
+9.8000E-06,+1.7429002283E+00
+9.9000E-06,+1.8290452398E+00
+10.0000E-06,+1.7429002285E+00
+10.1000E-06,+1.8003302359E+00
+10.2000E-06,+1.6280402131E+00
+10.3000E-06,+1.6280402131E+00
+10.4000E-06,+1.4270351864E+00
+10.5000E-06,+1.4270351864E+00
+10.6000E-06,+1.2260301597E+00
+10.7000E-06,+1.2260301597E+00
+10.8000E-06,+1.0250251330E+00
+10.9000E-06,+824.0201063E-03
+11.0000E-06,+766.5900986E-03
+11.1000E-06,+422.0100529E-03
+11.2000E-06,+422.0100529E-03
+11.3000E-06,+19.9999996E-03
+11.4000E-06,-181.0050271E-03
+11.5000E-06,-410.7250578E-03
+11.6000E-06,-784.0201072E-03
+11.7000E-06,-1.1860301606E+00
+11.8000E-06,-1.4157501911E+00
+11.9000E-06,-1.9900502674E+00
+12.0000E-06,-2.1910552941E+00
+12.1000E-06,-2.7940703742E+00
+12.2000E-06,-3.1673654237E+00
+12.3000E-06,-3.3970854543E+00
+12.4000E-06,-3.5980904810E+00
+12.5000E-06,-3.7990955077E+00
+12.6000E-06,-4.0001005344E+00
+12.7000E-06,-4.0001005344E+00
+12.8000E-06,-3.8852405191E+00
+12.9000E-06,-3.7703805038E+00
+13.0000E-06,-3.4545154618E+00
+13.1000E-06,-2.9950754009E+00
+13.2000E-06,-2.7940703742E+00
+13.3000E-06,-2.3059153093E+00
+13.4000E-06,-1.7890452407E+00
+13.5000E-06,-1.3870351873E+00
+13.6000E-06,-784.0201072E-03
+13.7000E-06,-382.0100538E-03
+13.8000E-06,+221.0050263E-03
+13.9000E-06,+651.7300834E-03
+14.0000E-06,+1.0250251330E+00
+14.1000E-06,+1.4270351865E+00
+14.2000E-06,+1.9439052552E+00
+14.3000E-06,+2.2310552932E+00
+14.4000E-06,+2.6330653466E+00
+14.5000E-06,+2.7766403656E+00
+14.6000E-06,+3.0063603963E+00
+14.7000E-06,+2.8340703733E+00
+14.8000E-06,+2.8340703733E+00
+14.9000E-06,+2.7192103580E+00
+15.0000E-06,+2.4607753238E+00
+15.1000E-06,+2.2310552932E+00
+15.2000E-06,+1.8290452398E+00
+15.3000E-06,+1.4270351864E+00
+15.4000E-06,+737.8750948E-03
+15.5000E-06,+221.0050262E-03
+15.6000E-06,-583.0150805E-03
+15.7000E-06,-1.1860301606E+00
+15.8000E-06,-1.7316152332E+00
+15.9000E-06,-2.3920603208E+00
+16.0000E-06,-2.9950754009E+00
+16.1000E-06,-3.5980904810E+00
+16.2000E-06,-4.0001005344E+00
+16.3000E-06,-4.4021105878E+00
+16.4000E-06,-4.7754056373E+00
+16.5000E-06,-4.8041206412E+00
+16.6000E-06,-4.9476956602E+00
+16.7000E-06,-4.7754056375E+00
+16.8000E-06,-4.8041206412E+00
+16.9000E-06,-4.4021105877E+00
+17.0000E-06,-4.2011055611E+00
+17.1000E-06,-3.7703805038E+00
+17.2000E-06,-3.1960804276E+00
+17.3000E-06,-2.5930653475E+00
+17.4000E-06,-1.9900502674E+00
+17.5000E-06,-1.3870351873E+00
+17.6000E-06,-784.0201072E-03
+17.7000E-06,-181.0050271E-03
+17.8000E-06,+623.0150796E-03
+17.9000E-06,+1.4844651940E+00
+18.0000E-06,+2.2310552932E+00
+18.1000E-06,+3.4083704497E+00
+18.2000E-06,+4.2411055602E+00
+18.3000E-06,+5.0451256670E+00
+18.4000E-06,+5.8491457738E+00
+18.5000E-06,+6.2511558272E+00
+18.6000E-06,+6.6531658806E+00
+18.7000E-06,+6.8541709073E+00
+18.8000E-06,+6.6244508769E+00
+18.9000E-06,+6.2511558272E+00
+19.0000E-06,+5.8491457738E+00
+19.1000E-06,+5.4471357204E+00
+19.2000E-06,+5.0451256670E+00
+19.3000E-06,+4.6431156136E+00
+19.4000E-06,+4.2411055602E+00
+19.5000E-06,+3.6380904801E+00
+19.6000E-06,+3.0350754000E+00
+19.7000E-06,+2.4320603199E+00
+19.8000E-06,+1.9151902512E+00
+19.9000E-06,+1.3983201825E+00
+20.0000E-06,+623.0150796E-03
+20.1000E-06,+221.0050263E-03
+20.2000E-06,-181.0050271E-03
+20.3000E-06,-669.1600921E-03
+20.4000E-06,-985.0251339E-03
+20.5000E-06,-1.5880402140E+00
+20.6000E-06,-2.1910552941E+00
+20.7000E-06,-3.3970854543E+00
+20.8000E-06,-4.6031156145E+00
+20.9000E-06,-5.6081407480E+00
+21.0000E-06,-6.9003159197E+00
+21.1000E-06,-8.0202010684E+00
+21.2000E-06,-8.6232161485E+00
+21.3000E-06,-8.9965111980E+00
+21.4000E-06,-9.0252262019E+00
+21.5000E-06,-9.0252262019E+00
+21.6000E-06,-8.6519311522E+00
+21.7000E-06,-8.2212060951E+00
+21.8000E-06,-7.4171859884E+00
+21.9000E-06,-6.8141709082E+00
+22.0000E-06,-5.8091457747E+00
+22.1000E-06,-4.8041206412E+00
+22.2000E-06,-3.7990955077E+00
+22.3000E-06,-2.5930653475E+00
+22.4000E-06,-1.5880402140E+00
+22.5000E-06,-181.0050271E-03
+22.6000E-06,+623.0150796E-03
+22.7000E-06,+1.6280402131E+00
+22.8000E-06,+2.5756353391E+00
+22.9000E-06,+3.2360804267E+00
+23.0000E-06,+3.8678105105E+00
+23.1000E-06,+4.4421105869E+00
+23.2000E-06,+4.6431156136E+00
+23.3000E-06,+4.9302656517E+00
+23.4000E-06,+5.0451256670E+00
+23.5000E-06,+4.8441206403E+00
+23.6000E-06,+4.7005456213E+00
+23.7000E-06,+4.4421105869E+00
+23.8000E-06,+4.0401005335E+00
+23.9000E-06,+3.6380904800E+00
+24.0000E-06,+2.9202153847E+00
+24.1000E-06,+2.4320603199E+00
+24.2000E-06,+1.6280402131E+00
+24.3000E-06,+1.0824551408E+00
+24.4000E-06,+594.3000759E-03
+24.5000E-06,-181.0050271E-03
+24.6000E-06,-583.0150805E-03
+24.7000E-06,-1.1860301606E+00
+24.8000E-06,-1.7603302368E+00
+24.9000E-06,-1.9900502674E+00
+25.0000E-06,-2.3920603208E+00
+25.1000E-06,-2.5930653475E+00
+25.2000E-06,-2.8802153858E+00
+25.3000E-06,-2.9950754009E+00
+25.4000E-06,-2.9950754009E+00
+25.5000E-06,-2.8227853781E+00
+25.6000E-06,-2.7940703742E+00
+25.7000E-06,-2.5930653475E+00
+25.8000E-06,-2.1910552941E+00
+25.9000E-06,-1.9900502674E+00
+26.0000E-06,-1.7890452407E+00
+26.1000E-06,-1.3870351873E+00
+26.2000E-06,-1.1573151567E+00
+26.3000E-06,-726.5900997E-03
+26.4000E-06,-382.0100538E-03
+26.5000E-06,+19.9999996E-03
+26.6000E-06,+335.8650414E-03
+26.7000E-06,+623.0150796E-03
+26.8000E-06,+824.0201063E-03
+26.9000E-06,+1.0537401369E+00
+27.0000E-06,+1.4270351864E+00
+27.1000E-06,+1.6280402131E+00
+27.2000E-06,+1.8290452398E+00
+27.3000E-06,+1.9439052550E+00
+27.4000E-06,+1.8290452398E+00
+27.5000E-06,+1.8290452398E+00
+27.6000E-06,+1.6280402131E+00
+27.7000E-06,+1.5706102056E+00
+27.8000E-06,+1.2260301597E+00
+27.9000E-06,+1.0250251330E+00
+28.0000E-06,+824.0201063E-03
+28.1000E-06,+422.0100529E-03
+28.2000E-06,+221.0050263E-03
+28.3000E-06,+19.9999996E-03
+28.4000E-06,-181.0050271E-03
+28.5000E-06,-382.0100538E-03
+28.6000E-06,-583.0150805E-03
+28.7000E-06,-784.0201072E-03
+28.8000E-06,-985.0251339E-03
+28.9000E-06,-1.1860301606E+00
+29.0000E-06,-1.1860301606E+00
+29.1000E-06,-1.1860301606E+00
+29.2000E-06,-1.3296051796E+00
+29.3000E-06,-1.1860301606E+00
+29.4000E-06,-1.1860301606E+00
+29.5000E-06,-985.0251340E-03
+29.6000E-06,-985.0251339E-03
+29.7000E-06,-956.3101300E-03
+29.8000E-06,-784.0201072E-03
+29.9000E-06,-583.0150805E-03
+30.0000E-06,-382.0100538E-03
+30.1000E-06,+19.9999996E-03
+30.2000E-06,+623.0150796E-03
+30.3000E-06,+1.1398851484E+00
+30.4000E-06,+1.2260301597E+00
+30.5000E-06,+1.4270351864E+00
+30.6000E-06,+1.2260301597E+00
+30.7000E-06,+1.1973151560E+00
+30.8000E-06,+1.1398851482E+00
+30.9000E-06,+824.0201063E-03
+31.0000E-06,+623.0150796E-03
+31.1000E-06,+422.0100529E-03
+31.2000E-06,+221.0050263E-03
+31.3000E-06,+19.9999996E-03
+31.4000E-06,-181.0050271E-03
+31.5000E-06,-267.1500387E-03
+31.6000E-06,-382.0100538E-03
+31.7000E-06,-583.0150805E-03
+31.8000E-06,-784.0201072E-03
+31.9000E-06,-927.5951264E-03
+32.0000E-06,-985.0251339E-03
+32.1000E-06,-812.7351110E-03
+32.2000E-06,-985.0251339E-03
+32.3000E-06,-784.0201072E-03
+32.4000E-06,-583.0150805E-03
+32.5000E-06,-8.7150043E-03
+32.6000E-06,+824.0201063E-03
+32.7000E-06,+1.8290452398E+00
+32.8000E-06,+2.8340703733E+00
+32.9000E-06,+3.4370854534E+00
+33.0000E-06,+3.8390955068E+00
+33.1000E-06,+4.0401005335E+00
+33.2000E-06,+4.0401005335E+00
+33.3000E-06,+4.2411055602E+00
+33.4000E-06,+4.0401005335E+00
+33.5000E-06,+4.0401005335E+00
+33.6000E-06,+4.0401005335E+00
+33.7000E-06,+3.8390955068E+00
+33.8000E-06,+3.5519454688E+00
+33.9000E-06,+3.0350754000E+00
+34.0000E-06,+2.4320603199E+00
+34.1000E-06,+1.6280402131E+00
+34.2000E-06,+824.0201063E-03
+34.3000E-06,+19.9999996E-03
+34.4000E-06,-583.0150805E-03
+34.5000E-06,-1.3008901760E+00
+34.6000E-06,-1.7890452407E+00
+34.7000E-06,-2.1910552941E+00
+34.8000E-06,-2.3920603208E+00
+34.9000E-06,-2.5930653475E+00
+35.0000E-06,-2.7940703742E+00
+35.1000E-06,-2.7940703742E+00
+35.2000E-06,-2.9950754009E+00
+35.3000E-06,-3.1960804276E+00
+35.4000E-06,-3.1960804276E+00
+35.5000E-06,-3.2535104353E+00
+35.6000E-06,-3.2247954313E+00
+35.7000E-06,-3.3970854543E+00
+35.8000E-06,-3.1960804276E+00
+35.9000E-06,-2.9950754009E+00
+36.0000E-06,-2.5643503436E+00
+36.1000E-06,-1.9326202599E+00
+36.2000E-06,-1.1860301606E+00
+36.3000E-06,-583.0150805E-03
+36.4000E-06,+134.8600147E-03
+36.5000E-06,+1.0250251330E+00
+36.6000E-06,+1.6280402131E+00
+36.7000E-06,+2.2310552932E+00
+36.8000E-06,+2.6330653466E+00
+36.9000E-06,+3.0350754000E+00
+37.0000E-06,+3.4370854534E+00
+37.1000E-06,+3.6380904801E+00
+37.2000E-06,+3.8390955068E+00
+37.3000E-06,+3.9252405182E+00
+37.4000E-06,+4.0401005335E+00
+37.5000E-06,+4.0401005335E+00
+37.6000E-06,+4.0401005335E+00
+37.7000E-06,+3.8390955068E+00
+37.8000E-06,+3.6380904801E+00
+37.9000E-06,+3.2360804267E+00
+38.0000E-06,+2.6330653466E+00
+38.1000E-06,+2.0300502665E+00
+38.2000E-06,+1.4844651940E+00
+38.3000E-06,+824.0201063E-03
+38.4000E-06,+192.2900225E-03
+38.5000E-06,-583.0150805E-03
+38.6000E-06,-1.1860301606E+00
+38.7000E-06,-1.7029002294E+00
+38.8000E-06,-2.0187652713E+00
+38.9000E-06,-2.5930653475E+00
+39.0000E-06,-2.9950754009E+00
+39.1000E-06,-3.3970854543E+00
+39.2000E-06,-3.5980904810E+00
+39.3000E-06,-4.0001005344E+00
+39.4000E-06,-4.2011055611E+00
+39.5000E-06,-4.6031156145E+00
+39.6000E-06,-4.6605456220E+00
+39.7000E-06,-4.6031156145E+00
+39.8000E-06,-4.6031156145E+00
+39.9000E-06,-4.5169706030E+00
+40.0000E-06,-4.4021105877E+00
+40.1000E-06,-4.0001005344E+00
+40.2000E-06,-3.5980904810E+00
+40.3000E-06,-3.0525054084E+00
+40.4000E-06,-2.5930653475E+00
+40.5000E-06,-2.0187652711E+00
+40.6000E-06,-1.7890452407E+00
+40.7000E-06,-1.1860301606E+00
+40.8000E-06,-985.0251339E-03
+40.9000E-06,-382.0100538E-03
+41.0000E-06,+19.9999996E-03
+41.1000E-06,+565.5850719E-03
+41.2000E-06,+824.0201063E-03
+41.3000E-06,+1.4270351864E+00
+41.4000E-06,+1.8290452398E+00
+41.5000E-06,+2.0300502665E+00
+41.6000E-06,+2.4320603199E+00
+41.7000E-06,+2.5756353391E+00
+41.8000E-06,+2.8340703733E+00
+41.9000E-06,+2.8340703733E+00
+42.0000E-06,+3.0350754000E+00
+42.1000E-06,+3.0350754000E+00
+42.2000E-06,+3.0350754000E+00
+42.3000E-06,+2.8340703733E+00
+42.4000E-06,+2.8340703733E+00
+42.5000E-06,+2.6330653466E+00
+42.6000E-06,+2.4320603199E+00
+42.7000E-06,+2.3172003048E+00
+42.8000E-06,+2.0300502665E+00
+42.9000E-06,+1.8290452398E+00
+43.0000E-06,+1.4270351864E+00
+43.1000E-06,+1.2260301597E+00
+43.2000E-06,+824.0201063E-03
+43.3000E-06,+422.0100529E-03
+43.4000E-06,+106.1450111E-03
+43.5000E-06,-181.0050271E-03
+43.6000E-06,-583.0150805E-03
+43.7000E-06,-985.0251339E-03
+43.8000E-06,-1.2434601682E+00
+43.9000E-06,-1.5880402140E+00
+44.0000E-06,-1.7890452407E+00
+44.1000E-06,-2.1910552941E+00
+44.2000E-06,-2.1910552941E+00
+44.3000E-06,-2.3920603208E+00
+44.4000E-06,-2.5930653475E+00
+44.5000E-06,-2.5930653475E+00
+44.6000E-06,-2.6504953553E+00
+44.7000E-06,-2.7940703742E+00
+44.8000E-06,-2.7940703742E+00
+44.9000E-06,-2.7940703742E+00
+45.0000E-06,-2.5930653475E+00
+45.1000E-06,-2.5930653475E+00
+45.2000E-06,-2.3920603208E+00
+45.3000E-06,-2.1910552941E+00
+45.4000E-06,-1.9900502674E+00
+45.5000E-06,-1.5880402140E+00
+45.6000E-06,-1.3870351873E+00
+45.7000E-06,-985.0251339E-03
+45.8000E-06,-583.0150805E-03
+45.9000E-06,-382.0100538E-03
+46.0000E-06,+19.9999996E-03
+46.1000E-06,+221.0050263E-03
+46.2000E-06,+623.0150796E-03
+46.3000E-06,+824.0201063E-03
+46.4000E-06,+1.1398851484E+00
+46.5000E-06,+1.4270351864E+00
+46.6000E-06,+1.8290452398E+00
+46.7000E-06,+2.0300502665E+00
+46.8000E-06,+2.0300502665E+00
+46.9000E-06,+2.4320603199E+00
+47.0000E-06,+2.4320603199E+00
+47.1000E-06,+2.5182053313E+00
+47.2000E-06,+2.6330653466E+00
+47.3000E-06,+2.6330653466E+00
+47.4000E-06,+2.6330653466E+00
+47.5000E-06,+2.4320603199E+00
+47.6000E-06,+2.4320603199E+00
+47.7000E-06,+2.2310552932E+00
+47.8000E-06,+1.8290452398E+00
+47.9000E-06,+1.6280402131E+00
+48.0000E-06,+1.4270351864E+00
+48.1000E-06,+1.1686001520E+00
+48.2000E-06,+795.3051026E-03
+48.3000E-06,+422.0100529E-03
+48.4000E-06,+221.0050261E-03
+48.5000E-06,-181.0050271E-03
+48.6000E-06,-583.0150805E-03
+48.7000E-06,-784.0201072E-03
+48.8000E-06,-1.1860301606E+00
+48.9000E-06,-1.3583201836E+00
+49.0000E-06,-1.5880402140E+00
+49.1000E-06,-1.5880402141E+00
+49.2000E-06,-1.9900502674E+00
+49.3000E-06,-1.9900502674E+00
+49.4000E-06,-2.1910552941E+00
+49.5000E-06,-2.1910552941E+00
+49.6000E-06,-2.1910552941E+00
+49.7000E-06,-2.1910552941E+00
+49.8000E-06,-2.1910552941E+00
+49.9000E-06,-2.1910552941E+00
+50.0000E-06,-1.9900502674E+00
+50.1000E-06,-1.7890452407E+00
+50.2000E-06,-1.7890452407E+00
+50.3000E-06,-1.3870351873E+00
+50.4000E-06,-1.1860301606E+00
+50.5000E-06,-985.0251339E-03
+50.6000E-06,-784.0201072E-03
+50.7000E-06,-554.3000766E-03
+50.8000E-06,-181.0050271E-03
+50.9000E-06,+221.0050263E-03
+51.0000E-06,+450.7250566E-03
+51.1000E-06,+824.0201063E-03
+51.2000E-06,+1.0250251330E+00
+51.3000E-06,+1.4270351864E+00
+51.4000E-06,+1.8290452398E+00
+51.5000E-06,+2.0300502665E+00
+51.6000E-06,+2.4320603199E+00
+51.7000E-06,+2.6330653466E+00
+51.8000E-06,+2.8340703733E+00
+51.9000E-06,+3.0350754000E+00
+52.0000E-06,+3.1499354154E+00
+52.1000E-06,+3.0350754000E+00
+52.2000E-06,+2.8340703733E+00
+52.3000E-06,+2.8340703733E+00
+52.4000E-06,+2.8053553696E+00
+52.5000E-06,+2.5469203351E+00
+52.6000E-06,+2.0300502667E+00
+52.7000E-06,+1.8290452398E+00
+52.8000E-06,+1.4270351864E+00
+52.9000E-06,+1.0250251330E+00
+53.0000E-06,+623.0150796E-03
+53.1000E-06,+221.0050263E-03
+53.2000E-06,-181.0050271E-03
+53.3000E-06,-583.0150805E-03
+53.4000E-06,-985.0251339E-03
+53.5000E-06,-1.3870351873E+00
+53.6000E-06,-1.7890452407E+00
+53.7000E-06,-1.9326202597E+00
+53.8000E-06,-2.0187652711E+00
+53.9000E-06,-2.3059153093E+00
+54.0000E-06,-2.3920603209E+00
+54.1000E-06,-2.5930653475E+00
+54.2000E-06,-2.7940703742E+00
+54.3000E-06,-2.6504953550E+00
+54.4000E-06,-2.5930653475E+00
+54.5000E-06,-2.5930653475E+00
+54.6000E-06,-2.3920603208E+00
+54.7000E-06,-2.3920603208E+00
+54.8000E-06,-1.9900502674E+00
+54.9000E-06,-1.7890452407E+00
+55.0000E-06,-1.5306102065E+00
+55.1000E-06,-1.1860301606E+00
+55.2000E-06,-784.0201072E-03
+55.3000E-06,-382.0100538E-03
+55.4000E-06,+221.0050261E-03
+55.5000E-06,+623.0150796E-03
+55.6000E-06,+1.1973151558E+00
+55.7000E-06,+1.4844651939E+00
+55.8000E-06,+1.8290452398E+00
+55.9000E-06,+2.2310552932E+00
+56.0000E-06,+2.5469203351E+00
+56.1000E-06,+2.8340703732E+00
+56.2000E-06,+2.8340703733E+00
+56.3000E-06,+3.0350754000E+00
+56.4000E-06,+3.1786504192E+00
+56.5000E-06,+3.0350754000E+00
+56.6000E-06,+3.2073654230E+00
+56.7000E-06,+2.8340703733E+00
+56.8000E-06,+2.8340703733E+00
+56.9000E-06,+2.4320603199E+00
+57.0000E-06,+2.2310552932E+00
+57.1000E-06,+1.8290452398E+00
+57.2000E-06,+1.3696051787E+00
+57.3000E-06,+824.0201063E-03
+57.4000E-06,+422.0100529E-03
+57.5000E-06,+19.9999994E-03
+57.6000E-06,-583.0150805E-03
+57.7000E-06,-985.0251339E-03
+57.8000E-06,-1.4444651948E+00
+57.9000E-06,-1.7890452407E+00
+58.0000E-06,-2.1623402904E+00
+58.1000E-06,-2.3920603208E+00
+58.2000E-06,-2.5930653475E+00
+58.3000E-06,-2.5930653475E+00
+58.4000E-06,-2.7940703742E+00
+58.5000E-06,-2.7940703742E+00
+58.6000E-06,-2.7940703742E+00
+58.7000E-06,-2.5930653475E+00
+58.8000E-06,-2.5069203360E+00
+58.9000E-06,-2.1910552943E+00
+59.0000E-06,-1.9900502674E+00
+59.1000E-06,-1.7890452407E+00
+59.2000E-06,-1.5880402140E+00
+59.3000E-06,-1.3870351873E+00
+59.4000E-06,-985.0251339E-03
+59.5000E-06,-697.8750957E-03
+59.6000E-06,-382.0100538E-03
+59.7000E-06,+19.9999996E-03
+59.8000E-06,+221.0050263E-03
+59.9000E-06,+422.0100529E-03
+60.0000E-06,+881.4501141E-03
+60.1000E-06,+1.2260301597E+00
+60.2000E-06,+1.5418952016E+00
+60.3000E-06,+1.6280402131E+00
+60.4000E-06,+2.0300502665E+00
+60.5000E-06,+2.2310552932E+00
+60.6000E-06,+2.2884853007E+00
+60.7000E-06,+2.2884853010E+00
+60.8000E-06,+2.4033453162E+00
+60.9000E-06,+2.2310552932E+00
+61.0000E-06,+2.2310552932E+00
+61.1000E-06,+2.0300502665E+00
+61.2000E-06,+1.6567552171E+00
+61.3000E-06,+1.4270351864E+00
+61.4000E-06,+1.2260301597E+00
+61.5000E-06,+824.0201063E-03
+61.6000E-06,+623.0150796E-03
+61.7000E-06,+221.0050263E-03
+61.8000E-06,+19.9999996E-03
+61.9000E-06,-382.0100538E-03
+62.0000E-06,-583.0150805E-03
+62.1000E-06,-985.0251339E-03
+62.2000E-06,-1.3870351873E+00
+62.3000E-06,-1.5880402140E+00
+62.4000E-06,-1.7890452407E+00
+62.5000E-06,-1.9900502674E+00
+62.6000E-06,-2.1910552941E+00
+62.7000E-06,-2.3920603208E+00
+62.8000E-06,-2.3346303131E+00
+62.9000E-06,-2.3920603208E+00
+63.0000E-06,-2.3920603208E+00
+63.1000E-06,-2.3920603208E+00
+63.2000E-06,-2.1910552941E+00
+63.3000E-06,-2.1910552941E+00
+63.4000E-06,-1.7890452407E+00
+63.5000E-06,-1.6454702218E+00
+63.6000E-06,-1.4157501910E+00
+63.7000E-06,-1.1860301606E+00
+63.8000E-06,-784.0201072E-03
+63.9000E-06,-583.0150805E-03
+64.0000E-06,-181.0050271E-03
+64.1000E-06,+221.0050263E-03
+64.2000E-06,+422.0100529E-03
+64.3000E-06,+651.7300833E-03
+64.4000E-06,+1.0250251330E+00
+64.5000E-06,+1.2260301597E+00
+64.6000E-06,+1.6280402131E+00
+64.7000E-06,+1.6567552171E+00
+64.8000E-06,+1.8290452398E+00
+64.9000E-06,+2.0300502665E+00
+65.0000E-06,+2.0300502665E+00
+65.1000E-06,+2.0300502665E+00
+65.2000E-06,+2.0300502664E+00
+65.3000E-06,+1.7429002285E+00
+65.4000E-06,+1.6280402131E+00
+65.5000E-06,+1.4270351864E+00
+65.6000E-06,+1.2260301597E+00
+65.7000E-06,+1.0250251330E+00
+65.8000E-06,+623.0150796E-03
+65.9000E-06,+422.0100529E-03
+66.0000E-06,+221.0050263E-03
+66.1000E-06,-181.0050271E-03
+66.2000E-06,-382.0100538E-03
+66.3000E-06,-640.4450883E-03
+66.4000E-06,-1.1860301606E+00
+66.5000E-06,-1.3870351873E+00
+66.6000E-06,-1.5880402140E+00
+66.7000E-06,-1.7029002294E+00
+66.8000E-06,-1.8177602447E+00
+66.9000E-06,-2.0474802749E+00
+67.0000E-06,-1.9900502674E+00
+67.1000E-06,-2.1910552941E+00
+67.2000E-06,-2.1910552941E+00
+67.3000E-06,-2.1910552940E+00
+67.4000E-06,-2.1910552941E+00
+67.5000E-06,-1.9900502674E+00
+67.6000E-06,-1.7890452407E+00
+67.7000E-06,-1.5880402140E+00
+67.8000E-06,-1.2147451643E+00
+67.9000E-06,-985.0251339E-03
+68.0000E-06,-583.0150807E-03
+68.1000E-06,-382.0100538E-03
+68.2000E-06,-181.0050271E-03
+68.3000E-06,+163.5750188E-03
+68.4000E-06,+278.4350340E-03
+68.5000E-06,+623.0150796E-03
+68.6000E-06,+938.8801215E-03
+68.7000E-06,+1.2260301597E+00
+68.8000E-06,+1.3408901751E+00
+68.9000E-06,+1.6280402131E+00
+69.0000E-06,+1.6280402131E+00
+69.1000E-06,+1.6280402131E+00
+69.2000E-06,+1.8003302362E+00
+69.3000E-06,+1.5131801980E+00
+69.4000E-06,+1.4270351864E+00
+69.5000E-06,+1.4270351864E+00
+69.6000E-06,+1.2260301597E+00
+69.7000E-06,+881.4501138E-03
+69.8000E-06,+824.0201063E-03
+69.9000E-06,+450.7250566E-03
+70.0000E-06,+221.0050263E-03
+70.1000E-06,+19.9999996E-03
+70.2000E-06,-181.0050271E-03
+70.3000E-06,-382.0100538E-03
+70.4000E-06,-583.0150805E-03
+70.5000E-06,-583.0150805E-03
+70.6000E-06,-985.0251339E-03
+70.7000E-06,-870.1651188E-03
+70.8000E-06,-985.0251339E-03
+70.9000E-06,-1.0711701452E+00
+71.0000E-06,-1.1573151567E+00
+71.1000E-06,-1.1286001532E+00
+71.2000E-06,-1.1860301606E+00
+71.3000E-06,-1.1860301606E+00
+71.4000E-06,-1.0711701455E+00
+71.5000E-06,-1.1860301606E+00
+71.6000E-06,-985.0251339E-03
+71.7000E-06,-1.1573151567E+00
+71.8000E-06,-927.5951265E-03
+71.9000E-06,-784.0201072E-03
+72.0000E-06,-611.7300842E-03
+72.1000E-06,-583.0150805E-03
+72.2000E-06,-382.0100538E-03
+72.3000E-06,-295.8650425E-03
+72.4000E-06,-209.7200311E-03
+72.5000E-06,+19.9999996E-03
+72.6000E-06,+19.9999996E-03
+72.7000E-06,+48.7150032E-03
+72.8000E-06,+106.1450111E-03
+72.9000E-06,+221.0050263E-03
+73.0000E-06,+422.0100529E-03
+73.1000E-06,+249.7200302E-03
+73.2000E-06,+422.0100529E-03
+73.3000E-06,+479.4400607E-03
+73.4000E-06,+623.0150796E-03
+73.5000E-06,+623.0150796E-03
+73.6000E-06,+623.0150796E-03
+73.7000E-06,+737.8750950E-03
+73.8000E-06,+824.0201063E-03
+73.9000E-06,+967.5951256E-03
+74.0000E-06,+1.0250251330E+00
+74.1000E-06,+1.0250251330E+00
+74.2000E-06,+1.0250251330E+00
+74.3000E-06,+1.0250251330E+00
+74.4000E-06,+1.0250251330E+00
+74.5000E-06,+996.3101291E-03
+74.6000E-06,+1.0250251330E+00
+74.7000E-06,+766.5900986E-03
+74.8000E-06,+623.0150796E-03
+74.9000E-06,+422.0100529E-03
+75.0000E-06,+221.0050263E-03
+75.1000E-06,+19.9999996E-03
+75.2000E-06,-181.0050271E-03
+75.3000E-06,-382.0100538E-03
+75.4000E-06,-583.0150805E-03
+75.5000E-06,-755.3051036E-03
+75.6000E-06,-985.0251339E-03
+75.7000E-06,-985.0251339E-03
+75.8000E-06,-1.1860301606E+00
+75.9000E-06,-1.3583201834E+00
+76.0000E-06,-1.2434601681E+00
+76.1000E-06,-1.1860301606E+00
+76.2000E-06,-985.0251339E-03
+76.3000E-06,-870.1651188E-03
+76.4000E-06,-985.0251338E-03
+76.5000E-06,-583.0150805E-03
+76.6000E-06,-382.0100538E-03
+76.7000E-06,-382.0100538E-03
+76.8000E-06,-181.0050271E-03
+76.9000E-06,-181.0050271E-03
+77.0000E-06,+19.9999996E-03
+77.1000E-06,+19.9999996E-03
+77.2000E-06,+221.0050263E-03
+77.3000E-06,+249.7200302E-03
+77.4000E-06,+565.5850722E-03
+77.5000E-06,+623.0150796E-03
+77.6000E-06,+824.0201063E-03
+77.7000E-06,+938.8801214E-03
+77.8000E-06,+1.0250251330E+00
+77.9000E-06,+1.0250251330E+00
+78.0000E-06,+996.3101291E-03
+78.1000E-06,+824.0201063E-03
+78.2000E-06,+967.5951253E-03
+78.3000E-06,+651.7300833E-03
+78.4000E-06,+623.0150796E-03
+78.5000E-06,+422.0100531E-03
+78.6000E-06,+422.0100529E-03
+78.7000E-06,+221.0050263E-03
+78.8000E-06,+77.4300070E-03
+78.9000E-06,+19.9999996E-03
+79.0000E-06,-181.0050271E-03
+79.1000E-06,-181.0050271E-03
+79.2000E-06,-382.0100538E-03
+79.3000E-06,-583.0150805E-03
+79.4000E-06,-583.0150805E-03
+79.5000E-06,-583.0150805E-03
+79.6000E-06,-640.4450883E-03
+79.7000E-06,-784.0201072E-03
+79.8000E-06,-784.0201072E-03
+79.9000E-06,-784.0201072E-03
+80.0000E-06,-784.0201072E-03
+80.1000E-06,-784.0201072E-03
+80.2000E-06,-583.0150805E-03
+80.3000E-06,-583.0150805E-03
+80.4000E-06,-382.0100538E-03
+80.5000E-06,-382.0100538E-03
+80.6000E-06,-181.0050271E-03
+80.7000E-06,-181.0050271E-03
+80.8000E-06,+19.9999996E-03
+80.9000E-06,+19.9999996E-03
+81.0000E-06,+221.0050263E-03
+81.1000E-06,+221.0050263E-03
+81.2000E-06,+335.8650414E-03
+81.3000E-06,+422.0100528E-03
+81.4000E-06,+335.8650417E-03
+81.5000E-06,+422.0100529E-03
+81.6000E-06,+221.0050263E-03
+81.7000E-06,+278.4350340E-03
+81.8000E-06,+422.0100529E-03
+81.9000E-06,+221.0050263E-03
+82.0000E-06,+221.0050263E-03
+82.1000E-06,+106.1450108E-03
+82.2000E-06,+19.9999996E-03
+82.3000E-06,+77.4300070E-03
+82.4000E-06,+19.9999996E-03
+82.5000E-06,+19.9999996E-03
+82.6000E-06,+134.8600146E-03
+82.7000E-06,+19.9999996E-03
+82.8000E-06,+19.9999996E-03
+82.9000E-06,+19.9999996E-03
+83.0000E-06,+19.9999996E-03
+83.1000E-06,+19.9999996E-03
+83.2000E-06,+19.9999996E-03
+83.3000E-06,+19.9999996E-03
+83.4000E-06,+19.9999996E-03
+83.5000E-06,+19.9999996E-03
+83.6000E-06,+19.9999996E-03
+83.7000E-06,+19.9999996E-03
+83.8000E-06,-181.0050271E-03
+83.9000E-06,-181.0050271E-03
+84.0000E-06,-181.0050271E-03
+84.1000E-06,-181.0050271E-03
+84.2000E-06,-181.0050271E-03
+84.3000E-06,-181.0050271E-03
+84.4000E-06,-94.8600154E-03
+84.5000E-06,-181.0050271E-03
+84.6000E-06,-209.7200308E-03
+84.7000E-06,-267.1500387E-03
+84.8000E-06,-181.0050271E-03
+84.9000E-06,-181.0050271E-03
+85.0000E-06,-181.0050271E-03
+85.1000E-06,-181.0050271E-03
+85.2000E-06,-324.5800461E-03
+85.3000E-06,-181.0050271E-03
+85.4000E-06,-181.0050271E-03
+85.5000E-06,-181.0050271E-03
+85.6000E-06,-267.1500384E-03
+85.7000E-06,-181.0050271E-03
+85.8000E-06,-181.0050271E-03
+85.9000E-06,-123.5750194E-03
+86.0000E-06,-152.2900235E-03
+86.1000E-06,-181.0050271E-03
+86.2000E-06,-181.0050271E-03
+86.3000E-06,-181.0050271E-03
+86.4000E-06,-181.0050271E-03
+86.5000E-06,-181.0050271E-03
+86.6000E-06,-181.0050271E-03
+86.7000E-06,-181.0050271E-03
+86.8000E-06,-181.0050271E-03
+86.9000E-06,-181.0050271E-03
+87.0000E-06,-181.0050271E-03
+87.1000E-06,-181.0050271E-03
+87.2000E-06,-37.4300079E-03
+87.3000E-06,-123.5750194E-03
+87.4000E-06,+19.9999996E-03
+87.5000E-06,+19.9999996E-03
+87.6000E-06,+19.9999996E-03
+87.7000E-06,+19.9999996E-03
+87.8000E-06,+19.9999996E-03
+87.9000E-06,-181.0050271E-03
+88.0000E-06,-181.0050271E-03
+88.1000E-06,-181.0050271E-03
+88.2000E-06,-94.8600155E-03
+88.3000E-06,-181.0050271E-03
+88.4000E-06,-382.0100538E-03
+88.5000E-06,-181.0050271E-03
+88.6000E-06,-382.0100538E-03
+88.7000E-06,-382.0100538E-03
+88.8000E-06,-382.0100538E-03
+88.9000E-06,-382.0100538E-03
+89.0000E-06,-382.0100540E-03
+89.1000E-06,-583.0150805E-03
+89.2000E-06,-554.3000766E-03
+89.3000E-06,-382.0100538E-03
+89.4000E-06,-324.5800460E-03
+89.5000E-06,-181.0050271E-03
+89.6000E-06,-181.0050271E-03
+89.7000E-06,-181.0050271E-03
+89.8000E-06,+19.9999996E-03
+89.9000E-06,+19.9999996E-03
+90.0000E-06,+19.9999996E-03
+90.1000E-06,+19.9999996E-03
+90.2000E-06,-8.7150041E-03
+90.3000E-06,+19.9999996E-03
+90.4000E-06,+19.9999996E-03
+90.5000E-06,+19.9999996E-03
+90.6000E-06,+48.7150035E-03
+90.7000E-06,+221.0050263E-03
+90.8000E-06,+221.0050263E-03
+90.9000E-06,+221.0050263E-03
+91.0000E-06,+221.0050263E-03
+91.1000E-06,+221.0050264E-03
+91.2000E-06,+221.0050263E-03
+91.3000E-06,+249.7200302E-03
+91.4000E-06,+278.4350337E-03
+91.5000E-06,+221.0050263E-03
+91.6000E-06,+221.0050263E-03
+91.7000E-06,+134.8600146E-03
+91.8000E-06,+221.0050261E-03
+91.9000E-06,+106.1450108E-03
+92.0000E-06,+19.9999996E-03
+92.1000E-06,+163.5750188E-03
+92.2000E-06,+221.0050263E-03
+92.3000E-06,-181.0050271E-03
+92.4000E-06,-267.1500388E-03
+92.5000E-06,-382.0100538E-03
+92.6000E-06,-382.0100538E-03
+92.7000E-06,-583.0150805E-03
+92.8000E-06,-784.0201072E-03
+92.9000E-06,-726.5900994E-03
+93.0000E-06,-755.3051036E-03
+93.1000E-06,-697.8750956E-03
+93.2000E-06,-784.0201072E-03
+93.3000E-06,-697.8750960E-03
+93.4000E-06,-755.3051033E-03
+93.5000E-06,-583.0150805E-03
+93.6000E-06,-583.0150805E-03
+93.7000E-06,-382.0100538E-03
+93.8000E-06,-267.1500388E-03
+93.9000E-06,-181.0050273E-03
+94.0000E-06,-181.0050271E-03
+94.1000E-06,+19.9999996E-03
+94.2000E-06,+19.9999996E-03
+94.3000E-06,+163.5750184E-03
+94.4000E-06,+192.2900226E-03
+94.5000E-06,+221.0050263E-03
+94.6000E-06,+221.0050263E-03
+94.7000E-06,+221.0050263E-03
+94.8000E-06,+221.0050263E-03
+94.9000E-06,+278.4350337E-03
+95.0000E-06,+221.0050263E-03
+95.1000E-06,+221.0050263E-03
+95.2000E-06,+221.0050263E-03
+95.3000E-06,+221.0050263E-03
+95.4000E-06,+221.0050263E-03
+95.5000E-06,+221.0050263E-03
+95.6000E-06,+221.0050263E-03
+95.7000E-06,+221.0050263E-03
+95.8000E-06,+221.0050263E-03
+95.9000E-06,+106.1450112E-03
+96.0000E-06,+221.0050263E-03
+96.1000E-06,+19.9999996E-03
+96.2000E-06,+48.7150035E-03
+96.3000E-06,+77.4300070E-03
+96.4000E-06,+163.5750184E-03
+96.5000E-06,+19.9999996E-03
+96.6000E-06,+19.9999996E-03
+96.7000E-06,+19.9999996E-03
+96.8000E-06,-181.0050271E-03
+96.9000E-06,-181.0050271E-03
+97.0000E-06,-181.0050271E-03
+97.1000E-06,-181.0050271E-03
+97.2000E-06,-382.0100538E-03
+97.3000E-06,-295.8650422E-03
+97.4000E-06,-382.0100538E-03
+97.5000E-06,-382.0100538E-03
+97.6000E-06,-410.7250578E-03
+97.7000E-06,-382.0100538E-03
+97.8000E-06,-382.0100538E-03
+97.9000E-06,-382.0100538E-03
+98.0000E-06,-382.0100538E-03
+98.1000E-06,-382.0100538E-03
+98.2000E-06,-382.0100538E-03
+98.3000E-06,-382.0100538E-03
+98.4000E-06,-382.0100538E-03
+98.5000E-06,-382.0100538E-03
+98.6000E-06,-382.0100538E-03
+98.7000E-06,-382.0100538E-03
+98.8000E-06,-181.0050271E-03
+98.9000E-06,-295.8650426E-03
+99.0000E-06,-181.0050271E-03
+99.1000E-06,-181.0050271E-03
+99.2000E-06,-37.4300083E-03
+99.3000E-06,+19.9999996E-03
+99.4000E-06,+19.9999996E-03
+99.5000E-06,+221.0050263E-03
+99.6000E-06,+19.9999996E-03
+99.7000E-06,+48.7150035E-03
+99.8000E-06,+221.0050263E-03
+99.9000E-06,+221.0050263E-03
