x-axis,1
second,Volt
-250.4000E-06,-391.0050243E-03
-250.1500E-06,-189.9999976E-03
-249.9000E-06,-221.4070330E-03
-249.6500E-06,-309.3467322E-03
-249.4000E-06,-321.9095464E-03
-249.1500E-06,-391.0050243E-03
-248.9000E-06,-189.9999976E-03
-248.6500E-06,-391.0050243E-03
-248.4000E-06,-391.0050243E-03
-248.1500E-06,-391.0050243E-03
-247.9000E-06,-189.9999976E-03
-247.6500E-06,-391.0050243E-03
-247.4000E-06,-391.0050243E-03
-247.1500E-06,-208.8442189E-03
-246.9000E-06,-221.4070330E-03
-246.6500E-06,-391.0050243E-03
-246.4000E-06,-391.0050243E-03
-246.1500E-06,-208.8442189E-03
-245.9000E-06,-221.4070330E-03
-245.6500E-06,-271.6582897E-03
-245.4000E-06,-189.9999976E-03
-245.1500E-06,-208.8442189E-03
-244.9000E-06,-189.9999976E-03
-244.6500E-06,-309.3467322E-03
-244.4000E-06,-252.8140684E-03
-244.1500E-06,-189.9999976E-03
-243.9000E-06,-189.9999976E-03
-243.6500E-06,-271.6582897E-03
-243.4000E-06,-259.0954756E-03
-243.1500E-06,-372.1608030E-03
-242.9000E-06,-391.0050243E-03
-242.6500E-06,-271.6582897E-03
-242.4000E-06,-391.0050243E-03
-242.1500E-06,-189.9999976E-03
-241.9000E-06,-189.9999976E-03
-241.6500E-06,-189.9999976E-03
-241.4000E-06,-189.9999976E-03
-241.1500E-06,-189.9999976E-03
-240.9000E-06,-189.9999976E-03
-240.6500E-06,-309.3467322E-03
-240.4000E-06,-189.9999976E-03
-240.1500E-06,-189.9999976E-03
-239.9000E-06,-189.9999976E-03
-239.6500E-06,-189.9999976E-03
-239.4000E-06,-259.0954756E-03
-239.1500E-06,-208.8442189E-03
-238.9000E-06,-221.4070330E-03
-238.6500E-06,-189.9999976E-03
-238.4000E-06,-189.9999976E-03
-238.1500E-06,-189.9999976E-03
-237.9000E-06,-391.0050243E-03
-237.6500E-06,-189.9999976E-03
-237.4000E-06,-189.9999976E-03
-237.1500E-06,-372.1608031E-03
-236.9000E-06,-189.9999976E-03
-236.6500E-06,-189.9999976E-03
-236.4000E-06,-189.9999976E-03
-236.1500E-06,-372.1608031E-03
-235.9000E-06,-189.9999976E-03
-235.6500E-06,-271.6582897E-03
-235.4000E-06,-189.9999976E-03
-235.1500E-06,-391.0050243E-03
-234.9000E-06,-221.4070330E-03
-234.6500E-06,-189.9999976E-03
-234.4000E-06,-321.9095464E-03
-234.1500E-06,-391.0050243E-03
-233.9000E-06,-391.0050243E-03
-233.6500E-06,-391.0050243E-03
-233.4000E-06,-321.9095464E-03
-233.1500E-06,-391.0050243E-03
-232.9000E-06,-189.9999976E-03
-232.6500E-06,-391.0050243E-03
-232.4000E-06,-391.0050243E-03
-232.1500E-06,-391.0050243E-03
-231.9000E-06,-391.0050243E-03
-231.6500E-06,-472.6633164E-03
-231.4000E-06,-522.9145731E-03
-231.1500E-06,-573.1658298E-03
-230.9000E-06,-560.6030156E-03
-230.6500E-06,-391.0050243E-03
-230.4000E-06,-592.0100510E-03
-230.1500E-06,-592.0100510E-03
-229.9000E-06,-592.0100510E-03
-229.6500E-06,-472.6633164E-03
-229.4000E-06,-592.0100510E-03
-229.1500E-06,-592.0100510E-03
-228.9000E-06,-592.0100510E-03
-228.6500E-06,-592.0100510E-03
-228.4000E-06,-592.0100510E-03
-228.1500E-06,-774.1708565E-03
-227.9000E-06,-592.0100510E-03
-227.6500E-06,-592.0100510E-03
-227.4000E-06,-592.0100510E-03
-227.1500E-06,-592.0100510E-03
-226.9000E-06,-592.0100510E-03
-226.6500E-06,-592.0100510E-03
-226.4000E-06,-592.0100510E-03
-226.1500E-06,-592.0100510E-03
-225.9000E-06,-592.0100510E-03
-225.6500E-06,-673.6683431E-03
-225.4000E-06,-592.0100510E-03
-225.1500E-06,-592.0100510E-03
-224.9000E-06,-592.0100510E-03
-224.6500E-06,-592.0100510E-03
-224.4000E-06,-592.0100510E-03
-224.1500E-06,-592.0100510E-03
-223.9000E-06,-592.0100510E-03
-223.6500E-06,-592.0100510E-03
-223.4000E-06,-592.0100510E-03
-223.1500E-06,-774.1708565E-03
-222.9000E-06,-592.0100510E-03
-222.6500E-06,-592.0100510E-03
-222.4000E-06,-592.0100510E-03
-222.1500E-06,-409.8492456E-03
-221.9000E-06,-592.0100510E-03
-221.6500E-06,-472.6633164E-03
-221.4000E-06,-391.0050243E-03
-221.1500E-06,-391.0050243E-03
-220.9000E-06,-391.0050243E-03
-220.6500E-06,-391.0050243E-03
-220.4000E-06,-391.0050243E-03
-220.1500E-06,-391.0050243E-03
-219.9000E-06,-391.0050243E-03
-219.6500E-06,-391.0050243E-03
-219.4000E-06,-391.0050243E-03
-219.1500E-06,-391.0050243E-03
-218.9000E-06,-391.0050243E-03
-218.6500E-06,-271.6582897E-03
-218.4000E-06,-391.0050243E-03
-218.1500E-06,-372.1608031E-03
-217.9000E-06,-221.4070330E-03
-217.6500E-06,-309.3467322E-03
-217.4000E-06,-189.9999976E-03
-217.1500E-06,-189.9999976E-03
-216.9000E-06,-359.5979889E-03
-216.6500E-06,-391.0050243E-03
-216.4000E-06,-189.9999976E-03
-216.1500E-06,-208.8442189E-03
-215.9000E-06,-359.5979889E-03
-215.6500E-06,-309.3467322E-03
-215.4000E-06,-259.0954755E-03
-215.1500E-06,-189.9999976E-03
-214.9000E-06,-359.5979889E-03
-214.6500E-06,-271.6582897E-03
-214.4000E-06,-259.0954755E-03
-214.1500E-06,-208.8442189E-03
-213.9000E-06,-359.5979889E-03
-213.6500E-06,-189.9999976E-03
-213.4000E-06,-189.9999976E-03
-213.1500E-06,-208.8442189E-03
-212.9000E-06,-189.9999976E-03
-212.6500E-06,-189.9999976E-03
-212.4000E-06,-391.0050243E-03
-212.1500E-06,-208.8442189E-03
-211.9000E-06,-189.9999976E-03
-211.6500E-06,-271.6582897E-03
-211.4000E-06,-321.9095464E-03
-211.1500E-06,-208.8442189E-03
-210.9000E-06,-189.9999976E-03
-210.6500E-06,-189.9999976E-03
-210.4000E-06,-189.9999976E-03
-210.1500E-06,-189.9999976E-03
-209.9000E-06,-359.5979889E-03
-209.6500E-06,-309.3467322E-03
-209.4000E-06,-189.9999976E-03
-209.1500E-06,-189.9999976E-03
-208.9000E-06,-221.4070330E-03
-208.6500E-06,-189.9999976E-03
-208.4000E-06,-189.9999976E-03
-208.1500E-06,-189.9999976E-03
-207.9000E-06,-189.9999976E-03
-207.6500E-06,-189.9999976E-03
-207.4000E-06,-58.0904488E-03
-207.1500E-06,-189.9999976E-03
-206.9000E-06,-158.5929622E-03
-206.6500E-06,-70.6532630E-03
-206.4000E-06,+11.0050291E-03
-206.1500E-06,+11.0050291E-03
-205.9000E-06,+11.0050291E-03
-205.6500E-06,+11.0050291E-03
-205.4000E-06,-58.0904488E-03
-205.1500E-06,+11.0050291E-03
-204.9000E-06,+11.0050291E-03
-204.6500E-06,+11.0050291E-03
-204.4000E-06,+11.0050291E-03
-204.1500E-06,+11.0050291E-03
-203.9000E-06,+180.6030203E-03
-203.6500E-06,+11.0050291E-03
-203.4000E-06,+11.0050291E-03
-203.1500E-06,+11.0050291E-03
-202.9000E-06,+180.6030203E-03
-202.6500E-06,+11.0050291E-03
-202.4000E-06,+11.0050291E-03
-202.1500E-06,+11.0050291E-03
-201.9000E-06,+42.4120645E-03
-201.6500E-06,+11.0050291E-03
-201.4000E-06,+11.0050291E-03
-201.1500E-06,+11.0050291E-03
-200.9000E-06,-20.4020064E-03
-200.6500E-06,+11.0050291E-03
-200.4000E-06,+11.0050291E-03
-200.1500E-06,-171.1557764E-03
-199.9000E-06,+11.0050291E-03
-199.6500E-06,+11.0050291E-03
-199.4000E-06,-189.9999976E-03
-199.1500E-06,-189.9999976E-03
-198.9000E-06,-189.9999976E-03
-198.6500E-06,-271.6582897E-03
-198.4000E-06,-189.9999976E-03
-198.1500E-06,-189.9999976E-03
-197.9000E-06,-189.9999976E-03
-197.6500E-06,-271.6582897E-03
-197.4000E-06,-189.9999976E-03
-197.1500E-06,-391.0050243E-03
-196.9000E-06,-359.5979889E-03
-196.6500E-06,-189.9999976E-03
-196.4000E-06,-391.0050243E-03
-196.1500E-06,-391.0050243E-03
-195.9000E-06,-391.0050243E-03
-195.6500E-06,-391.0050243E-03
-195.4000E-06,-391.0050243E-03
-195.1500E-06,-391.0050243E-03
-194.9000E-06,-391.0050243E-03
-194.6500E-06,-391.0050243E-03
-194.4000E-06,-522.9145731E-03
-194.1500E-06,-391.0050243E-03
-193.9000E-06,-391.0050243E-03
-193.6500E-06,-391.0050243E-03
-193.4000E-06,-391.0050243E-03
-193.1500E-06,-409.8492455E-03
-192.9000E-06,-391.0050243E-03
-192.6500E-06,-510.3517589E-03
-192.4000E-06,-391.0050243E-03
-192.1500E-06,-391.0050243E-03
-191.9000E-06,-422.4120598E-03
-191.6500E-06,-391.0050243E-03
-191.4000E-06,-391.0050243E-03
-191.1500E-06,-391.0050243E-03
-190.9000E-06,-359.5979889E-03
-190.6500E-06,-189.9999976E-03
-190.4000E-06,-391.0050243E-03
-190.1500E-06,-372.1608031E-03
-189.9000E-06,-391.0050243E-03
-189.6500E-06,-271.6582897E-03
-189.4000E-06,-321.9095464E-03
-189.1500E-06,-189.9999976E-03
-188.9000E-06,-189.9999976E-03
-188.6500E-06,-189.9999976E-03
-188.4000E-06,-189.9999976E-03
-188.1500E-06,-189.9999976E-03
-187.9000E-06,-158.5929622E-03
-187.6500E-06,-108.3417055E-03
-187.4000E-06,+11.0050291E-03
-187.1500E-06,+11.0050291E-03
-186.9000E-06,-158.5929622E-03
-186.6500E-06,-189.9999976E-03
-186.4000E-06,+11.0050291E-03
-186.1500E-06,-7.8391921E-03
-185.9000E-06,+11.0050291E-03
-185.6500E-06,-108.3417055E-03
-185.4000E-06,+11.0050291E-03
-185.1500E-06,-171.1557764E-03
-184.9000E-06,-189.9999976E-03
-184.6500E-06,-70.6532630E-03
-184.4000E-06,-120.9045197E-03
-184.1500E-06,-189.9999976E-03
-183.9000E-06,+11.0050291E-03
-183.6500E-06,-70.6532630E-03
-183.4000E-06,-120.9045197E-03
-183.1500E-06,+11.0050291E-03
-182.9000E-06,+11.0050291E-03
-182.6500E-06,+11.0050291E-03
-182.4000E-06,+11.0050291E-03
-182.1500E-06,-171.1557764E-03
-181.9000E-06,+11.0050291E-03
-181.6500E-06,-70.6532630E-03
-181.4000E-06,-189.9999976E-03
-181.1500E-06,-189.9999976E-03
-180.9000E-06,-189.9999976E-03
-180.6500E-06,-108.3417055E-03
-180.4000E-06,-189.9999976E-03
-180.1500E-06,-189.9999976E-03
-179.9000E-06,-189.9999976E-03
-179.6500E-06,-189.9999976E-03
-179.4000E-06,-189.9999976E-03
-179.1500E-06,-189.9999976E-03
-178.9000E-06,-20.4020064E-03
-178.6500E-06,-189.9999976E-03
-178.4000E-06,-189.9999976E-03
-178.1500E-06,-189.9999976E-03
-177.9000E-06,-189.9999976E-03
-177.6500E-06,-189.9999976E-03
-177.4000E-06,-189.9999976E-03
-177.1500E-06,-189.9999976E-03
-176.9000E-06,-189.9999976E-03
-176.6500E-06,-189.9999976E-03
-176.4000E-06,-189.9999976E-03
-176.1500E-06,+11.0050291E-03
-175.9000E-06,+11.0050291E-03
-175.6500E-06,-70.6532630E-03
-175.4000E-06,+11.0050291E-03
-175.1500E-06,-7.8391921E-03
-174.9000E-06,-20.4020064E-03
-174.6500E-06,+11.0050291E-03
-174.4000E-06,+11.0050291E-03
-174.1500E-06,-171.1557764E-03
-173.9000E-06,+11.0050291E-03
-173.6500E-06,+11.0050291E-03
-173.4000E-06,+11.0050291E-03
-173.1500E-06,+11.0050291E-03
-172.9000E-06,+11.0050291E-03
-172.6500E-06,+11.0050291E-03
-172.4000E-06,+212.0100558E-03
-172.1500E-06,+212.0100558E-03
-171.9000E-06,+180.6030203E-03
-171.6500E-06,+92.6633212E-03
-171.4000E-06,+11.0050291E-03
-171.1500E-06,+11.0050291E-03
-170.9000E-06,+11.0050291E-03
-170.6500E-06,+130.3517637E-03
-170.4000E-06,+11.0050291E-03
-170.1500E-06,+29.8492503E-03
-169.9000E-06,+11.0050291E-03
-169.6500E-06,+92.6633212E-03
-169.4000E-06,+11.0050291E-03
-169.1500E-06,+11.0050291E-03
-168.9000E-06,+11.0050291E-03
-168.6500E-06,+11.0050291E-03
-168.4000E-06,+80.1005070E-03
-168.1500E-06,+11.0050291E-03
-167.9000E-06,+11.0050291E-03
-167.6500E-06,+11.0050291E-03
-167.4000E-06,-120.9045197E-03
-167.1500E-06,+11.0050291E-03
-166.9000E-06,+11.0050291E-03
-166.6500E-06,-108.3417055E-03
-166.4000E-06,-189.9999976E-03
-166.1500E-06,+11.0050291E-03
-165.9000E-06,-189.9999976E-03
-165.6500E-06,-189.9999976E-03
-165.4000E-06,-58.0904488E-03
-165.1500E-06,-189.9999976E-03
-164.9000E-06,-189.9999976E-03
-164.6500E-06,-189.9999976E-03
-164.4000E-06,-189.9999976E-03
-164.1500E-06,-189.9999976E-03
-163.9000E-06,-189.9999976E-03
-163.6500E-06,-189.9999976E-03
-163.4000E-06,-259.0954755E-03
-163.1500E-06,-189.9999976E-03
-162.9000E-06,-189.9999976E-03
-162.6500E-06,-189.9999976E-03
-162.4000E-06,-189.9999976E-03
-162.1500E-06,-189.9999976E-03
-161.9000E-06,-189.9999976E-03
-161.6500E-06,-189.9999976E-03
-161.4000E-06,-189.9999976E-03
-161.1500E-06,-189.9999976E-03
-160.9000E-06,-189.9999976E-03
-160.6500E-06,+11.0050291E-03
-160.4000E-06,-189.9999976E-03
-160.1500E-06,+11.0050291E-03
-159.9000E-06,+11.0050291E-03
-159.6500E-06,+11.0050291E-03
-159.4000E-06,+11.0050291E-03
-159.1500E-06,+11.0050291E-03
-158.9000E-06,+11.0050291E-03
-158.6500E-06,+11.0050291E-03
-158.4000E-06,+11.0050291E-03
-158.1500E-06,+11.0050291E-03
-157.9000E-06,+11.0050291E-03
-157.6500E-06,+11.0050291E-03
-157.4000E-06,+142.9145779E-03
-157.1500E-06,+11.0050291E-03
-156.9000E-06,+212.0100558E-03
-156.6500E-06,+11.0050291E-03
-156.4000E-06,+11.0050291E-03
-156.1500E-06,+11.0050291E-03
-155.9000E-06,+212.0100558E-03
-155.6500E-06,+92.6633212E-03
-155.4000E-06,+142.9145779E-03
-155.1500E-06,+193.1658346E-03
-154.9000E-06,+180.6030203E-03
-154.6500E-06,+212.0100558E-03
-154.4000E-06,+212.0100558E-03
-154.1500E-06,+11.0050291E-03
-153.9000E-06,+212.0100558E-03
-153.6500E-06,+212.0100558E-03
-153.4000E-06,+212.0100558E-03
-153.1500E-06,+29.8492503E-03
-152.9000E-06,+212.0100558E-03
-152.6500E-06,+130.3517636E-03
-152.4000E-06,+212.0100558E-03
-152.1500E-06,+212.0100558E-03
-151.9000E-06,+180.6030203E-03
-151.6500E-06,+212.0100558E-03
-151.4000E-06,+142.9145779E-03
-151.1500E-06,+11.0050291E-03
-150.9000E-06,+42.4120645E-03
-150.6500E-06,+92.6633212E-03
-150.4000E-06,+11.0050291E-03
-150.1500E-06,+11.0050291E-03
-149.9000E-06,+42.4120645E-03
-149.6500E-06,+130.3517636E-03
-149.4000E-06,+11.0050291E-03
-149.1500E-06,+11.0050291E-03
-148.9000E-06,+11.0050291E-03
-148.6500E-06,+11.0050291E-03
-148.4000E-06,+11.0050291E-03
-148.1500E-06,+11.0050291E-03
-147.9000E-06,+11.0050291E-03
-147.6500E-06,+11.0050291E-03
-147.4000E-06,+11.0050291E-03
-147.1500E-06,+11.0050291E-03
-146.9000E-06,+42.4120646E-03
-146.6500E-06,+130.3517636E-03
-146.4000E-06,+11.0050291E-03
-146.1500E-06,+11.0050291E-03
-145.9000E-06,+180.6030203E-03
-145.6500E-06,+11.0050291E-03
-145.4000E-06,+11.0050291E-03
-145.1500E-06,+11.0050291E-03
-144.9000E-06,+11.0050291E-03
-144.6500E-06,+11.0050291E-03
-144.4000E-06,+11.0050291E-03
-144.1500E-06,+11.0050291E-03
-143.9000E-06,+42.4120646E-03
-143.6500E-06,+11.0050291E-03
-143.4000E-06,+80.1005070E-03
-143.1500E-06,+212.0100558E-03
-142.9000E-06,+42.4120646E-03
-142.6500E-06,+11.0050291E-03
-142.4000E-06,+80.1005070E-03
-142.1500E-06,+29.8492503E-03
-141.9000E-06,+11.0050291E-03
-141.6500E-06,+11.0050291E-03
-141.4000E-06,+11.0050291E-03
-141.1500E-06,+193.1658346E-03
-140.9000E-06,+11.0050291E-03
-140.6500E-06,+11.0050291E-03
-140.4000E-06,+11.0050291E-03
-140.1500E-06,+193.1658346E-03
-139.9000E-06,+11.0050291E-03
-139.6500E-06,+11.0050291E-03
-139.4000E-06,+11.0050291E-03
-139.1500E-06,-171.1557764E-03
-138.9000E-06,-20.4020064E-03
-138.6500E-06,+11.0050291E-03
-138.4000E-06,+11.0050291E-03
-138.1500E-06,+11.0050291E-03
-137.9000E-06,+11.0050291E-03
-137.6500E-06,-189.9999976E-03
-137.4000E-06,-120.9045197E-03
-137.1500E-06,-189.9999976E-03
-136.9000E-06,-189.9999976E-03
-136.6500E-06,-189.9999976E-03
-136.4000E-06,-120.9045197E-03
-136.1500E-06,-189.9999976E-03
-135.9000E-06,-189.9999976E-03
-135.6500E-06,-189.9999976E-03
-135.4000E-06,-189.9999976E-03
-135.1500E-06,-189.9999976E-03
-134.9000E-06,-189.9999976E-03
-134.6500E-06,-189.9999976E-03
-134.4000E-06,-321.9095464E-03
-134.1500E-06,-208.8442188E-03
-133.9000E-06,-189.9999976E-03
-133.6500E-06,-309.3467322E-03
-133.4000E-06,-391.0050243E-03
-133.1500E-06,-372.1608031E-03
-132.9000E-06,-391.0050243E-03
-132.6500E-06,-309.3467322E-03
-132.4000E-06,-391.0050243E-03
-132.1500E-06,-372.1608031E-03
-131.9000E-06,-221.4070331E-03
-131.6500E-06,-391.0050243E-03
-131.4000E-06,-391.0050243E-03
-131.1500E-06,-391.0050243E-03
-130.9000E-06,-391.0050243E-03
-130.6500E-06,-391.0050243E-03
-130.4000E-06,-391.0050243E-03
-130.1500E-06,-573.1658298E-03
-129.9000E-06,-391.0050243E-03
-129.6500E-06,-510.3517589E-03
-129.4000E-06,-391.0050243E-03
-129.1500E-06,-573.1658298E-03
-128.9000E-06,-391.0050243E-03
-128.6500E-06,-510.3517589E-03
-128.4000E-06,-391.0050243E-03
-128.1500E-06,-391.0050243E-03
-127.9000E-06,-422.4120598E-03
-127.6500E-06,-592.0100510E-03
-127.4000E-06,-391.0050243E-03
-127.1500E-06,-592.0100510E-03
-126.9000E-06,-391.0050243E-03
-126.6500E-06,-510.3517589E-03
-126.4000E-06,-522.9145731E-03
-126.1500E-06,-391.0050243E-03
-125.9000E-06,-422.4120598E-03
-125.6500E-06,-472.6633165E-03
-125.4000E-06,-391.0050243E-03
-125.1500E-06,-573.1658298E-03
-124.9000E-06,-422.4120598E-03
-124.6500E-06,-592.0100510E-03
-124.4000E-06,-592.0100510E-03
-124.1500E-06,-573.1658298E-03
-123.9000E-06,-592.0100510E-03
-123.6500E-06,-592.0100510E-03
-123.4000E-06,-592.0100510E-03
-123.1500E-06,-592.0100510E-03
-122.9000E-06,-592.0100510E-03
-122.6500E-06,-592.0100510E-03
-122.4000E-06,-522.9145731E-03
-122.1500E-06,-592.0100510E-03
-121.9000E-06,-592.0100510E-03
-121.6500E-06,-472.6633165E-03
-121.4000E-06,-592.0100510E-03
-121.1500E-06,-592.0100510E-03
-120.9000E-06,-592.0100510E-03
-120.6500E-06,-592.0100510E-03
-120.4000E-06,-592.0100510E-03
-120.1500E-06,-592.0100510E-03
-119.9000E-06,-592.0100510E-03
-119.6500E-06,-472.6633165E-03
-119.4000E-06,-592.0100510E-03
-119.1500E-06,-573.1658298E-03
-118.9000E-06,-391.0050243E-03
-118.6500E-06,-592.0100510E-03
-118.4000E-06,-522.9145731E-03
-118.1500E-06,-391.0050243E-03
-117.9000E-06,-391.0050243E-03
-117.6500E-06,-391.0050243E-03
-117.4000E-06,-522.9145731E-03
-117.1500E-06,-391.0050243E-03
-116.9000E-06,-391.0050243E-03
-116.6500E-06,-391.0050243E-03
-116.4000E-06,-391.0050243E-03
-116.1500E-06,-391.0050243E-03
-115.9000E-06,-391.0050243E-03
-115.6500E-06,-391.0050243E-03
-115.4000E-06,-321.9095465E-03
-115.1500E-06,-391.0050243E-03
-114.9000E-06,-221.4070331E-03
-114.6500E-06,-391.0050243E-03
-114.4000E-06,-189.9999976E-03
-114.1500E-06,-372.1608031E-03
-113.9000E-06,-221.4070331E-03
-113.6500E-06,-309.3467322E-03
-113.4000E-06,-189.9999976E-03
-113.1500E-06,-372.1608031E-03
-112.9000E-06,-189.9999976E-03
-112.6500E-06,-391.0050243E-03
-112.4000E-06,-259.0954755E-03
-112.1500E-06,-189.9999976E-03
-111.9000E-06,-391.0050243E-03
-111.6500E-06,-309.3467321E-03
-111.4000E-06,-391.0050243E-03
-111.1500E-06,-208.8442188E-03
-110.9000E-06,-391.0050243E-03
-110.6500E-06,-391.0050243E-03
-110.4000E-06,-391.0050243E-03
-110.1500E-06,-391.0050243E-03
-109.9000E-06,-391.0050243E-03
-109.6500E-06,-391.0050243E-03
-109.4000E-06,-259.0954755E-03
-109.1500E-06,-391.0050243E-03
-108.9000E-06,-391.0050243E-03
-108.6500E-06,-472.6633165E-03
-108.4000E-06,-522.9145732E-03
-108.1500E-06,-592.0100510E-03
-107.9000E-06,-391.0050243E-03
-107.6500E-06,-472.6633165E-03
-107.4000E-06,-592.0100510E-03
-107.1500E-06,-573.1658298E-03
-106.9000E-06,-560.6030155E-03
-106.6500E-06,-472.6633165E-03
-106.4000E-06,-592.0100510E-03
-106.1500E-06,-391.0050243E-03
-105.9000E-06,-592.0100510E-03
-105.6500E-06,-592.0100510E-03
-105.4000E-06,-592.0100510E-03
-105.1500E-06,-592.0100510E-03
-104.9000E-06,-592.0100510E-03
-104.6500E-06,-592.0100510E-03
-104.4000E-06,-522.9145732E-03
-104.1500E-06,-592.0100510E-03
-103.9000E-06,-422.4120598E-03
-103.6500E-06,-592.0100510E-03
-103.4000E-06,-460.1005022E-03
-103.1500E-06,-573.1658298E-03
-102.9000E-06,-391.0050243E-03
-102.6500E-06,-510.3517588E-03
-102.4000E-06,-391.0050243E-03
-102.1500E-06,-409.8492455E-03
-101.9000E-06,-391.0050243E-03
-101.6500E-06,-391.0050243E-03
-101.4000E-06,-391.0050243E-03
-101.1500E-06,-391.0050243E-03
-100.9000E-06,-391.0050243E-03
-100.6500E-06,-391.0050243E-03
-100.4000E-06,-391.0050243E-03
-100.1500E-06,-391.0050243E-03
-99.9000E-06,-391.0050243E-03
-99.6500E-06,-391.0050243E-03
-99.4000E-06,-259.0954755E-03
-99.1500E-06,-391.0050243E-03
-98.9000E-06,-391.0050243E-03
-98.6500E-06,-391.0050243E-03
-98.4000E-06,-259.0954755E-03
-98.1500E-06,-391.0050243E-03
-97.9000E-06,-391.0050243E-03
-97.6500E-06,-391.0050243E-03
-97.4000E-06,-321.9095465E-03
-97.1500E-06,-391.0050243E-03
-96.9000E-06,-391.0050243E-03
-96.6500E-06,-391.0050243E-03
-96.4000E-06,-391.0050243E-03
-96.1500E-06,-391.0050243E-03
-95.9000E-06,-391.0050243E-03
-95.6500E-06,-391.0050243E-03
-95.4000E-06,-391.0050243E-03
-95.1500E-06,-391.0050243E-03
-94.9000E-06,-560.6030155E-03
-94.6500E-06,-472.6633165E-03
-94.4000E-06,-391.0050243E-03
-94.1500E-06,-391.0050243E-03
-93.9000E-06,-422.4120598E-03
-93.6500E-06,-510.3517588E-03
-93.4000E-06,-522.9145732E-03
-93.1500E-06,-592.0100510E-03
-92.9000E-06,-391.0050243E-03
-92.6500E-06,-472.6633165E-03
-92.4000E-06,-522.9145732E-03
-92.1500E-06,-409.8492455E-03
-91.9000E-06,-391.0050243E-03
-91.6500E-06,-510.3517588E-03
-91.4000E-06,-460.1005022E-03
-91.1500E-06,-592.0100510E-03
-90.9000E-06,-391.0050243E-03
-90.6500E-06,-510.3517588E-03
-90.4000E-06,-391.0050243E-03
-90.1500E-06,-391.0050243E-03
-89.9000E-06,-391.0050243E-03
-89.6500E-06,-391.0050243E-03
-89.4000E-06,-259.0954755E-03
-89.1500E-06,-391.0050243E-03
-88.9000E-06,-221.4070331E-03
-88.6500E-06,-309.3467321E-03
-88.4000E-06,-189.9999976E-03
-88.1500E-06,-391.0050243E-03
-87.9000E-06,-189.9999976E-03
-87.6500E-06,-189.9999976E-03
-87.4000E-06,-189.9999976E-03
-87.1500E-06,-189.9999976E-03
-86.9000E-06,-189.9999976E-03
-86.6500E-06,-189.9999976E-03
-86.4000E-06,-120.9045198E-03
-86.1500E-06,+11.0050291E-03
-85.9000E-06,+11.0050291E-03
-85.6500E-06,+11.0050291E-03
-85.4000E-06,+11.0050291E-03
-85.1500E-06,+11.0050291E-03
-84.9000E-06,-20.4020064E-03
-84.6500E-06,+11.0050291E-03
-84.4000E-06,+11.0050291E-03
-84.1500E-06,+11.0050291E-03
-83.9000E-06,+11.0050291E-03
-83.6500E-06,+130.3517636E-03
-83.4000E-06,+11.0050291E-03
-83.1500E-06,+11.0050291E-03
-82.9000E-06,+11.0050291E-03
-82.6500E-06,+11.0050291E-03
-82.4000E-06,+11.0050291E-03
-82.1500E-06,+11.0050291E-03
-81.9000E-06,+11.0050291E-03
-81.6500E-06,+11.0050291E-03
-81.4000E-06,-120.9045198E-03
-81.1500E-06,+11.0050291E-03
-80.9000E-06,-158.5929621E-03
-80.6500E-06,-189.9999976E-03
-80.4000E-06,-120.9045198E-03
-80.1500E-06,-171.1557765E-03
-79.9000E-06,-189.9999976E-03
-79.6500E-06,-189.9999976E-03
-79.4000E-06,-189.9999976E-03
-79.1500E-06,-189.9999976E-03
-78.9000E-06,-221.4070331E-03
-78.6500E-06,-309.3467321E-03
-78.4000E-06,-259.0954755E-03
-78.1500E-06,-391.0050243E-03
-77.9000E-06,-391.0050243E-03
-77.6500E-06,-271.6582898E-03
-77.4000E-06,-259.0954755E-03
-77.1500E-06,-391.0050243E-03
-76.9000E-06,-391.0050243E-03
-76.6500E-06,-391.0050243E-03
-76.4000E-06,-391.0050243E-03
-76.1500E-06,-391.0050243E-03
-75.9000E-06,-422.4120598E-03
-75.6500E-06,-391.0050243E-03
-75.4000E-06,-391.0050243E-03
-75.1500E-06,-391.0050243E-03
-74.9000E-06,-391.0050243E-03
-74.6500E-06,-472.6633165E-03
-74.4000E-06,-391.0050243E-03
-74.1500E-06,-409.8492455E-03
-73.9000E-06,-391.0050243E-03
-73.6500E-06,-391.0050243E-03
-73.4000E-06,-522.9145732E-03
-73.1500E-06,-391.0050243E-03
-72.9000E-06,-391.0050243E-03
-72.6500E-06,-391.0050243E-03
-72.4000E-06,-391.0050243E-03
-72.1500E-06,-391.0050243E-03
-71.9000E-06,-359.5979888E-03
-71.6500E-06,-391.0050243E-03
-71.4000E-06,-321.9095465E-03
-71.1500E-06,-372.1608032E-03
-70.9000E-06,-221.4070331E-03
-70.6500E-06,-271.6582898E-03
-70.4000E-06,-189.9999976E-03
-70.1500E-06,-189.9999976E-03
-69.9000E-06,-189.9999976E-03
-69.6500E-06,-189.9999976E-03
-69.4000E-06,-189.9999976E-03
-69.1500E-06,-189.9999976E-03
-68.9000E-06,-189.9999976E-03
-68.6500E-06,-70.6532631E-03
-68.4000E-06,-189.9999976E-03
-68.1500E-06,-189.9999976E-03
-67.9000E-06,-189.9999976E-03
-67.6500E-06,-189.9999976E-03
-67.4000E-06,-189.9999976E-03
-67.1500E-06,-189.9999976E-03
-66.9000E-06,-189.9999976E-03
-66.6500E-06,-189.9999976E-03
-66.4000E-06,-189.9999976E-03
-66.1500E-06,-189.9999976E-03
-65.9000E-06,-359.5979888E-03
-65.6500E-06,-189.9999976E-03
-65.4000E-06,-391.0050243E-03
-65.1500E-06,-208.8442188E-03
-64.9000E-06,-391.0050243E-03
-64.6500E-06,-309.3467321E-03
-64.4000E-06,-189.9999976E-03
-64.1500E-06,-372.1608032E-03
-63.9000E-06,-391.0050243E-03
-63.6500E-06,-189.9999976E-03
-63.4000E-06,-391.0050243E-03
-63.1500E-06,-391.0050243E-03
-62.9000E-06,-391.0050243E-03
-62.6500E-06,-189.9999976E-03
-62.4000E-06,-259.0954754E-03
-62.1500E-06,-391.0050243E-03
-61.9000E-06,-391.0050243E-03
-61.6500E-06,-309.3467321E-03
-61.4000E-06,-189.9999976E-03
-61.1500E-06,-391.0050243E-03
-60.9000E-06,-189.9999976E-03
-60.6500E-06,-309.3467321E-03
-60.4000E-06,-259.0954754E-03
-60.1500E-06,-391.0050243E-03
-59.9000E-06,-221.4070331E-03
-59.6500E-06,-271.6582898E-03
-59.4000E-06,-189.9999976E-03
-59.1500E-06,-189.9999976E-03
-58.9000E-06,-189.9999976E-03
-58.6500E-06,-189.9999976E-03
-58.4000E-06,-189.9999976E-03
-58.1500E-06,-189.9999976E-03
-57.9000E-06,+11.0050291E-03
-57.6500E-06,-108.3417054E-03
-57.4000E-06,-120.9045198E-03
-57.1500E-06,+11.0050291E-03
-56.9000E-06,+11.0050291E-03
-56.6500E-06,+11.0050291E-03
-56.4000E-06,-189.9999976E-03
-56.1500E-06,+11.0050291E-03
-55.9000E-06,+11.0050291E-03
-55.6500E-06,+11.0050291E-03
-55.4000E-06,+11.0050291E-03
-55.1500E-06,-7.8391921E-03
-54.9000E-06,+42.4120646E-03
-54.6500E-06,+11.0050291E-03
-54.4000E-06,+11.0050291E-03
-54.1500E-06,+11.0050291E-03
-53.9000E-06,+11.0050291E-03
-53.6500E-06,+130.3517636E-03
-53.4000E-06,+11.0050291E-03
-53.1500E-06,+11.0050291E-03
-52.9000E-06,+11.0050291E-03
-52.6500E-06,+11.0050291E-03
-52.4000E-06,+11.0050291E-03
-52.1500E-06,+174.3216135E-03
-51.9000E-06,+42.4120646E-03
-51.6500E-06,+11.0050291E-03
-51.4000E-06,+11.0050291E-03
-51.1500E-06,-7.8391921E-03
-50.9000E-06,-20.4020064E-03
-50.6500E-06,-70.6532631E-03
-50.4000E-06,+11.0050291E-03
-50.1500E-06,-7.8391921E-03
-49.9000E-06,+11.0050291E-03
-49.6500E-06,-108.3417054E-03
-49.4000E-06,-58.0904487E-03
-49.1500E-06,+11.0050291E-03
-48.9000E-06,-189.9999976E-03
-48.6500E-06,-189.9999976E-03
-48.4000E-06,-58.0904487E-03
-48.1500E-06,-189.9999976E-03
-47.9000E-06,+11.0050291E-03
-47.6500E-06,-108.3417054E-03
-47.4000E-06,-189.9999976E-03
-47.1500E-06,-26.6834132E-03
-46.9000E-06,-158.5929621E-03
-46.6500E-06,-189.9999976E-03
-46.4000E-06,-189.9999976E-03
-46.1500E-06,+11.0050291E-03
-45.9000E-06,-189.9999976E-03
-45.6500E-06,+11.0050291E-03
-45.4000E-06,-120.9045198E-03
-45.1500E-06,+11.0050291E-03
-44.9000E-06,+11.0050291E-03
-44.6500E-06,+11.0050291E-03
-44.4000E-06,-58.0904487E-03
-44.1500E-06,+11.0050291E-03
-43.9000E-06,+11.0050291E-03
-43.6500E-06,+11.0050291E-03
-43.4000E-06,+11.0050291E-03
-43.1500E-06,+11.0050291E-03
-42.9000E-06,+11.0050291E-03
-42.6500E-06,+11.0050291E-03
-42.4000E-06,+11.0050291E-03
-42.1500E-06,+193.1658346E-03
-41.9000E-06,+42.4120646E-03
-41.6500E-06,+11.0050291E-03
-41.4000E-06,+11.0050291E-03
-41.1500E-06,+29.8492502E-03
-40.9000E-06,+11.0050291E-03
-40.6500E-06,+212.0100558E-03
-40.4000E-06,+11.0050291E-03
-40.1500E-06,+11.0050291E-03
-39.9000E-06,+11.0050291E-03
-39.6500E-06,+11.0050291E-03
-39.4000E-06,+212.0100558E-03
-39.1500E-06,+11.0050291E-03
-38.9000E-06,+180.6030203E-03
-38.6500E-06,+11.0050291E-03
-38.4000E-06,+11.0050291E-03
-38.1500E-06,+11.0050291E-03
-37.9000E-06,+11.0050291E-03
-37.6500E-06,+11.0050291E-03
-37.4000E-06,-58.0904487E-03
-37.1500E-06,-189.9999976E-03
-36.9000E-06,-158.5929621E-03
-36.6500E-06,-70.6532631E-03
-36.4000E-06,-120.9045198E-03
-36.1500E-06,-171.1557765E-03
-35.9000E-06,-189.9999976E-03
-35.6500E-06,-189.9999976E-03
-35.4000E-06,-189.9999976E-03
-35.1500E-06,-189.9999976E-03
-34.9000E-06,-189.9999976E-03
-34.6500E-06,-189.9999976E-03
-34.4000E-06,-189.9999976E-03
-34.1500E-06,-189.9999976E-03
-33.9000E-06,-359.5979888E-03
-33.6500E-06,-271.6582898E-03
-33.4000E-06,-189.9999976E-03
-33.1500E-06,-372.1608032E-03
-32.9000E-06,-221.4070331E-03
-32.6500E-06,-271.6582898E-03
-32.4000E-06,-259.0954754E-03
-32.1500E-06,-372.1608032E-03
-31.9000E-06,-221.4070331E-03
-31.6500E-06,-391.0050243E-03
-31.4000E-06,-321.9095465E-03
-31.1500E-06,-189.9999976E-03
-30.9000E-06,-189.9999976E-03
-30.6500E-06,-309.3467321E-03
-30.4000E-06,-189.9999976E-03
-30.1500E-06,-208.8442188E-03
-29.9000E-06,-189.9999976E-03
-29.6500E-06,-189.9999976E-03
-29.4000E-06,-189.9999976E-03
-29.1500E-06,-189.9999976E-03
-28.9000E-06,-158.5929621E-03
-28.6500E-06,-189.9999976E-03
-28.4000E-06,-58.0904487E-03
-28.1500E-06,-171.1557765E-03
-27.9000E-06,-158.5929621E-03
-27.6500E-06,+11.0050291E-03
-27.4000E-06,-58.0904487E-03
-27.1500E-06,+11.0050291E-03
-26.9000E-06,+11.0050291E-03
-26.6500E-06,+11.0050291E-03
-26.4000E-06,-120.9045198E-03
-26.1500E-06,-171.1557765E-03
-25.9000E-06,+11.0050291E-03
-25.6500E-06,+11.0050291E-03
-25.4000E-06,+11.0050291E-03
-25.1500E-06,+11.0050291E-03
-24.9000E-06,+180.6030203E-03
-24.6500E-06,+11.0050291E-03
-24.4000E-06,+11.0050291E-03
-24.1500E-06,+193.1658346E-03
-23.9000E-06,+42.4120646E-03
-23.6500E-06,+11.0050291E-03
-23.4000E-06,+11.0050291E-03
-23.1500E-06,+11.0050291E-03
-22.9000E-06,+42.4120646E-03
-22.6500E-06,-70.6532631E-03
-22.4000E-06,+11.0050291E-03
-22.1500E-06,+11.0050291E-03
-21.9000E-06,+11.0050291E-03
-21.6500E-06,+11.0050291E-03
-21.4000E-06,-120.9045198E-03
-21.1500E-06,+11.0050291E-03
-20.9000E-06,+11.0050291E-03
-20.6500E-06,-189.9999976E-03
-20.4000E-06,-189.9999976E-03
-20.1500E-06,-7.8391921E-03
-19.9000E-06,-189.9999976E-03
-19.6500E-06,-189.9999976E-03
-19.4000E-06,-120.9045198E-03
-19.1500E-06,+11.0050291E-03
-18.9000E-06,-20.4020064E-03
-18.6500E-06,-189.9999976E-03
-18.4000E-06,-120.9045198E-03
-18.1500E-06,-189.9999976E-03
-17.9000E-06,+11.0050291E-03
-17.6500E-06,-189.9999976E-03
-17.4000E-06,-189.9999976E-03
-17.1500E-06,-189.9999976E-03
-16.9000E-06,-189.9999976E-03
-16.6500E-06,-189.9999976E-03
-16.4000E-06,-120.9045198E-03
-16.1500E-06,-7.8391921E-03
-15.9000E-06,+11.0050291E-03
-15.6500E-06,+11.0050291E-03
-15.4000E-06,-58.0904487E-03
-15.1500E-06,+11.0050291E-03
-14.9000E-06,+11.0050291E-03
-14.6500E-06,+11.0050291E-03
-14.4000E-06,+11.0050291E-03
-14.1500E-06,+11.0050291E-03
-13.9000E-06,-158.5929621E-03
-13.6500E-06,+11.0050291E-03
-13.4000E-06,-189.9999976E-03
-13.1500E-06,+11.0050291E-03
-12.9000E-06,+11.0050291E-03
-12.6500E-06,-70.6532631E-03
-12.4000E-06,+11.0050291E-03
-12.1500E-06,-7.8391921E-03
-11.9000E-06,-20.4020064E-03
-11.6500E-06,-70.6532631E-03
-11.4000E-06,-189.9999976E-03
-11.1500E-06,-189.9999976E-03
-10.9000E-06,-189.9999976E-03
-10.6500E-06,-189.9999976E-03
-10.4000E-06,-259.0954754E-03
-10.1500E-06,-189.9999976E-03
-9.9000E-06,-391.0050243E-03
-9.6500E-06,-391.0050243E-03
-9.4000E-06,-391.0050243E-03
-9.1500E-06,-409.8492455E-03
-8.9000E-06,-422.4120598E-03
-8.6500E-06,-592.0100510E-03
-8.4000E-06,-592.0100510E-03
-8.1500E-06,-774.1708566E-03
-7.9000E-06,-793.0150777E-03
-7.6500E-06,-793.0150777E-03
-7.4000E-06,-924.9246266E-03
-7.1500E-06,-994.0201044E-03
-6.9000E-06,-994.0201044E-03
-6.6500E-06,-1.0756783966E+00
-6.4000E-06,-994.0201044E-03
-6.1500E-06,-1.0128643256E+00
-5.9000E-06,-1.1950251311E+00
-5.6500E-06,-1.1133668389E+00
-5.4000E-06,-1.1950251311E+00
-5.1500E-06,-1.1950251311E+00
-4.9000E-06,-1.1950251311E+00
-4.6500E-06,-1.1950251311E+00
-4.4000E-06,-1.0631155822E+00
-4.1500E-06,-1.1950251311E+00
-3.9000E-06,-1.1950251311E+00
-3.6500E-06,-994.0201044E-03
-3.4000E-06,-994.0201044E-03
-3.1500E-06,-811.8592989E-03
-2.9000E-06,-761.6080422E-03
-2.6500E-06,-673.6683432E-03
-2.4000E-06,-460.1005021E-03
-2.1500E-06,-208.8442188E-03
-1.9000E-06,-20.4020064E-03
-1.6500E-06,+212.0100558E-03
-1.4000E-06,+343.9196046E-03
-1.1500E-06,+614.0201092E-03
-900.0E-09,+846.4321714E-03
-650.0E-09,+1.0160301626E+00
-400.0E-09,+1.3489447381E+00
-150.0E-09,+1.6190452427E+00
+100.0E-09,+2.0210552961E+00
+350.0E-09,+2.3414070573E+00
+600.0E-09,+2.6240703762E+00
+850.0E-09,+3.0260804296E+00
+1.1000E-06,+3.4280904830E+00
+1.3500E-06,+3.7484422442E+00
+1.6000E-06,+3.9620100852E+00
+1.8500E-06,+4.2509548109E+00
+2.1000E-06,+4.6341206431E+00
+2.3500E-06,+5.0361306965E+00
+2.6000E-06,+5.3690452721E+00
+2.8500E-06,+5.6579899978E+00
+3.1000E-06,+5.8401508033E+00
+3.3500E-06,+6.1228141222E+00
+3.6000E-06,+6.5750754323E+00
+3.8500E-06,+6.8263317157E+00
+4.1000E-06,+6.8765829723E+00
+4.3500E-06,+7.0461809635E+00
+4.6000E-06,+7.2471859902E+00
+4.8500E-06,+7.2660302114E+00
+5.1000E-06,+7.4481910169E+00
+5.3500E-06,+7.4481910169E+00
+5.6000E-06,+7.5172864947E+00
+5.8500E-06,+7.4481910169E+00
+6.1000E-06,+7.4481910169E+00
+6.3500E-06,+7.2471859902E+00
+6.6000E-06,+7.2471859902E+00
+6.8500E-06,+6.8640201580E+00
+7.1000E-06,+6.8451759368E+00
+7.3500E-06,+6.5625126179E+00
+7.6000E-06,+6.2421608567E+00
+7.8500E-06,+6.0411558300E+00
+8.1000E-06,+5.6391457766E+00
+8.3500E-06,+5.2371357232E+00
+8.6000E-06,+4.8351256698E+00
+8.8500E-06,+4.4519598376E+00
+9.1000E-06,+4.0311055630E+00
+9.3500E-06,+3.6290955096E+00
+9.6000E-06,+3.2270854563E+00
+9.8500E-06,+2.6240703762E+00
+10.1000E-06,+2.2220603228E+00
+10.3500E-06,+1.7383919772E+00
+10.6000E-06,+1.2170351893E+00
+10.8500E-06,+614.0201092E-03
+11.1000E-06,+212.0100558E-03
+11.3500E-06,-391.0050243E-03
+11.6000E-06,-723.9195999E-03
+11.8500E-06,-1.0128643256E+00
+12.1000E-06,-1.5970351845E+00
+12.3500E-06,-1.9990452379E+00
+12.6000E-06,-2.2691457424E+00
+12.8500E-06,-2.6209045392E+00
+13.1000E-06,-3.0040703714E+00
+13.3500E-06,-3.2050753981E+00
+13.6000E-06,-3.6070854515E+00
+13.8500E-06,-3.6070854515E+00
+14.1000E-06,-3.8080904782E+00
+14.3500E-06,-4.0090955049E+00
+14.6000E-06,-4.2101005316E+00
+14.8500E-06,-4.0090955049E+00
+15.1000E-06,-4.0405025404E+00
+15.3500E-06,-4.0090955049E+00
+15.6000E-06,-4.0090955049E+00
+15.8500E-06,-3.8080904782E+00
+16.1000E-06,-3.6384924870E+00
+16.3500E-06,-3.5254271593E+00
+16.6000E-06,-3.2050753981E+00
+16.8500E-06,-3.1673869558E+00
+17.1000E-06,-2.6020603180E+00
+17.3500E-06,-2.2817085568E+00
+17.6000E-06,-1.9990452379E+00
+17.8500E-06,-1.7791959900E+00
+18.1000E-06,-1.1950251311E+00
+18.3500E-06,-994.0201044E-03
+18.6000E-06,-391.0050243E-03
+18.8500E-06,-171.1557765E-03
+19.1000E-06,+243.4170913E-03
+19.3500E-06,+733.3668437E-03
+19.6000E-06,+1.0160301626E+00
+19.8500E-06,+1.4368844371E+00
+20.1000E-06,+2.0210552961E+00
+20.3500E-06,+2.2220603228E+00
+20.6000E-06,+2.7559799250E+00
+20.8500E-06,+3.0260804296E+00
+21.1000E-06,+3.2584924918E+00
+21.3500E-06,+3.6290955096E+00
+21.6000E-06,+3.8301005363E+00
+21.8500E-06,+4.2321105897E+00
+22.1000E-06,+4.4017085809E+00
+22.3500E-06,+4.6341206431E+00
+22.6000E-06,+4.8351256698E+00
+22.8500E-06,+5.0172864754E+00
+23.1000E-06,+5.0361306965E+00
+23.3500E-06,+5.0361306965E+00
+23.6000E-06,+5.0361306965E+00
+23.8500E-06,+5.0361306965E+00
+24.1000E-06,+5.0675377321E+00
+24.3500E-06,+5.1177889887E+00
+24.6000E-06,+5.0361306965E+00
+24.8500E-06,+4.8539698910E+00
+25.1000E-06,+4.8037186343E+00
+25.3500E-06,+4.6341206431E+00
+25.6000E-06,+4.4331156164E+00
+25.8500E-06,+4.4142713953E+00
+26.1000E-06,+4.0311055630E+00
+26.3500E-06,+3.8301005363E+00
+26.6000E-06,+3.6290955096E+00
+26.8500E-06,+3.2459296774E+00
+27.1000E-06,+3.0260804296E+00
+27.3500E-06,+2.8250754029E+00
+27.6000E-06,+2.4230653495E+00
+27.8500E-06,+2.2220603228E+00
+28.1000E-06,+2.0210552961E+00
+28.3500E-06,+1.6190452427E+00
+28.6000E-06,+1.5499497648E+00
+28.8500E-06,+1.0348743837E+00
+29.1000E-06,+846.4321714E-03
+29.3500E-06,+614.0201092E-03
+29.6000E-06,+413.0150825E-03
+29.8500E-06,+193.1658346E-03
+30.1000E-06,-158.5929621E-03
+30.3500E-06,-271.6582898E-03
+30.6000E-06,-522.9145732E-03
+30.8500E-06,-793.0150777E-03
+31.1000E-06,-793.0150777E-03
+31.3500E-06,-994.0201044E-03
+31.6000E-06,-1.1950251311E+00
+31.8500E-06,-1.1950251311E+00
+32.1000E-06,-1.3960301578E+00
+32.3500E-06,-1.3960301578E+00
+32.6000E-06,-1.4651256356E+00
+32.8500E-06,-1.5970351845E+00
+33.1000E-06,-1.5970351845E+00
+33.3500E-06,-1.7980402112E+00
+33.6000E-06,-1.7980402112E+00
+33.8500E-06,-1.7791959900E+00
+34.1000E-06,-1.6284422200E+00
+34.3500E-06,-1.5970351845E+00
+34.6000E-06,-1.5970351845E+00
+34.8500E-06,-1.6158794057E+00
+35.1000E-06,-1.5970351845E+00
+35.3500E-06,-1.5153768923E+00
+35.6000E-06,-1.4651256356E+00
+35.8500E-06,-1.3960301578E+00
+36.1000E-06,-1.1950251311E+00
+36.3500E-06,-1.1133668389E+00
+36.6000E-06,-994.0201044E-03
+36.8500E-06,-975.1758832E-03
+37.1000E-06,-793.0150777E-03
+37.3500E-06,-673.6683432E-03
+37.6000E-06,-522.9145732E-03
+37.8500E-06,-372.1608032E-03
+38.1000E-06,-189.9999976E-03
+38.3500E-06,+11.0050291E-03
+38.6000E-06,+212.0100558E-03
+38.8500E-06,+413.0150825E-03
+39.1000E-06,+413.0150825E-03
+39.3500E-06,+614.0201092E-03
+39.6000E-06,+815.0251359E-03
+39.8500E-06,+1.1981909681E+00
+40.1000E-06,+1.3866331805E+00
+40.3500E-06,+1.4996985082E+00
+40.6000E-06,+1.6881407205E+00
+40.8500E-06,+2.0210552961E+00
+41.1000E-06,+2.2220603228E+00
+41.3500E-06,+2.4230653495E+00
+41.6000E-06,+2.6240703762E+00
+41.8500E-06,+2.8250754029E+00
+42.1000E-06,+3.0260804296E+00
+42.3500E-06,+3.2270854563E+00
+42.6000E-06,+3.4280904830E+00
+42.8500E-06,+3.6290955096E+00
+43.1000E-06,+3.7986935008E+00
+43.3500E-06,+4.0311055630E+00
+43.6000E-06,+4.2321105897E+00
+43.8500E-06,+4.4331156164E+00
+44.1000E-06,+4.4331156164E+00
+44.3500E-06,+4.7157789353E+00
+44.6000E-06,+4.7660301920E+00
+44.8500E-06,+4.8351256698E+00
+45.1000E-06,+5.0361306965E+00
+45.3500E-06,+4.9544724043E+00
+45.6000E-06,+5.0361306965E+00
+45.8500E-06,+5.0361306965E+00
+46.1000E-06,+5.2371357232E+00
+46.3500E-06,+5.1177889887E+00
+46.6000E-06,+5.2371357232E+00
+46.8500E-06,+5.0361306965E+00
+47.1000E-06,+5.0361306965E+00
+47.3500E-06,+5.0361306965E+00
+47.6000E-06,+4.8351256698E+00
+47.8500E-06,+4.6341206431E+00
+48.1000E-06,+4.6027136076E+00
+48.3500E-06,+4.2321105897E+00
+48.6000E-06,+4.1630151119E+00
+48.8500E-06,+3.8301005363E+00
+49.1000E-06,+3.6290955096E+00
+49.3500E-06,+3.4280904830E+00
+49.6000E-06,+3.0951759074E+00
+49.8500E-06,+2.8250754029E+00
+50.1000E-06,+2.6240703762E+00
+50.3500E-06,+2.2220603228E+00
+50.6000E-06,+1.8891457472E+00
+50.8500E-06,+1.6002010215E+00
+51.1000E-06,+1.2170351893E+00
+51.3500E-06,+934.3718704E-03
+51.6000E-06,+544.9246313E-03
+51.8500E-06,+212.0100558E-03
+52.1000E-06,+11.0050291E-03
+52.3500E-06,-391.0050243E-03
+52.6000E-06,-723.9195999E-03
+52.8500E-06,-1.1761809099E+00
+53.1000E-06,-1.3960301578E+00
+53.3500E-06,-1.4776884500E+00
+53.6000E-06,-1.7980402112E+00
+53.8500E-06,-2.2000502646E+00
+54.1000E-06,-2.2314573001E+00
+54.3500E-06,-2.6020603180E+00
+54.6000E-06,-2.8030653447E+00
+54.8500E-06,-2.9852261502E+00
+55.1000E-06,-3.0040703714E+00
+55.3500E-06,-3.2050753981E+00
+55.6000E-06,-3.3369849470E+00
+55.8500E-06,-3.4060804248E+00
+56.1000E-06,-3.4060804248E+00
+56.3500E-06,-3.5254271593E+00
+56.6000E-06,-3.4060804248E+00
+56.8500E-06,-3.3872362036E+00
+57.1000E-06,-3.2050753981E+00
+57.3500E-06,-3.2050753981E+00
+57.6000E-06,-3.0040703714E+00
+57.8500E-06,-3.0040703714E+00
+58.1000E-06,-2.8030653447E+00
+58.3500E-06,-2.6020603180E+00
+58.6000E-06,-2.4701507691E+00
+58.8500E-06,-2.2000502646E+00
+59.1000E-06,-1.9990452379E+00
+59.3500E-06,-1.7980402112E+00
+59.6000E-06,-1.5279397067E+00
+59.8500E-06,-1.1950251311E+00
+60.1000E-06,-994.0201044E-03
+60.3500E-06,-793.0150777E-03
+60.6000E-06,-522.9145732E-03
+60.8500E-06,-189.9999976E-03
+61.1000E-06,+11.0050291E-03
+61.3500E-06,+413.0150825E-03
+61.6000E-06,+614.0201092E-03
+61.8500E-06,+815.0251359E-03
+62.1000E-06,+1.0474371981E+00
+62.3500E-06,+1.4180402160E+00
+62.6000E-06,+1.6190452427E+00
+62.8500E-06,+1.6378894638E+00
+63.1000E-06,+2.0210552961E+00
+63.3500E-06,+2.3414070573E+00
+63.6000E-06,+2.4230653495E+00
+63.8500E-06,+2.4230653495E+00
+64.1000E-06,+2.6240703762E+00
+64.3500E-06,+2.8250754029E+00
+64.6000E-06,+2.8250754029E+00
+64.8500E-06,+3.0260804296E+00
+65.1000E-06,+2.8564824384E+00
+65.3500E-06,+3.0260804296E+00
+65.6000E-06,+3.0951759074E+00
+65.8500E-06,+3.0260804296E+00
+66.1000E-06,+3.0260804296E+00
+66.3500E-06,+3.0260804296E+00
+66.6000E-06,+3.0260804296E+00
+66.8500E-06,+3.0260804296E+00
+67.1000E-06,+2.8564824384E+00
+67.3500E-06,+2.8250754029E+00
+67.6000E-06,+2.6240703762E+00
+67.8500E-06,+2.6240703762E+00
+68.1000E-06,+2.6240703762E+00
+68.3500E-06,+2.6240703762E+00
+68.6000E-06,+2.4230653495E+00
+68.8500E-06,+2.4230653495E+00
+69.1000E-06,+2.2220603228E+00
+69.3500E-06,+2.0210552961E+00
+69.6000E-06,+1.8891457472E+00
+69.8500E-06,+2.0022110749E+00
+70.1000E-06,+1.6190452427E+00
+70.3500E-06,+1.6190452427E+00
+70.6000E-06,+1.4180402160E+00
+70.8500E-06,+1.4180402160E+00
+71.1000E-06,+1.3866331804E+00
+71.3500E-06,+1.2170351893E+00
+71.6000E-06,+1.2170351893E+00
+71.8500E-06,+1.0160301626E+00
+72.1000E-06,+1.0160301626E+00
+72.3500E-06,+896.6834281E-03
+72.6000E-06,+815.0251359E-03
+72.8500E-06,+815.0251359E-03
+73.1000E-06,+645.4271447E-03
+73.3500E-06,+695.6784014E-03
+73.6000E-06,+614.0201092E-03
+73.8500E-06,+614.0201092E-03
+74.1000E-06,+614.0201092E-03
+74.3500E-06,+413.0150825E-03
+74.6000E-06,+614.0201092E-03
+74.8500E-06,+413.0150825E-03
+75.1000E-06,+413.0150825E-03
+75.3500E-06,+413.0150825E-03
+75.6000E-06,+413.0150825E-03
+75.8500E-06,+394.1708613E-03
+76.1000E-06,+212.0100558E-03
+76.3500E-06,+293.6683480E-03
+76.6000E-06,+212.0100558E-03
+76.8500E-06,+212.0100558E-03
+77.1000E-06,+180.6030203E-03
+77.3500E-06,+92.6633213E-03
+77.6000E-06,+80.1005069E-03
+77.8500E-06,+11.0050291E-03
+78.1000E-06,-189.9999976E-03
+78.3500E-06,-189.9999976E-03
+78.6000E-06,-259.0954754E-03
+78.8500E-06,-189.9999976E-03
+79.1000E-06,-391.0050243E-03
+79.3500E-06,-391.0050243E-03
+79.6000E-06,-592.0100510E-03
+79.8500E-06,-592.0100510E-03
+80.1000E-06,-761.6080422E-03
+80.3500E-06,-793.0150777E-03
+80.6000E-06,-862.1105555E-03
+80.8500E-06,-994.0201044E-03
+81.1000E-06,-994.0201044E-03
+81.3500E-06,-994.0201044E-03
+81.6000E-06,-1.1950251311E+00
+81.8500E-06,-1.0128643256E+00
+82.1000E-06,-1.3646231223E+00
+82.3500E-06,-1.3143718656E+00
+82.6000E-06,-1.3960301578E+00
+82.8500E-06,-1.3960301578E+00
+83.1000E-06,-1.5656281490E+00
+83.3500E-06,-1.5153768923E+00
+83.6000E-06,-1.5970351845E+00
+83.8500E-06,-1.5781909634E+00
+84.1000E-06,-1.5970351845E+00
+84.3500E-06,-1.5970351845E+00
+84.6000E-06,-1.4651256356E+00
+84.8500E-06,-1.3960301578E+00
+85.1000E-06,-1.3960301578E+00
+85.3500E-06,-1.3960301578E+00
+85.6000E-06,-1.3960301578E+00
+85.8500E-06,-1.1950251311E+00
+86.1000E-06,-1.0254271399E+00
+86.3500E-06,-994.0201044E-03
+86.6000E-06,-793.0150777E-03
+86.8500E-06,-793.0150777E-03
+87.1000E-06,-761.6080422E-03
+87.3500E-06,-592.0100510E-03
+87.6000E-06,-391.0050243E-03
+87.8500E-06,-189.9999976E-03
+88.1000E-06,-189.9999976E-03
+88.3500E-06,+11.0050291E-03
+88.6000E-06,+11.0050291E-03
+88.8500E-06,+212.0100558E-03
+89.1000E-06,+413.0150825E-03
+89.3500E-06,+614.0201092E-03
+89.6000E-06,+745.9296581E-03
+89.8500E-06,+815.0251359E-03
+90.1000E-06,+846.4321714E-03
+90.3500E-06,+896.6834281E-03
+90.6000E-06,+1.1479397115E+00
+90.8500E-06,+1.1981909681E+00
+91.1000E-06,+1.3866331804E+00
+91.3500E-06,+1.2170351893E+00
+91.6000E-06,+1.4871356938E+00
+91.8500E-06,+1.4368844371E+00
+92.1000E-06,+1.6190452427E+00
+92.3500E-06,+1.6190452427E+00
+92.6000E-06,+1.4180402160E+00
+92.8500E-06,+1.4368844371E+00
+93.1000E-06,+1.4494472515E+00
+93.3500E-06,+1.5373869505E+00
+93.6000E-06,+1.4180402160E+00
+93.8500E-06,+1.4180402160E+00
+94.1000E-06,+1.2170351893E+00
+94.3500E-06,+1.2170351893E+00
+94.6000E-06,+1.0160301626E+00
+94.8500E-06,+1.0160301626E+00
+95.1000E-06,+815.0251359E-03
+95.3500E-06,+815.0251359E-03
+95.6000E-06,+614.0201092E-03
+95.8500E-06,+413.0150825E-03
+96.1000E-06,+413.0150825E-03
+96.3500E-06,+212.0100558E-03
+96.6000E-06,+11.0050291E-03
+96.8500E-06,-7.8391921E-03
+97.1000E-06,-221.4070332E-03
+97.3500E-06,-391.0050243E-03
+97.6000E-06,-522.9145732E-03
+97.8500E-06,-592.0100510E-03
+98.1000E-06,-994.0201044E-03
+98.3500E-06,-994.0201044E-03
+98.6000E-06,-1.1259296533E+00
+98.8500E-06,-1.2138693522E+00
+99.1000E-06,-1.3960301578E+00
+99.3500E-06,-1.3960301578E+00
+99.6000E-06,-1.6661306623E+00
+99.8500E-06,-1.7980402112E+00
+100.1000E-06,-1.7980402112E+00
+100.3500E-06,-1.9990452379E+00
+100.6000E-06,-1.9299497601E+00
+100.8500E-06,-1.9990452379E+00
+101.1000E-06,-1.9990452379E+00
+101.3500E-06,-1.9990452379E+00
+101.6000E-06,-2.2000502646E+00
+101.8500E-06,-2.2000502646E+00
+102.1000E-06,-2.1686432291E+00
+102.3500E-06,-2.2000502646E+00
+102.6000E-06,-2.0681407157E+00
+102.8500E-06,-1.9990452379E+00
+103.1000E-06,-1.9990452379E+00
+103.3500E-06,-1.9990452379E+00
+103.6000E-06,-1.9990452379E+00
+103.8500E-06,-1.8168844323E+00
+104.1000E-06,-1.9990452379E+00
+104.3500E-06,-1.8796985034E+00
+104.6000E-06,-1.7980402112E+00
+104.8500E-06,-1.7791959901E+00
+105.1000E-06,-1.6284422200E+00
+105.3500E-06,-1.4776884500E+00
+105.6000E-06,-1.3960301578E+00
+105.8500E-06,-1.3960301578E+00
+106.1000E-06,-1.3960301578E+00
+106.3500E-06,-1.3960301578E+00
+106.6000E-06,-1.1950251311E+00
+106.8500E-06,-1.1950251311E+00
+107.1000E-06,-1.0254271400E+00
+107.3500E-06,-994.0201044E-03
+107.6000E-06,-994.0201044E-03
+107.8500E-06,-975.1758833E-03
+108.1000E-06,-962.6130689E-03
+108.3500E-06,-874.6733699E-03
+108.6000E-06,-924.9246266E-03
+108.8500E-06,-811.8592988E-03
+109.1000E-06,-994.0201044E-03
+109.3500E-06,-793.0150777E-03
+109.6000E-06,-793.0150777E-03
+109.8500E-06,-975.1758833E-03
+110.1000E-06,-793.0150777E-03
+110.3500E-06,-874.6733699E-03
+110.6000E-06,-793.0150777E-03
+110.8500E-06,-975.1758833E-03
+111.1000E-06,-994.0201044E-03
+111.3500E-06,-994.0201044E-03
+111.6000E-06,-994.0201044E-03
+111.8500E-06,-994.0201044E-03
+112.1000E-06,-1.1950251311E+00
+112.3500E-06,-1.1950251311E+00
+112.6000E-06,-1.1950251311E+00
+112.8500E-06,-1.1950251311E+00
+113.1000E-06,-1.3960301578E+00
+113.3500E-06,-1.2766834233E+00
+113.6000E-06,-1.3960301578E+00
+113.8500E-06,-1.3960301578E+00
+114.1000E-06,-1.5970351845E+00
+114.3500E-06,-1.5970351845E+00
+114.6000E-06,-1.5970351845E+00
+114.8500E-06,-1.5970351845E+00
+115.1000E-06,-1.7980402112E+00
+115.3500E-06,-1.6786934767E+00
+115.6000E-06,-1.6661306623E+00
+115.8500E-06,-1.7980402112E+00
+116.1000E-06,-1.7980402112E+00
+116.3500E-06,-1.7980402112E+00
+116.6000E-06,-1.8671356890E+00
+116.8500E-06,-1.9990452379E+00
+117.1000E-06,-1.7980402112E+00
+117.3500E-06,-1.7980402112E+00
+117.6000E-06,-1.9299497601E+00
+117.8500E-06,-1.8168844323E+00
+118.1000E-06,-1.9676382024E+00
+118.3500E-06,-1.9990452379E+00
+118.6000E-06,-1.7980402112E+00
+118.8500E-06,-1.8168844323E+00
+119.1000E-06,-1.9676382023E+00
+119.3500E-06,-1.9990452379E+00
+119.6000E-06,-1.8671356890E+00
+119.8500E-06,-1.8168844323E+00
+120.1000E-06,-1.9676382023E+00
+120.3500E-06,-1.9173869457E+00
+120.6000E-06,-1.7980402112E+00
+120.8500E-06,-1.9990452379E+00
+121.1000E-06,-1.7980402112E+00
+121.3500E-06,-1.7980402112E+00
+121.6000E-06,-1.7980402112E+00
+121.8500E-06,-1.9802010168E+00
+122.1000E-06,-1.7980402112E+00
+122.3500E-06,-1.7980402112E+00
+122.6000E-06,-1.8671356890E+00
+122.8500E-06,-1.7980402112E+00
+123.1000E-06,-1.8294472468E+00
+123.3500E-06,-1.8796985034E+00
+123.6000E-06,-1.9990452379E+00
+123.8500E-06,-1.9990452379E+00
+124.1000E-06,-1.9990452379E+00
+124.3500E-06,-1.9990452379E+00
+124.6000E-06,-1.9990452379E+00
+124.8500E-06,-1.9990452379E+00
+125.1000E-06,-1.9990452379E+00
+125.3500E-06,-1.9990452379E+00
+125.6000E-06,-1.9299497601E+00
+125.8500E-06,-1.9990452379E+00
+126.1000E-06,-1.9676382023E+00
+126.3500E-06,-1.9990452379E+00
+126.6000E-06,-1.9990452379E+00
+126.8500E-06,-1.9990452379E+00
+127.1000E-06,-1.9990452379E+00
+127.3500E-06,-2.0807035301E+00
+127.6000E-06,-1.9990452379E+00
+127.8500E-06,-1.9990452379E+00
+128.1000E-06,-1.9990452379E+00
+128.3500E-06,-2.2000502646E+00
+128.6000E-06,-2.0618593090E+00
+128.8500E-06,-1.9802010168E+00
+129.1000E-06,-1.9990452379E+00
+129.3500E-06,-1.9990452379E+00
+129.6000E-06,-1.9990452379E+00
+129.8500E-06,-1.9802010168E+00
+130.1000E-06,-1.7980402112E+00
+130.3500E-06,-1.7980402112E+00
+130.6000E-06,-1.7980402112E+00
+130.8500E-06,-1.9802010168E+00
+131.1000E-06,-1.9676382023E+00
+131.3500E-06,-1.9990452379E+00
+131.6000E-06,-1.8671356890E+00
+131.8500E-06,-1.9802010168E+00
+132.1000E-06,-1.9676382023E+00
+132.3500E-06,-1.9173869457E+00
+132.6000E-06,-1.7980402112E+00
+132.8500E-06,-1.7980402112E+00
+133.1000E-06,-1.7980402112E+00
+133.3500E-06,-1.7980402112E+00
+133.6000E-06,-1.5970351845E+00
+133.8500E-06,-1.5970351845E+00
+134.1000E-06,-1.7666331756E+00
+134.3500E-06,-1.6786934767E+00
+134.6000E-06,-1.7980402112E+00
+134.8500E-06,-1.7791959901E+00
+135.1000E-06,-1.7980402112E+00
+135.3500E-06,-1.6786934767E+00
+135.6000E-06,-1.7980402112E+00
+135.8500E-06,-1.7980402112E+00
+136.1000E-06,-1.7980402112E+00
+136.3500E-06,-1.7980402112E+00
+136.6000E-06,-1.9990452379E+00
+136.8500E-06,-1.9802010168E+00
+137.1000E-06,-1.9990452379E+00
+137.3500E-06,-1.9173869457E+00
+137.6000E-06,-1.9990452379E+00
+137.8500E-06,-1.9990452379E+00
+138.1000E-06,-1.9990452379E+00
+138.3500E-06,-1.9173869457E+00
+138.6000E-06,-2.2000502646E+00
+138.8500E-06,-2.2000502646E+00
+139.1000E-06,-2.2000502646E+00
+139.3500E-06,-2.2000502646E+00
+139.6000E-06,-2.2000502646E+00
+139.8500E-06,-2.2000502646E+00
+140.1000E-06,-2.2000502646E+00
+140.3500E-06,-2.4010552913E+00
+140.6000E-06,-2.4010552913E+00
+140.8500E-06,-2.4010552913E+00
+141.1000E-06,-2.4010552913E+00
+141.3500E-06,-2.4010552913E+00
+141.6000E-06,-2.6020603180E+00
+141.8500E-06,-2.6020603180E+00
+142.1000E-06,-2.6020603180E+00
+142.3500E-06,-2.6020603180E+00
+142.6000E-06,-2.6020603180E+00
+142.8500E-06,-2.6020603180E+00
+143.1000E-06,-2.6020603180E+00
+143.3500E-06,-2.6020603180E+00
+143.6000E-06,-2.8030653447E+00
+143.8500E-06,-2.6020603180E+00
+144.1000E-06,-2.5706532824E+00
+144.3500E-06,-2.6020603180E+00
+144.6000E-06,-2.6020603180E+00
+144.8500E-06,-2.6020603180E+00
+145.1000E-06,-2.6020603180E+00
+145.3500E-06,-2.6020603180E+00
+145.6000E-06,-2.4701507691E+00
+145.8500E-06,-2.4010552913E+00
+146.1000E-06,-2.4324623269E+00
+146.3500E-06,-2.4827135835E+00
+146.6000E-06,-2.4010552913E+00
+146.8500E-06,-2.4010552913E+00
+147.1000E-06,-2.4010552913E+00
+147.3500E-06,-2.4010552913E+00
+147.6000E-06,-2.4010552913E+00
+147.8500E-06,-2.2188944857E+00
+148.1000E-06,-2.4010552913E+00
+148.3500E-06,-2.4010552913E+00
+148.6000E-06,-2.2000502646E+00
+148.8500E-06,-2.2000502646E+00
+149.1000E-06,-2.2000502646E+00
+149.3500E-06,-2.3193969991E+00
+149.6000E-06,-2.2000502646E+00
+149.8500E-06,-2.2000502646E+00
+150.1000E-06,-2.0304522735E+00
+150.3500E-06,-2.2000502646E+00
+150.6000E-06,-1.9990452379E+00
+150.8500E-06,-2.2000502646E+00
+151.1000E-06,-2.2000502646E+00
+151.3500E-06,-2.2000502646E+00
+151.6000E-06,-2.0681407157E+00
+151.8500E-06,-2.0178894590E+00
+152.1000E-06,-2.2000502646E+00
+152.3500E-06,-2.1183919724E+00
+152.6000E-06,-2.2000502646E+00
+152.8500E-06,-2.0178894590E+00
+153.1000E-06,-2.2000502646E+00
+153.3500E-06,-2.2000502646E+00
+153.6000E-06,-2.2000502646E+00
+153.8500E-06,-2.2000502646E+00
+154.1000E-06,-2.2000502646E+00
+154.3500E-06,-2.2000502646E+00
+154.6000E-06,-2.2000502646E+00
+154.8500E-06,-2.2000502646E+00
+155.1000E-06,-2.2314573002E+00
+155.3500E-06,-2.2817085568E+00
+155.6000E-06,-2.2691457424E+00
+155.8500E-06,-2.2000502646E+00
+156.1000E-06,-2.4010552913E+00
+156.3500E-06,-2.3193969990E+00
+156.6000E-06,-2.4010552913E+00
+156.8500E-06,-2.4010552913E+00
+157.1000E-06,-2.4010552913E+00
+157.3500E-06,-2.4010552913E+00
+157.6000E-06,-2.4010552913E+00
+157.8500E-06,-2.3822110702E+00
+158.1000E-06,-2.3696482557E+00
+158.3500E-06,-2.2000502646E+00
+158.6000E-06,-2.2000502646E+00
+158.8500E-06,-2.2188944857E+00
+159.1000E-06,-2.3696482557E+00
+159.3500E-06,-2.2000502646E+00
+159.6000E-06,-2.2000502646E+00
+159.8500E-06,-2.2000502646E+00
+160.1000E-06,-2.2000502646E+00
+160.3500E-06,-2.2000502646E+00
+160.6000E-06,-2.2000502646E+00
+160.8500E-06,-2.0178894590E+00
+161.1000E-06,-1.9990452379E+00
+161.3500E-06,-2.0807035301E+00
+161.6000E-06,-2.0681407157E+00
+161.8500E-06,-1.9990452379E+00
+162.1000E-06,-2.0304522735E+00
+162.3500E-06,-1.7980402112E+00
+162.6000E-06,-1.9990452379E+00
+162.8500E-06,-1.9990452379E+00
+163.1000E-06,-1.9990452379E+00
+163.3500E-06,-1.9990452379E+00
+163.6000E-06,-1.9299497601E+00
+163.8500E-06,-1.9990452379E+00
+164.1000E-06,-1.9990452379E+00
+164.3500E-06,-1.9173869456E+00
+164.6000E-06,-1.7980402112E+00
+164.8500E-06,-1.9990452379E+00
+165.1000E-06,-1.9990452379E+00
+165.3500E-06,-1.9990452379E+00
+165.6000E-06,-1.9299497601E+00
+165.8500E-06,-1.8168844323E+00
+166.1000E-06,-1.9990452379E+00
+166.3500E-06,-1.9990452379E+00
+166.6000E-06,-1.9990452379E+00
+166.8500E-06,-1.9990452379E+00
+167.1000E-06,-2.1686432290E+00
+167.3500E-06,-1.9990452379E+00
+167.6000E-06,-1.9990452379E+00
+167.8500E-06,-2.2000502646E+00
+168.1000E-06,-2.1686432290E+00
+168.3500E-06,-2.2000502646E+00
+168.6000E-06,-2.2000502646E+00
+168.8500E-06,-2.2000502646E+00
+169.1000E-06,-2.2000502646E+00
+169.3500E-06,-2.4010552913E+00
+169.6000E-06,-2.3319598135E+00
+169.8500E-06,-2.3822110702E+00
+170.1000E-06,-2.4010552913E+00
+170.3500E-06,-2.4010552913E+00
+170.6000E-06,-2.4010552913E+00
+170.8500E-06,-2.4010552913E+00
+171.1000E-06,-2.4010552913E+00
+171.3500E-06,-2.4010552913E+00
+171.6000E-06,-2.6020603180E+00
+171.8500E-06,-2.5832160969E+00
+172.1000E-06,-2.4324623269E+00
+172.3500E-06,-2.5204020257E+00
+172.6000E-06,-2.4701507691E+00
+172.8500E-06,-2.5832160969E+00
+173.1000E-06,-2.4010552913E+00
+173.3500E-06,-2.4827135836E+00
+173.6000E-06,-2.6020603180E+00
+173.8500E-06,-2.4198995124E+00
+174.1000E-06,-2.4010552913E+00
+174.3500E-06,-2.5204020257E+00
+174.6000E-06,-2.6020603180E+00
+174.8500E-06,-2.5832160969E+00
+175.1000E-06,-2.6020603180E+00
+175.3500E-06,-2.4827135836E+00
+175.6000E-06,-2.4010552913E+00
+175.8500E-06,-2.4010552913E+00
+176.1000E-06,-2.4010552913E+00
+176.3500E-06,-2.4010552913E+00
+176.6000E-06,-2.2691457424E+00
+176.8500E-06,-2.4010552913E+00
+177.1000E-06,-2.3696482557E+00
+177.3500E-06,-2.2000502646E+00
+177.6000E-06,-2.3319598135E+00
+177.8500E-06,-2.2000502646E+00
+178.1000E-06,-2.2000502646E+00
+178.3500E-06,-2.2000502646E+00
+178.6000E-06,-2.2000502646E+00
+178.8500E-06,-2.2000502646E+00
+179.1000E-06,-2.2000502646E+00
+179.3500E-06,-2.3193969990E+00
+179.6000E-06,-2.2000502646E+00
+179.8500E-06,-2.2000502646E+00
+180.1000E-06,-2.2000502646E+00
+180.3500E-06,-2.0807035302E+00
+180.6000E-06,-2.2000502646E+00
+180.8500E-06,-2.2000502646E+00
+181.1000E-06,-2.2000502646E+00
+181.3500E-06,-2.2000502646E+00
+181.6000E-06,-2.2000502646E+00
+181.8500E-06,-2.4010552913E+00
+182.1000E-06,-2.3696482557E+00
+182.3500E-06,-2.4010552913E+00
+182.6000E-06,-2.4010552913E+00
+182.8500E-06,-2.3822110702E+00
+183.1000E-06,-2.2000502646E+00
+183.3500E-06,-2.3193969990E+00
+183.6000E-06,-2.3319598135E+00
+183.8500E-06,-2.4010552913E+00
+184.1000E-06,-2.4010552913E+00
+184.3500E-06,-2.4010552913E+00
+184.6000E-06,-2.4010552913E+00
+184.8500E-06,-2.4010552913E+00
+185.1000E-06,-2.4010552913E+00
+185.3500E-06,-2.5204020257E+00
+185.6000E-06,-2.4010552913E+00
+185.8500E-06,-2.5832160969E+00
+186.1000E-06,-2.4324623269E+00
+186.3500E-06,-2.6020603180E+00
+186.6000E-06,-2.5329648402E+00
+186.8500E-06,-2.4010552913E+00
+187.1000E-06,-2.4010552913E+00
+187.3500E-06,-2.4010552913E+00
+187.6000E-06,-2.5329648402E+00
+187.8500E-06,-2.4010552913E+00
+188.1000E-06,-2.5706532824E+00
+188.3500E-06,-2.2817085569E+00
+188.6000E-06,-2.4010552913E+00
+188.8500E-06,-2.2188944857E+00
+189.1000E-06,-2.2000502646E+00
+189.3500E-06,-2.2000502646E+00
+189.6000E-06,-2.2000502646E+00
+189.8500E-06,-2.2000502646E+00
+190.1000E-06,-2.2000502646E+00
+190.3500E-06,-2.2000502646E+00
+190.6000E-06,-1.9990452379E+00
+190.8500E-06,-1.9990452379E+00
+191.1000E-06,-1.9990452379E+00
+191.3500E-06,-1.8796985035E+00
+191.6000E-06,-1.9299497601E+00
+191.8500E-06,-1.8168844323E+00
+192.1000E-06,-1.7980402112E+00
+192.3500E-06,-1.7980402112E+00
+192.6000E-06,-1.5970351845E+00
+192.8500E-06,-1.5970351845E+00
+193.1000E-06,-1.5970351845E+00
+193.3500E-06,-1.7163819189E+00
+193.6000E-06,-1.5970351845E+00
+193.8500E-06,-1.5970351845E+00
+194.1000E-06,-1.4274371934E+00
+194.3500E-06,-1.5970351845E+00
+194.6000E-06,-1.3960301578E+00
+194.8500E-06,-1.4148743789E+00
+195.1000E-06,-1.3960301578E+00
+195.3500E-06,-1.5153768922E+00
+195.6000E-06,-1.3960301578E+00
+195.8500E-06,-1.3960301578E+00
+196.1000E-06,-1.5970351845E+00
+196.3500E-06,-1.5153768922E+00
+196.6000E-06,-1.5970351845E+00
+196.8500E-06,-1.5970351845E+00
+197.1000E-06,-1.5970351845E+00
+197.3500E-06,-1.5970351845E+00
+197.6000E-06,-1.5970351845E+00
+197.8500E-06,-1.5781909634E+00
+198.1000E-06,-1.5970351845E+00
+198.3500E-06,-1.7163819189E+00
+198.6000E-06,-1.5970351845E+00
+198.8500E-06,-1.7791959901E+00
+199.1000E-06,-1.7980402112E+00
+199.3500E-06,-1.7980402112E+00
+199.6000E-06,-1.7980402112E+00
+199.8500E-06,-1.7980402112E+00
+200.1000E-06,-1.8294472468E+00
+200.3500E-06,-1.9990452379E+00
+200.6000E-06,-1.9299497601E+00
+200.8500E-06,-1.9990452379E+00
+201.1000E-06,-1.9990452379E+00
+201.3500E-06,-1.8796985035E+00
+201.6000E-06,-1.9990452379E+00
+201.8500E-06,-1.9990452379E+00
+202.1000E-06,-2.1686432290E+00
+202.3500E-06,-1.9990452379E+00
+202.6000E-06,-2.0681407156E+00
+202.8500E-06,-2.0178894590E+00
+203.1000E-06,-2.1686432290E+00
+203.3500E-06,-1.9990452379E+00
+203.6000E-06,-2.1309547868E+00
+203.8500E-06,-2.2000502646E+00
+204.1000E-06,-1.9990452379E+00
+204.3500E-06,-2.0807035302E+00
+204.6000E-06,-1.9990452379E+00
+204.8500E-06,-1.9990452379E+00
+205.1000E-06,-2.1686432290E+00
+205.3500E-06,-2.1183919723E+00
+205.6000E-06,-1.9990452379E+00
+205.8500E-06,-1.9990452379E+00
+206.1000E-06,-1.8294472468E+00
+206.3500E-06,-1.9173869456E+00
+206.6000E-06,-1.9990452379E+00
+206.8500E-06,-1.9990452379E+00
+207.1000E-06,-1.7980402112E+00
+207.3500E-06,-1.7163819189E+00
+207.6000E-06,-1.7980402112E+00
+207.8500E-06,-1.7980402112E+00
+208.1000E-06,-1.5970351845E+00
+208.3500E-06,-1.7163819189E+00
+208.6000E-06,-1.6661306622E+00
+208.8500E-06,-1.5970351845E+00
+209.1000E-06,-1.5970351845E+00
+209.3500E-06,-1.5970351845E+00
+209.6000E-06,-1.5279397068E+00
+209.8500E-06,-1.5970351845E+00
+210.1000E-06,-1.3960301578E+00
+210.3500E-06,-1.5153768922E+00
+210.6000E-06,-1.5970351845E+00
+210.8500E-06,-1.5781909634E+00
+211.1000E-06,-1.4274371934E+00
+211.3500E-06,-1.5153768922E+00
+211.6000E-06,-1.3960301578E+00
+211.8500E-06,-1.3960301578E+00
+212.1000E-06,-1.4274371934E+00
+212.3500E-06,-1.3960301578E+00
+212.6000E-06,-1.3960301578E+00
+212.8500E-06,-1.3960301578E+00
+213.1000E-06,-1.3960301578E+00
+213.3500E-06,-1.3960301578E+00
+213.6000E-06,-1.5970351845E+00
+213.8500E-06,-1.4148743789E+00
+214.1000E-06,-1.4274371934E+00
+214.3500E-06,-1.5970351845E+00
+214.6000E-06,-1.5279397068E+00
+214.8500E-06,-1.5970351845E+00
+215.1000E-06,-1.5970351845E+00
+215.3500E-06,-1.5153768922E+00
+215.6000E-06,-1.4651256355E+00
+215.8500E-06,-1.5970351845E+00
+216.1000E-06,-1.5970351845E+00
+216.3500E-06,-1.5970351845E+00
+216.6000E-06,-1.5970351845E+00
+216.8500E-06,-1.5970351845E+00
+217.1000E-06,-1.5970351845E+00
+217.3500E-06,-1.5970351845E+00
+217.6000E-06,-1.7289447335E+00
+217.8500E-06,-1.5970351845E+00
+218.1000E-06,-1.5656281489E+00
+218.3500E-06,-1.5970351845E+00
+218.6000E-06,-1.5970351845E+00
+218.8500E-06,-1.5970351845E+00
+219.1000E-06,-1.5970351845E+00
+219.3500E-06,-1.5970351845E+00
+219.6000E-06,-1.4651256355E+00
+219.8500E-06,-1.3960301578E+00
+220.1000E-06,-1.5970351845E+00
+220.3500E-06,-1.3960301578E+00
+220.6000E-06,-1.3960301578E+00
+220.8500E-06,-1.5781909634E+00
+221.1000E-06,-1.3960301578E+00
+221.3500E-06,-1.3960301578E+00
+221.6000E-06,-1.3960301578E+00
+221.8500E-06,-1.3960301578E+00
+222.1000E-06,-1.3960301578E+00
+222.3500E-06,-1.3960301578E+00
+222.6000E-06,-1.3960301578E+00
+222.8500E-06,-1.3960301578E+00
+223.1000E-06,-1.3960301578E+00
+223.3500E-06,-1.3143718655E+00
+223.6000E-06,-1.2641206088E+00
+223.8500E-06,-1.3960301578E+00
+224.1000E-06,-1.2264321667E+00
+224.3500E-06,-1.3960301578E+00
+224.6000E-06,-1.3960301578E+00
+224.8500E-06,-1.3960301578E+00
+225.1000E-06,-1.3960301578E+00
+225.3500E-06,-1.3960301578E+00
+225.6000E-06,-1.4651256355E+00
+225.8500E-06,-1.5970351845E+00
+226.1000E-06,-1.5970351845E+00
+226.3500E-06,-1.5153768922E+00
+226.6000E-06,-1.5970351845E+00
+226.8500E-06,-1.5970351845E+00
+227.1000E-06,-1.7666331756E+00
+227.3500E-06,-1.5970351845E+00
+227.6000E-06,-1.5970351845E+00
+227.8500E-06,-1.7980402112E+00
+228.1000E-06,-1.7980402112E+00
+228.3500E-06,-1.7980402112E+00
+228.6000E-06,-1.7289447335E+00
+228.8500E-06,-1.7980402112E+00
+229.1000E-06,-1.7980402112E+00
+229.3500E-06,-1.9173869456E+00
+229.6000E-06,-1.9299497602E+00
+229.8500E-06,-1.8168844323E+00
+230.1000E-06,-1.9990452379E+00
+230.3500E-06,-1.9990452379E+00
+230.6000E-06,-1.9990452379E+00
+230.8500E-06,-1.9802010168E+00
+231.1000E-06,-1.9990452379E+00
+231.3500E-06,-1.9990452379E+00
+231.6000E-06,-1.9990452379E+00
+231.8500E-06,-1.9990452379E+00
+232.1000E-06,-1.9990452379E+00
+232.3500E-06,-1.9990452379E+00
+232.6000E-06,-1.7980402112E+00
+232.8500E-06,-1.9990452379E+00
+233.1000E-06,-1.7980402112E+00
+233.3500E-06,-1.7980402112E+00
+233.6000E-06,-1.7980402112E+00
+233.8500E-06,-1.9802010168E+00
+234.1000E-06,-1.8294472468E+00
+234.3500E-06,-1.7980402112E+00
+234.6000E-06,-1.7289447335E+00
+234.8500E-06,-1.7980402112E+00
+235.1000E-06,-1.5970351845E+00
+235.3500E-06,-1.6786934768E+00
+235.6000E-06,-1.5970351845E+00
+235.8500E-06,-1.4148743789E+00
+236.1000E-06,-1.3960301578E+00
+236.3500E-06,-1.5153768922E+00
+236.6000E-06,-1.3960301578E+00
+236.8500E-06,-1.3960301578E+00
+237.1000E-06,-1.3960301578E+00
+237.3500E-06,-1.3960301578E+00
+237.6000E-06,-1.3960301578E+00
+237.8500E-06,-1.3771859368E+00
+238.1000E-06,-1.3960301578E+00
+238.3500E-06,-1.1950251311E+00
+238.6000E-06,-1.1950251311E+00
+238.8500E-06,-1.1950251311E+00
+239.1000E-06,-1.1950251311E+00
+239.3500E-06,-1.1950251311E+00
+239.6000E-06,-1.1950251311E+00
+239.8500E-06,-1.1950251311E+00
+240.1000E-06,-1.1950251311E+00
+240.3500E-06,-1.1950251311E+00
+240.6000E-06,-1.2641206088E+00
+240.8500E-06,-1.1950251311E+00
+241.1000E-06,-1.1950251311E+00
+241.3500E-06,-1.3143718655E+00
+241.6000E-06,-1.1950251311E+00
+241.8500E-06,-1.2138693522E+00
+242.1000E-06,-1.3646231222E+00
+242.3500E-06,-1.3143718655E+00
+242.6000E-06,-1.3960301578E+00
+242.8500E-06,-1.2138693522E+00
+243.1000E-06,-1.3960301578E+00
+243.3500E-06,-1.3960301578E+00
+243.6000E-06,-1.4651256355E+00
+243.8500E-06,-1.3960301578E+00
+244.1000E-06,-1.4274371934E+00
+244.3500E-06,-1.4776884501E+00
+244.6000E-06,-1.5279397068E+00
+244.8500E-06,-1.5970351845E+00
+245.1000E-06,-1.5970351845E+00
+245.3500E-06,-1.5970351845E+00
+245.6000E-06,-1.5970351845E+00
+245.8500E-06,-1.5970351845E+00
+246.1000E-06,-1.7666331756E+00
+246.3500E-06,-1.6786934768E+00
+246.6000E-06,-1.7289447335E+00
+246.8500E-06,-1.5970351845E+00
+247.1000E-06,-1.7980402112E+00
+247.3500E-06,-1.5970351845E+00
+247.6000E-06,-1.6661306622E+00
+247.8500E-06,-1.6158794056E+00
+248.1000E-06,-1.6284422201E+00
+248.3500E-06,-1.7163819189E+00
+248.6000E-06,-1.7289447335E+00
+248.8500E-06,-1.5970351845E+00
+249.1000E-06,-1.5970351845E+00
+249.3500E-06,
