[libnames, libpath] = libraryinfo("xcos_code_generatorlib");
path = libpath + "/../tests/unit_tests";
loadXcosLibs();
importXcosDiagram(path + "/powblk.zcos");
// generate some code for each superblock on TMPDIR
name = "powblk";
ok = xcg_codegenerator(scs_m, TMPDIR, name);
exec(TMPDIR + filesep() + name + ".sci", 1);
function [y1] = powblk(t, u1)
    //EMX?: emx_func_file('powblk.c')
    // update outputs 
    // -754c0871:15b3403f3c1:-7f68
    // scs_m(list("objs",2,"model","rpar","objs",3))
    // powblk/powblk
    // powblk
    tmp2 = u1 ^ 1.5;
    // -14ccf4bd:1592aac8465:-7eec
    // scs_m(list("objs",2,"model","rpar","objs",8))
    // powblk/powblk
    // xcg_output_sim
    y1 = tmp2;
endfunction
emx_codegen(TMPDIR + filesep() + name + "_scenario.sce");
