lun. mai 24 22:57:15 CEST 2010

Testing problem #1
  uncprb_getname...
  name=rose
  uncprb_getinitf...
  uncprb_getfunc, option=1...
  uncprb_getfunc, option=2...
  uncprb_getfunc, option=3...
  uncprb_getobjfcn...
  uncprb_getvecfcn...
  uncprb_getvecjac...
  uncprb_getgrdfcn...
  Check derivative by uncprb_getvecjac...
  ||J-Jfd||/||J||=1.231132e-11
  Jacobian : ok.
  Check derivative by uncprb_getgrdfcn...
  ||g-gfd||/||g||=6.317247e-11
  Gradient : ok.
  Checking [norm(fvec) norm(J) f norm(g)]...
  Checking uncprb_getopt : fopt/xopt...
  expected: 0.000000e+00,   computed: 0.000000e+00
  Checking g(xopt)=0...
  ||g(xopt)||/||g(x0)||=0.000000e+00...
Testing problem #2
  uncprb_getname...
  name=froth
  uncprb_getinitf...
  uncprb_getfunc, option=1...
  uncprb_getfunc, option=2...
  uncprb_getfunc, option=3...
  uncprb_getobjfcn...
  uncprb_getvecfcn...
  uncprb_getvecjac...
  uncprb_getgrdfcn...
  Check derivative by uncprb_getvecjac...
  ||J-Jfd||/||J||=1.527209e-11
  Jacobian : ok.
  Check derivative by uncprb_getgrdfcn...
  ||g-gfd||/||g||=3.468377e-11
  Gradient : ok.
  Checking [norm(fvec) norm(J) f norm(g)]...
  Checking uncprb_getopt : fopt/xopt...
  expected: 0.000000e+00,   computed: 0.000000e+00
  Checking g(xopt)=0...
  ||g(xopt)||/||g(x0)||=0.000000e+00...
Testing problem #3
  uncprb_getname...
  name=badscp
  uncprb_getinitf...
  uncprb_getfunc, option=1...
  uncprb_getfunc, option=2...
  uncprb_getfunc, option=3...
  uncprb_getobjfcn...
  uncprb_getvecfcn...
  uncprb_getvecjac...
  uncprb_getgrdfcn...
  Check derivative by uncprb_getvecjac...
  ||J-Jfd||/||J||=2.660227e-15
  Jacobian : ok.
  Check derivative by uncprb_getgrdfcn...
  ||g-gfd||/||g||=3.835820e-15
  Gradient : ok.
  Checking [norm(fvec) norm(J) f norm(g)]...
  Checking uncprb_getopt : fopt/xopt...
  expected: 0.000000e+00,   computed: 2.598544e-08
  Checking g(xopt)=0...
  ||g(xopt)||/||g(x0)||=1.467833e-03...
Testing problem #4
  uncprb_getname...
  name=badscb
  uncprb_getinitf...
  uncprb_getfunc, option=1...
  uncprb_getfunc, option=2...
  uncprb_getfunc, option=3...
  uncprb_getobjfcn...
  uncprb_getvecfcn...
  uncprb_getvecjac...
  uncprb_getgrdfcn...
  Check derivative by uncprb_getvecjac...
  ||J-Jfd||/||J||=3.063280e-13
  Jacobian : ok.
  Check derivative by uncprb_getgrdfcn...
  ||g-gfd||/||g||=2.000000e-12
  Gradient : ok.
  Checking [norm(fvec) norm(J) f norm(g)]...
  Checking uncprb_getopt : fopt/xopt...
  expected: 0.000000e+00,   computed: 0.000000e+00
  Checking g(xopt)=0...
  ||g(xopt)||/||g(x0)||=0.000000e+00...
Testing problem #5
  uncprb_getname...
  name=beale
  uncprb_getinitf...
  uncprb_getfunc, option=1...
  uncprb_getfunc, option=2...
  uncprb_getfunc, option=3...
  uncprb_getobjfcn...
  uncprb_getvecfcn...
  uncprb_getvecjac...
  uncprb_getgrdfcn...
  Check derivative by uncprb_getvecjac...
  ||J-Jfd||/||J||=1.155942e-11
  Jacobian : ok.
  Check derivative by uncprb_getgrdfcn...
  ||g-gfd||/||g||=3.412423e-11
  Gradient : ok.
  Checking [norm(fvec) norm(J) f norm(g)]...
  Checking uncprb_getopt : fopt/xopt...
  expected: 0.000000e+00,   computed: 0.000000e+00
  Checking g(xopt)=0...
  ||g(xopt)||/||g(x0)||=0.000000e+00...
Testing problem #6
  uncprb_getname...
  name=jensam
  uncprb_getinitf...
  uncprb_getfunc, option=1...
  uncprb_getfunc, option=2...
  uncprb_getfunc, option=3...
  uncprb_getobjfcn...
  uncprb_getvecfcn...
  uncprb_getvecjac...
  uncprb_getgrdfcn...
  Check derivative by uncprb_getvecjac...
  ||J-Jfd||/||J||=5.525344e-10
  Jacobian : ok.
  Check derivative by uncprb_getgrdfcn...
  ||g-gfd||/||g||=2.282695e-09
  Gradient : ok.
  Checking [norm(fvec) norm(J) f norm(g)]...
  Checking uncprb_getopt : fopt/xopt...
  expected: 1.243620e+02,   computed: 1.243623e+02
  Checking g(xopt)=0...
  ||g(xopt)||/||g(x0)||=5.165085e-05...
Testing problem #7
  uncprb_getname...
  name=helix
  uncprb_getinitf...
  uncprb_getfunc, option=1...
  uncprb_getfunc, option=2...
  uncprb_getfunc, option=3...
  uncprb_getobjfcn...
  uncprb_getvecfcn...
  uncprb_getvecjac...
  uncprb_getgrdfcn...
  Check derivative by uncprb_getvecjac...
  ||J-Jfd||/||J||=1.938103e-11
  Jacobian : ok.
  Check derivative by uncprb_getgrdfcn...
  ||g-gfd||/||g||=3.463578e-11
  Gradient : ok.
  Checking [norm(fvec) norm(J) f norm(g)]...
  Checking uncprb_getopt : fopt/xopt...
  expected: 0.000000e+00,   computed: 0.000000e+00
  Checking g(xopt)=0...
  ||g(xopt)||/||g(x0)||=0.000000e+00...
Testing problem #8
  uncprb_getname...
  name=bard
  uncprb_getinitf...
  uncprb_getfunc, option=1...
  uncprb_getfunc, option=2...
  uncprb_getfunc, option=3...
  uncprb_getobjfcn...
  uncprb_getvecfcn...
  uncprb_getvecjac...
  uncprb_getgrdfcn...
  Check derivative by uncprb_getvecjac...
  ||J-Jfd||/||J||=2.298245e-11
  Jacobian : ok.
  Check derivative by uncprb_getgrdfcn...
  ||g-gfd||/||g||=3.876232e-11
  Gradient : ok.
  Checking [norm(fvec) norm(J) f norm(g)]...
  Checking uncprb_getopt : fopt/xopt...
Testing problem #9
  uncprb_getname...
  name=gauss
  uncprb_getinitf...
  uncprb_getfunc, option=1...
  uncprb_getfunc, option=2...
  uncprb_getfunc, option=3...
  uncprb_getobjfcn...
  uncprb_getvecfcn...
  uncprb_getvecjac...
  uncprb_getgrdfcn...
  Check derivative by uncprb_getvecjac...
  ||J-Jfd||/||J||=5.789550e-12
  Jacobian : ok.
  Check derivative by uncprb_getgrdfcn...
  ||g-gfd||/||g||=6.535588e-10
  Gradient : ok.
  Checking [norm(fvec) norm(J) f norm(g)]...
  Checking uncprb_getopt : fopt/xopt...
Testing problem #10
  uncprb_getname...
  name=meyer
  uncprb_getinitf...
  uncprb_getfunc, option=1...
  uncprb_getfunc, option=2...
  uncprb_getfunc, option=3...
  uncprb_getobjfcn...
  uncprb_getvecfcn...
  uncprb_getvecjac...
  uncprb_getgrdfcn...
  Check derivative by uncprb_getvecjac...
  ||J-Jfd||/||J||=6.103460e-12
  Jacobian : ok.
  Check derivative by uncprb_getgrdfcn...
  ||g-gfd||/||g||=5.828963e-12
  Gradient : ok.
  Checking [norm(fvec) norm(J) f norm(g)]...
  Checking uncprb_getopt : fopt/xopt...
Testing problem #11
  uncprb_getname...
  name=gulf
  uncprb_getinitf...
  uncprb_getfunc, option=1...
  uncprb_getfunc, option=2...
  uncprb_getfunc, option=3...
  uncprb_getobjfcn...
  uncprb_getvecfcn...
  uncprb_getvecjac...
  uncprb_getgrdfcn...
  Check derivative by uncprb_getvecjac...
  ||J-Jfd||/||J||=7.750354e-12
  Jacobian : ok.
  Check derivative by uncprb_getgrdfcn...
  ||g-gfd||/||g||=6.450760e-11
  Gradient : ok.
  Checking [norm(fvec) norm(J) f norm(g)]...
  Checking uncprb_getopt : fopt/xopt...
  expected: 0.000000e+00,   computed: 3.169358e-32
  Checking g(xopt)=0...
  ||g(xopt)||/||g(x0)||=2.720670e-17...
Testing problem #12
  uncprb_getname...
  name=box
  uncprb_getinitf...
  uncprb_getfunc, option=1...
  uncprb_getfunc, option=2...
  uncprb_getfunc, option=3...
  uncprb_getobjfcn...
  uncprb_getvecfcn...
  uncprb_getvecjac...
  uncprb_getgrdfcn...
  Check derivative by uncprb_getvecjac...
  ||J-Jfd||/||J||=1.037016e-10
  Jacobian : ok.
  Check derivative by uncprb_getgrdfcn...
  ||g-gfd||/||g||=1.262929e-10
  Gradient : ok.
  Checking [norm(fvec) norm(J) f norm(g)]...
  Checking uncprb_getopt : fopt/xopt...
  expected: 0.000000e+00,   computed: 0.000000e+00
  Checking g(xopt)=0...
  ||g(xopt)||/||g(x0)||=0.000000e+00...
Testing problem #13
  uncprb_getname...
  name=sing
  uncprb_getinitf...
  uncprb_getfunc, option=1...
  uncprb_getfunc, option=2...
  uncprb_getfunc, option=3...
  uncprb_getobjfcn...
  uncprb_getvecfcn...
  uncprb_getvecjac...
  uncprb_getgrdfcn...
  Check derivative by uncprb_getvecjac...
  ||J-Jfd||/||J||=1.951129e-11
  Jacobian : ok.
  Check derivative by uncprb_getgrdfcn...
  ||g-gfd||/||g||=3.169583e-11
  Gradient : ok.
  Checking [norm(fvec) norm(J) f norm(g)]...
  Checking uncprb_getopt : fopt/xopt...
  expected: 0.000000e+00,   computed: 0.000000e+00
  Checking g(xopt)=0...
  ||g(xopt)||/||g(x0)||=0.000000e+00...
Testing problem #14
  uncprb_getname...
  name=wood
  uncprb_getinitf...
  uncprb_getfunc, option=1...
  uncprb_getfunc, option=2...
  uncprb_getfunc, option=3...
  uncprb_getobjfcn...
  uncprb_getvecfcn...
  uncprb_getvecjac...
  uncprb_getgrdfcn...
  Check derivative by uncprb_getvecjac...
  ||J-Jfd||/||J||=3.045155e-11
  Jacobian : ok.
  Check derivative by uncprb_getgrdfcn...
  ||g-gfd||/||g||=3.921786e-11
  Gradient : ok.
  Checking [norm(fvec) norm(J) f norm(g)]...
  Checking uncprb_getopt : fopt/xopt...
  expected: 0.000000e+00,   computed: 0.000000e+00
  Checking g(xopt)=0...
  ||g(xopt)||/||g(x0)||=0.000000e+00...
Testing problem #15
  uncprb_getname...
  name=kowosb
  uncprb_getinitf...
  uncprb_getfunc, option=1...
  uncprb_getfunc, option=2...
  uncprb_getfunc, option=3...
  uncprb_getobjfcn...
  uncprb_getvecfcn...
  uncprb_getvecjac...
  uncprb_getgrdfcn...
  Check derivative by uncprb_getvecjac...
  ||J-Jfd||/||J||=1.969227e-11
  Jacobian : ok.
  Check derivative by uncprb_getgrdfcn...
  ||g-gfd||/||g||=5.328759e-11
  Gradient : ok.
  Checking [norm(fvec) norm(J) f norm(g)]...
  Checking uncprb_getopt : fopt/xopt...
Testing problem #16
  uncprb_getname...
  name=bd
  uncprb_getinitf...
  uncprb_getfunc, option=1...
  uncprb_getfunc, option=2...
  uncprb_getfunc, option=3...
  uncprb_getobjfcn...
  uncprb_getvecfcn...
  uncprb_getvecjac...
  uncprb_getgrdfcn...
  Check derivative by uncprb_getvecjac...
  ||J-Jfd||/||J||=1.905345e-10
  Jacobian : ok.
  Check derivative by uncprb_getgrdfcn...
  ||g-gfd||/||g||=1.829774e-10
  Gradient : ok.
  Checking [norm(fvec) norm(J) f norm(g)]...
  Checking uncprb_getopt : fopt/xopt...
Testing problem #17
  uncprb_getname...
  name=osb1
  uncprb_getinitf...
  uncprb_getfunc, option=1...
  uncprb_getfunc, option=2...
  uncprb_getfunc, option=3...
  uncprb_getobjfcn...
  uncprb_getvecfcn...
  uncprb_getvecjac...
  uncprb_getgrdfcn...
  Check derivative by uncprb_getvecjac...
  ||J-Jfd||/||J||=1.613225e-08
  Jacobian : ok.
  Check derivative by uncprb_getgrdfcn...
  ||g-gfd||/||g||=1.529475e-07
  Gradient : ok.
  Checking [norm(fvec) norm(J) f norm(g)]...
  Checking uncprb_getopt : fopt/xopt...
Testing problem #18
  uncprb_getname...
  name=biggs
  uncprb_getinitf...
  uncprb_getfunc, option=1...
  uncprb_getfunc, option=2...
  uncprb_getfunc, option=3...
  uncprb_getobjfcn...
  uncprb_getvecfcn...
  uncprb_getvecjac...
  uncprb_getgrdfcn...
  Check derivative by uncprb_getvecjac...
  ||J-Jfd||/||J||=9.751643e-12
  Jacobian : ok.
  Check derivative by uncprb_getgrdfcn...
  ||g-gfd||/||g||=2.531861e-11
  Gradient : ok.
  Checking [norm(fvec) norm(J) f norm(g)]...
  Checking uncprb_getopt : fopt/xopt...
Testing problem #19
  uncprb_getname...
  name=osb2
  uncprb_getinitf...
  uncprb_getfunc, option=1...
  uncprb_getfunc, option=2...
  uncprb_getfunc, option=3...
  uncprb_getobjfcn...
  uncprb_getvecfcn...
  uncprb_getvecjac...
  uncprb_getgrdfcn...
  Check derivative by uncprb_getvecjac...
  ||J-Jfd||/||J||=1.150945e-10
  Jacobian : ok.
  Check derivative by uncprb_getgrdfcn...
  ||g-gfd||/||g||=2.209548e-10
  Gradient : ok.
  Checking [norm(fvec) norm(J) f norm(g)]...
  Checking uncprb_getopt : fopt/xopt...
Testing problem #20
  uncprb_getname...
  name=watson
  uncprb_getinitf...
  uncprb_getfunc, option=1...
  uncprb_getfunc, option=2...
  uncprb_getfunc, option=3...
  uncprb_getobjfcn...
  uncprb_getvecfcn...
  uncprb_getvecjac...
  uncprb_getgrdfcn...
  Check derivative by uncprb_getvecjac...
  ||J-Jfd||/||J||=1.776661e-12
  Jacobian : ok.
  Check derivative by uncprb_getgrdfcn...
  ||g-gfd||/||g||=1.672675e-11
  Gradient : ok.
  Checking [norm(fvec) norm(J) f norm(g)]...
  Checking uncprb_getopt : fopt/xopt...
Testing problem #21
  uncprb_getname...
  name=rosex
  uncprb_getinitf...
  uncprb_getfunc, option=1...
  uncprb_getfunc, option=2...
  uncprb_getfunc, option=3...
  uncprb_getobjfcn...
  uncprb_getvecfcn...
  uncprb_getvecjac...
  uncprb_getgrdfcn...
  Check derivative by uncprb_getvecjac...
  ||J-Jfd||/||J||=1.231132e-11
  Jacobian : ok.
  Check derivative by uncprb_getgrdfcn...
  ||g-gfd||/||g||=6.313643e-11
  Gradient : ok.
  Checking [norm(fvec) norm(J) f norm(g)]...
  Checking uncprb_getopt : fopt/xopt...
  expected: 0.000000e+00,   computed: 0.000000e+00
  Checking g(xopt)=0...
  ||g(xopt)||/||g(x0)||=0.000000e+00...
Testing problem #22
  uncprb_getname...
  name=singx
  uncprb_getinitf...
  uncprb_getfunc, option=1...
  uncprb_getfunc, option=2...
  uncprb_getfunc, option=3...
  uncprb_getobjfcn...
  uncprb_getvecfcn...
  uncprb_getvecjac...
  uncprb_getgrdfcn...
  Check derivative by uncprb_getvecjac...
  ||J-Jfd||/||J||=1.951129e-11
  Jacobian : ok.
  Check derivative by uncprb_getgrdfcn...
  ||g-gfd||/||g||=3.952313e-11
  Gradient : ok.
  Checking [norm(fvec) norm(J) f norm(g)]...
  Checking uncprb_getopt : fopt/xopt...
  expected: 0.000000e+00,   computed: 0.000000e+00
  Checking g(xopt)=0...
  ||g(xopt)||/||g(x0)||=0.000000e+00...
Testing problem #23
  uncprb_getname...
  name=pen1
  uncprb_getinitf...
  uncprb_getfunc, option=1...
  uncprb_getfunc, option=2...
  uncprb_getfunc, option=3...
  uncprb_getobjfcn...
  uncprb_getvecfcn...
  uncprb_getvecjac...
  uncprb_getgrdfcn...
  Check derivative by uncprb_getvecjac...
  ||J-Jfd||/||J||=1.889542e-10
  Jacobian : ok.
  Check derivative by uncprb_getgrdfcn...
  ||g-gfd||/||g||=1.453624e-10
  Gradient : ok.
  Checking [norm(fvec) norm(J) f norm(g)]...
  Checking uncprb_getopt : fopt/xopt...
Testing problem #24
  uncprb_getname...
  name=pen2
  uncprb_getinitf...
  uncprb_getfunc, option=1...
  uncprb_getfunc, option=2...
  uncprb_getfunc, option=3...
  uncprb_getobjfcn...
  uncprb_getvecfcn...
  uncprb_getvecjac...
  uncprb_getgrdfcn...
  Check derivative by uncprb_getvecjac...
  ||J-Jfd||/||J||=1.060927e-11
  Jacobian : ok.
  Check derivative by uncprb_getgrdfcn...
  ||g-gfd||/||g||=3.417706e-11
  Gradient : ok.
  Checking [norm(fvec) norm(J) f norm(g)]...
  Checking uncprb_getopt : fopt/xopt...
Testing problem #25
  uncprb_getname...
  name=vardim
  uncprb_getinitf...
  uncprb_getfunc, option=1...
  uncprb_getfunc, option=2...
  uncprb_getfunc, option=3...
  uncprb_getobjfcn...
  uncprb_getvecfcn...
  uncprb_getvecjac...
  uncprb_getgrdfcn...
  Check derivative by uncprb_getvecjac...
  ||J-Jfd||/||J||=5.002693e-11
  Jacobian : ok.
  Check derivative by uncprb_getgrdfcn...
  ||g-gfd||/||g||=5.149543e-11
  Gradient : ok.
  Checking [norm(fvec) norm(J) f norm(g)]...
  Checking uncprb_getopt : fopt/xopt...
  expected: 0.000000e+00,   computed: 0.000000e+00
  Checking g(xopt)=0...
  ||g(xopt)||/||g(x0)||=0.000000e+00...
Testing problem #26
  uncprb_getname...
  name=trig
  uncprb_getinitf...
  uncprb_getfunc, option=1...
  uncprb_getfunc, option=2...
  uncprb_getfunc, option=3...
  uncprb_getobjfcn...
  uncprb_getvecfcn...
  uncprb_getvecjac...
  uncprb_getgrdfcn...
  Check derivative by uncprb_getvecjac...
  ||J-Jfd||/||J||=7.597421e-10
  Jacobian : ok.
  Check derivative by uncprb_getgrdfcn...
  ||g-gfd||/||g||=1.008445e-09
  Gradient : ok.
  Checking [norm(fvec) norm(J) f norm(g)]...
  Checking uncprb_getopt : fopt/xopt...
Testing problem #27
  uncprb_getname...
  name=almost
  uncprb_getinitf...
  uncprb_getfunc, option=1...
  uncprb_getfunc, option=2...
  uncprb_getfunc, option=3...
  uncprb_getobjfcn...
  uncprb_getvecfcn...
  uncprb_getvecjac...
  uncprb_getgrdfcn...
  Check derivative by uncprb_getvecjac...
  ||J-Jfd||/||J||=2.361592e-11
  Jacobian : ok.
  Check derivative by uncprb_getgrdfcn...
  ||g-gfd||/||g||=1.706630e-11
  Gradient : ok.
  Checking [norm(fvec) norm(J) f norm(g)]...
  Checking uncprb_getopt : fopt/xopt...
  expected: 0.000000e+00,   computed: 0.000000e+00
  Checking g(xopt)=0...
  ||g(xopt)||/||g(x0)||=0.000000e+00...
Testing problem #28
  uncprb_getname...
  name=bv
  uncprb_getinitf...
  uncprb_getfunc, option=1...
  uncprb_getfunc, option=2...
  uncprb_getfunc, option=3...
  uncprb_getobjfcn...
  uncprb_getvecfcn...
  uncprb_getvecjac...
  uncprb_getgrdfcn...
  Check derivative by uncprb_getvecjac...
  ||J-Jfd||/||J||=1.119703e-12
  Jacobian : ok.
  Check derivative by uncprb_getgrdfcn...
  ||g-gfd||/||g||=1.795463e-10
  Gradient : ok.
  Checking [norm(fvec) norm(J) f norm(g)]...
  Checking uncprb_getopt : fopt/xopt...
Testing problem #29
  uncprb_getname...
  name=ie
  uncprb_getinitf...
  uncprb_getfunc, option=1...
  uncprb_getfunc, option=2...
  uncprb_getfunc, option=3...
  uncprb_getobjfcn...
  uncprb_getvecfcn...
  uncprb_getvecjac...
  uncprb_getgrdfcn...
  Check derivative by uncprb_getvecjac...
  ||J-Jfd||/||J||=5.648822e-12
  Jacobian : ok.
  Check derivative by uncprb_getgrdfcn...
  ||g-gfd||/||g||=1.877035e-11
  Gradient : ok.
  Checking [norm(fvec) norm(J) f norm(g)]...
  Checking uncprb_getopt : fopt/xopt...
Testing problem #30
  uncprb_getname...
  name=trid
  uncprb_getinitf...
  uncprb_getfunc, option=1...
  uncprb_getfunc, option=2...
  uncprb_getfunc, option=3...
  uncprb_getobjfcn...
  uncprb_getvecfcn...
  uncprb_getvecjac...
  uncprb_getgrdfcn...
  Check derivative by uncprb_getvecjac...
  ||J-Jfd||/||J||=5.172685e-12
  Jacobian : ok.
  Check derivative by uncprb_getgrdfcn...
  ||g-gfd||/||g||=8.570871e-11
  Gradient : ok.
  Checking [norm(fvec) norm(J) f norm(g)]...
  Checking uncprb_getopt : fopt/xopt...
Testing problem #31
  uncprb_getname...
  name=band
  uncprb_getinitf...
  uncprb_getfunc, option=1...
  uncprb_getfunc, option=2...
  uncprb_getfunc, option=3...
  uncprb_getobjfcn...
  uncprb_getvecfcn...
  uncprb_getvecjac...
  uncprb_getgrdfcn...
  Check derivative by uncprb_getvecjac...
  ||J-Jfd||/||J||=0.000000e+00
  Jacobian : ok.
  Check derivative by uncprb_getgrdfcn...
  ||g-gfd||/||g||=0.000000e+00
  Gradient : ok.
  Checking [norm(fvec) norm(J) f norm(g)]...
  Checking uncprb_getopt : fopt/xopt...
Testing problem #32
  uncprb_getname...
  name=lin
  uncprb_getinitf...
  uncprb_getfunc, option=1...
  uncprb_getfunc, option=2...
  uncprb_getfunc, option=3...
  uncprb_getobjfcn...
  uncprb_getvecfcn...
  uncprb_getvecjac...
  uncprb_getgrdfcn...
  Check derivative by uncprb_getvecjac...
  ||J-Jfd||/||J||=1.240567e-10
  Jacobian : ok.
  Check derivative by uncprb_getgrdfcn...
  ||g-gfd||/||g||=1.702274e-10
  Gradient : ok.
  Checking [norm(fvec) norm(J) f norm(g)]...
  Checking uncprb_getopt : fopt/xopt...
  expected: 5.000000e+00,   computed: 5.000000e+00
  Checking g(xopt)=0...
  ||g(xopt)||/||g(x0)||=4.355503e-17...
Testing problem #33
  uncprb_getname...
  name=lin1
  uncprb_getinitf...
  uncprb_getfunc, option=1...
  uncprb_getfunc, option=2...
  uncprb_getfunc, option=3...
  uncprb_getobjfcn...
  uncprb_getvecfcn...
  uncprb_getvecjac...
  uncprb_getgrdfcn...
  Check derivative by uncprb_getvecjac...
  ||J-Jfd||/||J||=5.996768e-11
  Jacobian : ok.
  Check derivative by uncprb_getgrdfcn...
  ||g-gfd||/||g||=5.407820e-11
  Gradient : ok.
  Checking [norm(fvec) norm(J) f norm(g)]...
  Checking uncprb_getopt : fopt/xopt...
Testing problem #34
  uncprb_getname...
  name=lin0
  uncprb_getinitf...
  uncprb_getfunc, option=1...
  uncprb_getfunc, option=2...
  uncprb_getfunc, option=3...
  uncprb_getobjfcn...
  uncprb_getvecfcn...
  uncprb_getvecjac...
  uncprb_getgrdfcn...
  Check derivative by uncprb_getvecjac...
  ||J-Jfd||/||J||=6.876507e-11
  Jacobian : ok.
  Check derivative by uncprb_getgrdfcn...
  ||g-gfd||/||g||=6.293976e-11
  Gradient : ok.
  Checking [norm(fvec) norm(J) f norm(g)]...
  Checking uncprb_getopt : fopt/xopt...
Testing problem #35
  uncprb_getname...
  name=cheb
  uncprb_getinitf...
  uncprb_getfunc, option=1...
  uncprb_getfunc, option=2...
  uncprb_getfunc, option=3...
  uncprb_getobjfcn...
  uncprb_getvecfcn...
  uncprb_getvecjac...
  uncprb_getgrdfcn...
  Check derivative by uncprb_getvecjac...
  ||J-Jfd||/||J||=2.808599e-07
  Jacobian : ok.
  Check derivative by uncprb_getgrdfcn...
  ||g-gfd||/||g||=3.818251e-07
  Gradient : ok.
  Checking [norm(fvec) norm(J) f norm(g)]...
  Checking uncprb_getopt : fopt/xopt...

