<?xml version="1.0" encoding="utf-8"?>
<!-- Generator: Adobe Illustrator 14.0.0, SVG Export Plug-In . SVG Version: 6.00 Build 43363)  -->
<!DOCTYPE svg PUBLIC "-//W3C//DTD SVG 1.1//EN" "http://www.w3.org/Graphics/SVG/1.1/DTD/svg11.dtd">
<svg version="1.1" id="Calque_1" xmlns="http://www.w3.org/2000/svg" xmlns:xlink="http://www.w3.org/1999/xlink" x="0px" y="0px"
	 width="40px" height="40px" viewBox="0 0 40 40" enable-background="new 0 0 40 40" xml:space="preserve">
<rect x="14.192" y="3.924" fill="none" stroke="#1A171B" stroke-width="2" width="12.127" height="10.25"/>
<rect x="2.447" y="25.41" fill="none" stroke="#1A171B" stroke-width="2" width="12.126" height="10.249"/>
<rect x="25.253" y="25.284" fill="none" stroke="#1A171B" stroke-width="2" width="12.127" height="10.248"/>
<line fill="none" stroke="#1A171B" stroke-width="2" x1="1.255" y1="19.552" x2="38.496" y2="19.552"/>
<line fill="none" stroke="#1A171B" stroke-width="2" x1="20.078" y1="14.984" x2="20.078" y2="19.094"/>
<line fill="none" stroke="#1A171B" stroke-width="2" x1="8.763" y1="20.032" x2="8.763" y2="24.473"/>
<line fill="none" stroke="#1A171B" stroke-width="2" x1="31.748" y1="19.982" x2="31.748" y2="24.523"/>
</svg>
