\relax 
\@writefile{toc}{\contentsline {section}{\numberline {1}Change log}{1}}
\@writefile{toc}{\contentsline {section}{\numberline {2}Installation}{1}}
\@writefile{toc}{\contentsline {subsection}{\numberline {2.1}Prerequisites}{1}}
\@writefile{toc}{\contentsline {subsubsection}{\numberline {2.1.1}Operating system}{1}}
\@writefile{toc}{\contentsline {subsubsection}{\numberline {2.1.2}Companion software}{2}}
\@writefile{toc}{\contentsline {subsection}{\numberline {2.2}Installation of Sysmetab}{2}}
\@writefile{toc}{\contentsline {subsubsection}{\numberline {2.2.1}User environment}{2}}
\@writefile{toc}{\contentsline {section}{\numberline {3}Test cases}{2}}
\@writefile{toc}{\contentsline {subsection}{\numberline {3.1}Stationary data}{2}}
\@writefile{toc}{\contentsline {subsubsection}{\numberline {3.1.1}Conversion to the FluxML format}{3}}
\@writefile{toc}{\contentsline {subsubsection}{\numberline {3.1.2}Identification of fluxes}{3}}
\@writefile{toc}{\contentsline {subsubsection}{\numberline {3.1.3}Visualisation of results}{3}}
\@writefile{toc}{\contentsline {subsubsection}{\numberline {3.1.4}Conversion to spreadsheeet format}{4}}
\@writefile{toc}{\contentsline {subsection}{\numberline {3.2}Non-stationary data}{4}}
\@writefile{toc}{\contentsline {subsubsection}{\numberline {3.2.1}Identification of fluxes}{4}}
\@writefile{toc}{\contentsline {subsubsection}{\numberline {3.2.2}Visualisation of results}{5}}
\@writefile{toc}{\contentsline {section}{\numberline {4}User guide (under construction)}{7}}
