// Copyright (C) 2010 - DIGITEO - Michael Baudin
//
// This file must be used under the terms of the CeCILL.
// This source file is licensed as described in the file COPYING, which
// you should have received as part of this distribution.  The terms
// are also available at
// http://www.cecill.info/licences/Licence_CeCILL_V2-en.txt
// <-- JVM NOT MANDATORY -->
// <-- ENGLISH IMPOSED -->
X = sudoku_rootsolution (  );
E = [
1 2 3   4 5 6   7 8 9 
4 5 6   7 8 9   1 2 3 
7 8 9   1 2 3   4 5 6 
..
2 3 4   5 6 7   8 9 1 
5 6 7   8 9 1   2 3 4 
8 9 1   2 3 4   5 6 7 
..
3 4 5   6 7 8   9 1 2 
6 7 8   9 1 2   3 4 5 
9 1 2   3 4 5   6 7 8 
];
assert_checkequal ( X , E );
