// ====================================================================
// Copyright (C) 2011 - Digiteo - Michael Baudin
// 
// This file must be used under the terms of the CeCILL.
// This source file is licensed as described in the file COPYING, which
// you should have received as part of this distribution.  The terms
// are also available at    
// http://www.cecill.info/licences/Licence_CeCILL_V2-en.txt
// ====================================================================
A = [
34.    4.   -10.    0.  -3.
4.     24.  -8.     0.    0.
-10.  -8.     36.    0.    0.
0.     0.     0.     1.    0.
-3.     0.     0.     0.    6.
];
A = sparse(A);
//
spilu_iludplot(A);
delete(gcf());
delete(gcf());
//
spilu_iludplot(A,100);
delete(gcf());
delete(gcf());
//
data = spilu_iludplot(A,100);
assert_checkequal(size(data),[100,6]);
delete(gcf());
delete(gcf());
//
[data,hAlpha,hDrop] = spilu_iludplot(A,100);
delete(hAlpha);
delete(hDrop);
