<?xml version="1.0" encoding="UTF-8"?>
<!DOCTYPE svg PUBLIC '-//W3C//DTD SVG 1.0//EN'
          'http://www.w3.org/TR/2001/REC-SVG-20010904/DTD/svg10.dtd'>
<svg xmlns:xlink="http://www.w3.org/1999/xlink" style="fill-opacity:1; color-rendering:auto; color-interpolation:auto; stroke:black; text-rendering:auto; stroke-linecap:square; stroke-miterlimit:10; stroke-opacity:1; shape-rendering:auto; fill:black; stroke-dasharray:none; font-weight:normal; stroke-width:1; font-family:&apos;Dialog&apos;; font-style:normal; stroke-linejoin:miter; font-size:12; stroke-dashoffset:0; image-rendering:auto;" xmlns="http://www.w3.org/2000/svg"
><!--Generated with Batik SVG Generator--><defs id="genericDefs"
  /><g
  ><defs id="defs1"
    ><linearGradient x1="110" gradientUnits="userSpaceOnUse" x2="110" y1="60" y2="100" id="linearGradient1" spreadMethod="reflect"
      ><stop style="stop-opacity:1; stop-color:red;" offset="0%"
        /><stop style="stop-opacity:1; stop-color:white;" offset="100%"
      /></linearGradient
      ><linearGradient x1="180" gradientUnits="userSpaceOnUse" x2="180" y1="60" y2="100" id="linearGradient2" spreadMethod="reflect"
      ><stop style="stop-opacity:1; stop-color:green;" offset="0%"
        /><stop style="stop-opacity:1; stop-color:white;" offset="100%"
      /></linearGradient
      ><linearGradient x1="10" gradientUnits="userSpaceOnUse" x2="10" y1="60" y2="80" id="linearGradient3" spreadMethod="reflect"
      ><stop style="stop-opacity:1; stop-color:blue;" offset="0%"
        /><stop style="stop-opacity:1; stop-color:white;" offset="100%"
      /></linearGradient
      ><linearGradient x1="310" gradientUnits="userSpaceOnUse" x2="310" y1="60" y2="80" id="linearGradient4" spreadMethod="reflect"
      ><stop style="stop-opacity:1; stop-color:rgb(255,165,0);" offset="0%"
        /><stop style="stop-opacity:1; stop-color:white;" offset="100%"
      /></linearGradient
      ><linearGradient x1="250" gradientUnits="userSpaceOnUse" x2="250" y1="50" y2="90" id="linearGradient5" spreadMethod="reflect"
      ><stop style="stop-opacity:1; stop-color:rgb(205,205,205);" offset="0%"
        /><stop style="stop-opacity:1; stop-color:white;" offset="100%"
      /></linearGradient
      ><linearGradient x1="60" gradientUnits="userSpaceOnUse" x2="60" y1="60" y2="100" id="linearGradient6" spreadMethod="reflect"
      ><stop style="stop-opacity:1; stop-color:rgb(205,205,205);" offset="0%"
        /><stop style="stop-opacity:1; stop-color:white;" offset="100%"
      /></linearGradient
      ><linearGradient x1="180" gradientUnits="userSpaceOnUse" x2="180" y1="30" y2="50" id="linearGradient7" spreadMethod="reflect"
      ><stop style="stop-opacity:1; stop-color:blue;" offset="0%"
        /><stop style="stop-opacity:1; stop-color:white;" offset="100%"
      /></linearGradient
      ><clipPath clipPathUnits="userSpaceOnUse" id="clipPath1"
      ><path d="M0 0 L34 0 L34 30 L0 30 L0 0 Z"
      /></clipPath
      ><clipPath clipPathUnits="userSpaceOnUse" id="clipPath2"
      ><path d="M0 0 L19 0 L19 30 L0 30 L0 0 Z"
      /></clipPath
      ><clipPath clipPathUnits="userSpaceOnUse" id="clipPath3"
      ><path d="M0 0 L11 0 L11 20 L0 20 L0 0 Z"
      /></clipPath
      ><clipPath clipPathUnits="userSpaceOnUse" id="clipPath4"
      ><path d="M0 0 L12 0 L12 20 L0 20 L0 0 Z"
      /></clipPath
      ><clipPath clipPathUnits="userSpaceOnUse" id="clipPath5"
      ><path d="M-0 -0 L64 -0 L64 64 L-0 64 L-0 -0 Z"
      /></clipPath
      ><clipPath clipPathUnits="userSpaceOnUse" id="clipPath6"
      ><path d="M0 0 L64 0 L64 64 L0 64 L0 0 Z"
      /></clipPath
      ><clipPath clipPathUnits="userSpaceOnUse" id="clipPath7"
      ><path d="M0 0 L10 0 L10 20 L0 20 L0 0 Z"
      /></clipPath
      ><clipPath clipPathUnits="userSpaceOnUse" id="clipPath8"
      ><path d="M0 0 L15 0 L15 23 L0 23 L0 0 Z"
      /></clipPath
    ></defs
    ><g style="fill:url(#linearGradient1); stroke:url(#linearGradient1);" transform="translate(-10,-30)"
    ><rect x="110" y="60" width="40" style="stroke:none;" rx="3" ry="3" height="40"
      /><rect x="110" y="60" width="40" style="fill:none; stroke:black; stroke-width:0.5;" rx="3" ry="3" height="40"
    /></g
    ><g style="text-rendering:geometricPrecision; font-size:20; font-weight:bold; font-family:&apos;Arial&apos;;" transform="translate(106,38)"
    ><path d="M12.9844 18.1875 Q14.0469 18.9375 15.2969 19.3906 L14.2344 21.4375 Q13.5781 21.2344 12.9531 20.9062 Q12.8125 20.8281 11.0312 19.625 Q9.625 20.25 7.9062 20.25 Q4.6094 20.25 2.7422 18.3047 Q0.875 16.3594 0.875 12.8438 Q0.875 9.3281 2.75 7.3828 Q4.625 5.4375 7.8281 5.4375 Q11.0156 5.4375 12.8828 7.3828 Q14.75 9.3281 14.75 12.8438 Q14.75 14.7031 14.2344 16.1094 Q13.8438 17.1719 12.9844 18.1875 ZM10.6562 16.5469 Q11.2188 15.8906 11.4922 14.9688 Q11.7656 14.0469 11.7656 12.8438 Q11.7656 10.3594 10.6719 9.1328 Q9.5781 7.9062 7.8125 7.9062 Q6.0469 7.9062 4.9453 9.1406 Q3.8438 10.375 3.8438 12.8438 Q3.8438 15.3438 4.9453 16.5938 Q6.0469 17.8438 7.7188 17.8438 Q8.3438 17.8438 8.9062 17.6406 Q8.0312 17.0625 7.125 16.7344 L7.9375 15.0938 Q9.3594 15.5781 10.6562 16.5469 ZM19.7285 5.6875 L19.7285 10.9531 Q21.0566 9.3906 22.9004 9.3906 Q23.8535 9.3906 24.6113 9.7422 Q25.3691 10.0938 25.7598 10.6406 Q26.1504 11.1875 26.291 11.8516 Q26.4316 12.5156 26.4316 13.9219 L26.4316 20 L23.6816 20 L23.6816 14.5156 Q23.6816 12.8906 23.5254 12.4531 Q23.3691 12.0156 22.9707 11.7578 Q22.5723 11.5 21.9785 11.5 Q21.3066 11.5 20.7676 11.8281 Q20.2285 12.1562 19.9785 12.8281 Q19.7285 13.5 19.7285 14.7969 L19.7285 20 L16.9785 20 L16.9785 5.6875 L19.7285 5.6875 Z" style="clip-path:url(#clipPath1); stroke:none;"
    /></g
    ><g transform="translate(-10,-30)"
    ><polygon style="stroke:none;" points=" 102 76 110 80 102 84"
      /><polygon style="fill:none; stroke-width:0.5;" points=" 102 76 110 80 102 84"
    /></g
    ><g transform="translate(-10,-30)"
    ><polygon style="stroke:none;" points=" 150 76 158 80 150 84"
      /><polygon style="fill:none; stroke-width:0.5;" points=" 150 76 158 80 150 84"
    /></g
    ><g style="fill:url(#linearGradient2); stroke:url(#linearGradient2);" transform="translate(-10,-30)"
    ><rect x="180" y="60" width="40" style="stroke:none;" rx="3" ry="3" height="40"
      /><rect x="180" y="60" width="40" style="fill:none; stroke:black; stroke-width:0.5;" rx="3" ry="3" height="40"
    /></g
    ><g style="text-rendering:geometricPrecision; font-size:20; font-weight:bold; font-family:&apos;Arial&apos;;" transform="translate(184,38)"
    ><path d="M1.4531 20 L1.4531 5.6875 L6.0938 5.6875 Q8.7344 5.6875 9.5312 5.8906 Q10.7656 6.2188 11.5938 7.2969 Q12.4219 8.375 12.4219 10.0938 Q12.4219 11.4062 11.9453 12.3047 Q11.4688 13.2031 10.7266 13.7188 Q9.9844 14.2344 9.2344 14.3906 Q8.1875 14.5938 6.2344 14.5938 L4.3438 14.5938 L4.3438 20 L1.4531 20 ZM4.3438 8.1094 L4.3438 12.1719 L5.9219 12.1719 Q7.6406 12.1719 8.2188 11.9453 Q8.7969 11.7188 9.1172 11.2422 Q9.4375 10.7656 9.4375 10.125 Q9.4375 9.3438 8.9844 8.8359 Q8.5312 8.3281 7.8281 8.2031 Q7.3125 8.1094 5.75 8.1094 L4.3438 8.1094 Z" style="clip-path:url(#clipPath2); stroke:none;"
    /></g
    ><g transform="translate(-10,-30)"
    ><polygon style="stroke:none;" points=" 172 76 180 80 172 84"
      /><polygon style="fill:none; stroke-width:0.5;" points=" 172 76 180 80 172 84"
    /></g
    ><g transform="translate(-10,-30)"
    ><polygon style="stroke:none;" points=" 220 76 228 80 220 84"
      /><polygon style="fill:none; stroke-width:0.5;" points=" 220 76 228 80 220 84"
    /></g
    ><g style="fill:url(#linearGradient3); stroke:url(#linearGradient3);" transform="translate(-10,-30)"
    ><polygon style="stroke:none;" points=" 15 60 25 60 30 70 25 80 15 80 10 70"
      /><polygon style="fill:none; stroke-width:0.5; stroke:black;" points=" 15 60 25 60 30 70 25 80 15 80 10 70"
    /></g
    ><g style="text-rendering:geometricPrecision; font-size:11; font-weight:bold; font-family:&apos;Arial&apos;;" transform="translate(8,33)"
    ><path d="M2.2344 11 L0.7188 11 L0.7188 5.2969 L2.125 5.2969 L2.125 6.1094 Q2.4844 5.5312 2.7734 5.3516 Q3.0625 5.1719 3.4219 5.1719 Q3.9375 5.1719 4.4219 5.4531 L3.9531 6.7656 Q3.5781 6.5156 3.25 6.5156 Q2.9219 6.5156 2.7031 6.6953 Q2.4844 6.875 2.3594 7.3281 Q2.2344 7.7812 2.2344 9.2344 L2.2344 11 Z" style="clip-path:url(#clipPath3); stroke:none;"
    /></g
    ><g style="fill:blue; stroke:blue;" transform="translate(-10,-30)"
    ><polygon style="stroke:none;" points=" 30 66 38 70 30 74"
      /><polygon style="fill:none; stroke-width:0.5;" points=" 30 66 38 70 30 74"
    /></g
    ><g style="fill:url(#linearGradient4); stroke:url(#linearGradient4);" transform="translate(-10,-30)"
    ><polygon style="stroke:none;" points=" 315 60 325 60 330 70 325 80 315 80 310 70"
      /><polygon style="fill:none; stroke-width:0.5; stroke:black;" points=" 315 60 325 60 330 70 325 80 315 80 310 70"
    /></g
    ><g style="text-rendering:geometricPrecision; font-size:11; font-weight:bold; font-family:&apos;Arial&apos;;" transform="translate(307,33)"
    ><path d="M0.0781 5.2969 L1.6875 5.2969 L3.0469 9.3438 L4.375 5.2969 L5.9375 5.2969 L3.9219 10.7812 L3.5625 11.7812 Q3.375 12.2812 3.1953 12.5469 Q3.0156 12.8125 2.7812 12.9688 Q2.5469 13.125 2.2031 13.2188 Q1.8594 13.3125 1.4219 13.3125 Q1 13.3125 0.5781 13.2188 L0.4375 12.0469 Q0.7969 12.1094 1.0781 12.1094 Q1.6094 12.1094 1.8594 11.8047 Q2.1094 11.5 2.25 11.0156 L0.0781 5.2969 Z" style="clip-path:url(#clipPath4); stroke:none;"
    /></g
    ><g style="fill:rgb(255,165,0); stroke:rgb(255,165,0);" transform="translate(-10,-30)"
    ><polygon style="stroke:none;" points=" 302 66 310 70 302 74"
      /><polygon style="fill:none; stroke-width:0.5;" points=" 302 66 310 70 302 74"
    /></g
    ><g style="fill:url(#linearGradient5); stroke:url(#linearGradient5);" transform="translate(-10,-30)"
    ><rect x="250" y="50" width="20" style="stroke:none;" rx="3" ry="3" height="40"
      /><rect x="250" y="50" width="20" style="fill:none; stroke:black; stroke-width:0.5;" rx="3" ry="3" height="40"
    /></g
    ><g style="text-rendering:optimizeLegibility; stroke-width:0.5; image-rendering:optimizeSpeed;" transform="translate(241,31) scale(0.2812,0.2812)"
    ><path d="M22.9937 48 L22.9937 44.5312 L38.3375 31.5625 L23.8531 15.4688 L23.8531 13.3125 L50.4625 13.3125 L50.4625 19.375 L47.8531 19.375 L47.8375 18.9375 L47.7125 16.9688 Q47.7125 15.8438 47.4078 15.5234 Q47.1031 15.2031 46.0094 15.2031 L43.5719 15.1875 L30.4156 15.1875 L43.3063 29.7344 L25.8062 44.5312 L43.3844 44.5312 L46.6813 44.3906 Q47.65 44.3906 48.1656 43.9766 Q48.6813 43.5625 48.7438 42.75 L48.8219 40.6094 L48.8375 40.1875 L51.4469 40.1875 L51.4469 48 L22.9937 48 Z" style="clip-path:url(#clipPath5); stroke:none;"
    /></g
    ><g transform="translate(-10,-30)"
    ><polygon style="stroke:none;" points=" 242 56 250 60 242 64"
      /><polygon style="fill:none; stroke-width:0.5;" points=" 242 56 250 60 242 64"
    /></g
    ><g transform="translate(-10,-30)"
    ><polygon style="stroke:none;" points=" 242 76 250 80 242 84"
      /><polygon style="fill:none; stroke-width:0.5;" points=" 242 76 250 80 242 84"
    /></g
    ><g transform="translate(-10,-30)"
    ><polygon style="stroke:none;" points=" 270 66 278 70 270 74"
      /><polygon style="fill:none; stroke-width:0.5;" points=" 270 66 278 70 270 74"
    /></g
    ><g style="fill:url(#linearGradient6); stroke:url(#linearGradient6);" transform="translate(-10,-30)"
    ><rect x="60" y="60" width="20" style="stroke:none;" rx="3" ry="3" height="40"
      /><rect x="60" y="60" width="20" style="fill:none; stroke:black; stroke-width:0.5;" rx="3" ry="3" height="40"
    /></g
    ><g style="text-rendering:optimizeLegibility; stroke-width:0.5; image-rendering:optimizeSpeed;" transform="translate(51,41) scale(0.2812,0.2812)"
    ><path d="M22.9937 48 L22.9937 44.5312 L38.3375 31.5625 L23.8531 15.4688 L23.8531 13.3125 L50.4625 13.3125 L50.4625 19.375 L47.8531 19.375 L47.8375 18.9375 L47.7125 16.9688 Q47.7125 15.8438 47.4078 15.5234 Q47.1031 15.2031 46.0094 15.2031 L43.5719 15.1875 L30.4156 15.1875 L43.3063 29.7344 L25.8062 44.5312 L43.3844 44.5312 L46.6813 44.3906 Q47.65 44.3906 48.1656 43.9766 Q48.6813 43.5625 48.7438 42.75 L48.8219 40.6094 L48.8375 40.1875 L51.4469 40.1875 L51.4469 48 L22.9937 48 Z" style="clip-path:url(#clipPath6); stroke:none;"
    /></g
    ><g transform="translate(-10,-30)"
    ><polygon style="stroke:none;" points=" 52 66 60 70 52 74"
      /><polygon style="fill:none; stroke-width:0.5;" points=" 52 66 60 70 52 74"
    /></g
    ><g style="text-rendering:geometricPrecision; font-size:11; font-family:&apos;Arial&apos;;" transform="translate(55,33)"
    ><path d="M2.75 9.7344 L2.75 7.5625 L0.6094 7.5625 L0.6094 6.6719 L2.75 6.6719 L2.75 4.5156 L3.6719 4.5156 L3.6719 6.6719 L5.8125 6.6719 L5.8125 7.5625 L3.6719 7.5625 L3.6719 9.7344 L2.75 9.7344 Z" style="clip-path:url(#clipPath4); stroke:none;"
    /></g
    ><g transform="translate(-10,-30)"
    ><polygon style="stroke:none;" points=" 52 86 60 90 52 94"
      /><polygon style="fill:none; stroke-width:0.5;" points=" 52 86 60 90 52 94"
    /></g
    ><g style="text-rendering:geometricPrecision; font-size:11; font-family:&apos;Arial&apos;;" transform="translate(55,53)"
    ><path d="M0.3438 8.6406 L0.3438 7.6719 L3.3125 7.6719 L3.3125 8.6406 L0.3438 8.6406 Z" style="clip-path:url(#clipPath7); stroke:none;"
    /></g
    ><g transform="translate(-10,-30)"
    ><polygon style="stroke:none;" points=" 80 76 88 80 80 84"
      /><polygon style="fill:none; stroke-width:0.5;" points=" 80 76 88 80 80 84"
    /></g
    ><g style="fill:rgb(255,165,0); stroke:rgb(255,165,0);" transform="translate(-10,-30)"
    ><rect x="287" width="7" height="7" y="67" style="stroke:none;"
      /><rect x="287" y="67" width="7" style="fill:none; stroke:black; stroke-width:0.5;" height="7"
    /></g
    ><g style="fill:blue; stroke:blue;" transform="translate(-10,-30)"
    ><path style="fill:none;" d="M278.2712 70.1294 L286.5002 70.3788"
    /></g
    ><g style="fill:blue; stroke:blue;" transform="translate(-10,-30)"
    ><path style="fill:none;" d="M294.4997 70.371 L301.5003 70.1451"
    /></g
    ><g style="fill:blue; stroke:blue;" transform="translate(-10,-30)"
    ><path style="fill:none;" d="M290.4596 74.5 L290 120 L40 120 L40 90 L51.5 90"
    /></g
    ><g style="fill:blue; stroke:blue;" transform="translate(-10,-30)"
    ><path style="fill:none;" d="M228.5 80 L241.5 80"
    /></g
    ><g style="fill:blue; stroke:blue;" transform="translate(-10,-30)"
    ><path style="fill:none;" d="M88.5 80 L101.5 80"
    /></g
    ><g style="text-rendering:geometricPrecision; font-size:14; font-weight:bold; font-family:&apos;Arial&apos;;" transform="translate(77,53)"
    ><path d="M5.2031 11.6875 L7.125 12.0156 Q6.75 13.0625 5.9531 13.6172 Q5.1562 14.1719 3.9688 14.1719 Q2.0781 14.1719 1.1562 12.9219 Q0.4375 11.9375 0.4375 10.4219 Q0.4375 8.625 1.3828 7.6016 Q2.3281 6.5781 3.7812 6.5781 Q5.3906 6.5781 6.3281 7.6484 Q7.2656 8.7188 7.2188 10.9219 L2.4062 10.9219 Q2.4375 11.7812 2.8828 12.2578 Q3.3281 12.7344 3.9844 12.7344 Q4.4375 12.7344 4.7422 12.4844 Q5.0469 12.2344 5.2031 11.6875 ZM5.3125 9.75 Q5.2969 8.9062 4.8906 8.4766 Q4.4844 8.0469 3.8906 8.0469 Q3.2656 8.0469 2.8438 8.5 Q2.4375 8.9688 2.4531 9.75 L5.3125 9.75 Z" style="clip-path:url(#clipPath8); stroke:none;"
    /></g
    ><g style="fill:blue; stroke:blue;" transform="translate(-10,-30)"
    ><path style="fill:none;" d="M38.5 70 L51.5 70"
    /></g
    ><g style="fill:url(#linearGradient7); stroke:url(#linearGradient7);" transform="translate(-10,-30)"
    ><polygon style="stroke:none;" points=" 185 30 195 30 200 40 195 50 185 50 180 40"
      /><polygon style="fill:none; stroke-width:0.5; stroke:black;" points=" 185 30 195 30 200 40 195 50 185 50 180 40"
    /></g
    ><g style="text-rendering:geometricPrecision; font-size:11; font-weight:bold; font-family:&apos;Arial&apos;;" transform="translate(177,3)"
    ><path d="M2.3594 11 L0.0625 5.2969 L1.6406 5.2969 L2.7188 8.2031 L3.0312 9.1719 Q3.1562 8.8125 3.1875 8.6875 Q3.2656 8.4531 3.3438 8.2031 L4.4375 5.2969 L5.9844 5.2969 L3.7188 11 L2.3594 11 Z" style="clip-path:url(#clipPath4); stroke:none;"
    /></g
    ><g style="fill:blue; stroke:blue;" transform="translate(-10,-30)"
    ><polygon style="stroke:none;" points=" 200 36 208 40 200 44"
      /><polygon style="fill:none; stroke-width:0.5;" points=" 200 36 208 40 200 44"
    /></g
    ><g style="fill:blue; stroke:blue;" transform="translate(-10,-30)"
    ><path style="fill:none;" d="M208.5 40 L225 40 L225 60 L241.5 60"
    /></g
    ><g style="fill:blue; stroke:blue;" transform="translate(-10,-30)"
    ><path style="fill:none;" d="M158.5 80 L171.5 80"
    /></g
  ></g
></svg
>
