<?xml version="1.0" encoding="UTF-8" standalone="no"?>
<!-- Generator: Adobe Illustrator 14.0.0, SVG Export Plug-In . SVG Version: 6.00 Build 43363)  -->

<svg
   xmlns:dc="http://purl.org/dc/elements/1.1/"
   xmlns:cc="http://creativecommons.org/ns#"
   xmlns:rdf="http://www.w3.org/1999/02/22-rdf-syntax-ns#"
   xmlns:svg="http://www.w3.org/2000/svg"
   xmlns="http://www.w3.org/2000/svg"
   xmlns:sodipodi="http://sodipodi.sourceforge.net/DTD/sodipodi-0.dtd"
   xmlns:inkscape="http://www.inkscape.org/namespaces/inkscape"
   version="1.1"
   id="Calque_1"
   x="0px"
   y="0px"
   width="40px"
   height="40px"
   viewBox="0 0 40 40"
   enable-background="new 0 0 40 40"
   xml:space="preserve"
   inkscape:version="0.48.2 r9819"
   sodipodi:docname="Valve22.svg"><metadata
   id="metadata3010"><rdf:RDF><cc:Work
       rdf:about=""><dc:format>image/svg+xml</dc:format><dc:type
         rdf:resource="http://purl.org/dc/dcmitype/StillImage" /><dc:title /></cc:Work></rdf:RDF></metadata><defs
   id="defs3008"><marker
     inkscape:stockid="TriangleInS"
     orient="auto"
     refY="0.0"
     refX="0.0"
     id="TriangleInS"
     style="overflow:visible"><path
       id="path4159"
       d="M 5.77,0.0 L -2.88,5.0 L -2.88,-5.0 L 5.77,0.0 z "
       style="fill-rule:evenodd;stroke:#000000;stroke-width:1.0pt;marker-start:none"
       transform="scale(-0.2)" /></marker><marker
     inkscape:stockid="TriangleOutS"
     orient="auto"
     refY="0.0"
     refX="0.0"
     id="TriangleOutS"
     style="overflow:visible"><path
       id="path4168"
       d="M 5.77,0.0 L -2.88,5.0 L -2.88,-5.0 L 5.77,0.0 z "
       style="fill-rule:evenodd;stroke:#000000;stroke-width:1.0pt;marker-start:none"
       transform="scale(0.2)" /></marker><marker
     inkscape:stockid="TriangleOutS"
     orient="auto"
     refY="0"
     refX="0"
     id="TriangleOutS-1"
     style="overflow:visible"><path
       inkscape:connector-curvature="0"
       id="path4168-4"
       d="m 5.77,0 -8.65,5 0,-10 8.65,5 z"
       style="fill-rule:evenodd;stroke:#000000;stroke-width:1pt;marker-start:none"
       transform="scale(0.2,0.2)" /></marker><marker
     inkscape:stockid="TriangleOutS"
     orient="auto"
     refY="0"
     refX="0"
     id="TriangleOutS-1-6"
     style="overflow:visible"><path
       inkscape:connector-curvature="0"
       id="path4168-4-8"
       d="m 5.77,0 -8.65,5 0,-10 8.65,5 z"
       style="fill-rule:evenodd;stroke:#000000;stroke-width:1pt;marker-start:none"
       transform="scale(0.2,0.2)" /></marker><marker
     inkscape:stockid="TriangleOutS"
     orient="auto"
     refY="0"
     refX="0"
     id="TriangleOutS-7"
     style="overflow:visible"><path
       inkscape:connector-curvature="0"
       id="path4168-6"
       d="m 5.77,0 -8.65,5 0,-10 8.65,5 z"
       style="fill-rule:evenodd;stroke:#000000;stroke-width:1pt;marker-start:none"
       transform="scale(0.2,0.2)" /></marker></defs><sodipodi:namedview
   pagecolor="#ffffff"
   bordercolor="#666666"
   borderopacity="1"
   objecttolerance="10"
   gridtolerance="10"
   guidetolerance="10"
   inkscape:pageopacity="0"
   inkscape:pageshadow="2"
   inkscape:window-width="1280"
   inkscape:window-height="962"
   id="namedview3006"
   showgrid="false"
   inkscape:zoom="11.8"
   inkscape:cx="12.158823"
   inkscape:cy="11.974669"
   inkscape:window-x="-8"
   inkscape:window-y="-8"
   inkscape:window-maximized="1"
   inkscape:current-layer="g3002" />
<g
   id="g3002">
	




<rect
   style="fill:none;stroke:#000000;stroke-width:0.88599044;stroke-opacity:1"
   id="rect3794"
   width="12.576015"
   height="25.87347"
   x="12.955856"
   y="6.480145" /><path
   style="fill:none;stroke:#000000;stroke-width:0.97371095px;stroke-linecap:butt;stroke-linejoin:miter;stroke-opacity:1"
   d="m 27.391715,6.110033 c -0.08475,26.756069 0,26.756069 0,26.756069"
   id="path3016-1-7"
   inkscape:connector-curvature="0" /><path
   style="fill:none;stroke:#000000;stroke-width:1px;stroke-linecap:butt;stroke-linejoin:miter;stroke-opacity:1"
   d="m 18.686439,38.686441 2.457628,-1.525424 -2.20339,-1.271186 2.118643,-1.440678 -2.542372,-1.271187"
   id="path3758-1"
   inkscape:connector-curvature="0"
   sodipodi:nodetypes="ccccc" /><rect
   style="fill:none;stroke:#0000ff;stroke-width:0.69999999;stroke-miterlimit:4;stroke-opacity:1;stroke-dasharray:none"
   id="rect3796-4"
   width="3.4745762"
   height="4.1525426"
   x="17.447882"
   y="1.6283896" /><path
   style="fill:none;stroke:#0000f6;stroke-width:1px;stroke-linecap:butt;stroke-linejoin:miter;stroke-opacity:1"
   d="m 17.617374,5.6453396 3.220339,-3.983051"
   id="path3800-0"
   inkscape:connector-curvature="0" /><path
   style="fill:none;stroke:#0000fc;stroke-width:0.92466444px;stroke-linecap:butt;stroke-linejoin:miter;stroke-opacity:1"
   d="M 17.532628,3.018221 C 4.9973942,2.933475 4.9973942,2.933475 4.9973942,2.933475"
   id="path3802-9"
   inkscape:connector-curvature="0" /><path
   style="fill:none;stroke:#000000;stroke-width:1px;stroke-linecap:butt;stroke-linejoin:miter;stroke-opacity:1"
   d="M 13.432204,19.5339 25.211865,19.44915"
   id="path3828-4"
   inkscape:connector-curvature="0" /><path
   style="fill:none;stroke:#000000;stroke-width:0.98017216px;stroke-linecap:butt;stroke-linejoin:miter;stroke-opacity:1"
   d="m 11.205274,5.8050847 c -0.08475,27.1123383 0,27.1123383 0,27.1123383"
   id="path3016-1"
   inkscape:connector-curvature="0" /><path
   style="fill:none;stroke:#005a5a;stroke-width:0.78991288;stroke-linecap:butt;stroke-linejoin:miter;stroke-miterlimit:4;stroke-opacity:1;stroke-dasharray:none"
   d="m -0.01208973,26.067796 13.43933373,0"
   id="path3033-4-8"
   inkscape:connector-curvature="0"
   sodipodi:nodetypes="cc" /><g
   id="g3951"
   transform="translate(0.25423729,4)"><path
     inkscape:connector-curvature="0"
     id="path3895-2"
     d="m 13.177966,22.169492 1.694915,0"
     style="fill:none;stroke:#000000;stroke-width:0.5;stroke-linecap:butt;stroke-linejoin:miter;stroke-miterlimit:4;stroke-opacity:1;stroke-dasharray:none" /><path
     sodipodi:nodetypes="cc"
     inkscape:connector-curvature="0"
     id="path3897-4"
     d="m 15.127118,21.01695 0,2.542373"
     style="fill:none;stroke:#000000;stroke-width:0.5;stroke-linecap:butt;stroke-linejoin:miter;stroke-miterlimit:4;stroke-opacity:1;stroke-dasharray:none" /></g><path
   style="fill:none;stroke:#000000;stroke-width:0.95750028px;stroke-linecap:butt;stroke-linejoin:miter;stroke-opacity:1;marker-end:url(#TriangleOutS-1)"
   d="m 13.389831,13.101695 10.644282,-0.08475"
   id="path4484"
   inkscape:connector-curvature="0" /><path
   style="fill:none;stroke:#005a5a;stroke-width:0.81853622;stroke-linecap:butt;stroke-linejoin:miter;stroke-miterlimit:4;stroke-opacity:1;stroke-dasharray:none"
   d="m 25.242148,26.271187 14.430959,0"
   id="path3033-4-3"
   inkscape:connector-curvature="0"
   sodipodi:nodetypes="cc" /><g
   id="g3929-2"
   transform="matrix(-1,0,0,1,45.525424,7.2711873)"><path
     inkscape:connector-curvature="0"
     id="path3895-5-2"
     d="m 20.381357,19.033897 1.694915,0"
     style="fill:none;stroke:#000000;stroke-width:0.5;stroke-linecap:butt;stroke-linejoin:miter;stroke-miterlimit:4;stroke-opacity:1;stroke-dasharray:none" /><path
     sodipodi:nodetypes="cc"
     inkscape:connector-curvature="0"
     id="path3897-5-1"
     d="m 22.330509,17.881355 0,2.542373"
     style="fill:none;stroke:#000000;stroke-width:0.5;stroke-linecap:butt;stroke-linejoin:miter;stroke-miterlimit:4;stroke-opacity:1;stroke-dasharray:none" /></g><path
   style="fill:none;stroke:#0000fc;stroke-width:0.81168431px;stroke-linecap:butt;stroke-linejoin:miter;stroke-opacity:1"
   d="M 5.3813559,2.9237285 C 5.2966099,12.582869 5.2966099,12.582869 5.2966099,12.582869"
   id="path3802-9-7"
   inkscape:connector-curvature="0" /><path
   style="fill:none;stroke:#0000fc;stroke-width:0.59199053px;stroke-linecap:butt;stroke-linejoin:miter;stroke-opacity:1"
   d="M 5.7203399,12.245763 C 0.58234498,12.161017 0.58234498,12.161017 0.58234498,12.161017"
   id="path3802-9-0"
   inkscape:connector-curvature="0" /></g>
</svg>