<?xml version="1.0" encoding="UTF-8" standalone="no"?>
<!-- Generator: Adobe Illustrator 14.0.0, SVG Export Plug-In . SVG Version: 6.00 Build 43363)  -->

<svg
   xmlns:dc="http://purl.org/dc/elements/1.1/"
   xmlns:cc="http://creativecommons.org/ns#"
   xmlns:rdf="http://www.w3.org/1999/02/22-rdf-syntax-ns#"
   xmlns:svg="http://www.w3.org/2000/svg"
   xmlns="http://www.w3.org/2000/svg"
   xmlns:sodipodi="http://sodipodi.sourceforge.net/DTD/sodipodi-0.dtd"
   xmlns:inkscape="http://www.inkscape.org/namespaces/inkscape"
   version="1.1"
   id="Calque_1"
   x="0px"
   y="0px"
   width="40px"
   height="40px"
   viewBox="0 0 40 40"
   enable-background="new 0 0 40 40"
   xml:space="preserve"
   inkscape:version="0.91 r13725"
   sodipodi:docname="IdealCurrentSourcesStepper.svg"><metadata
     id="metadata17"><rdf:RDF><cc:Work
         rdf:about=""><dc:format>image/svg+xml</dc:format><dc:type
           rdf:resource="http://purl.org/dc/dcmitype/StillImage" /><dc:title></dc:title></cc:Work></rdf:RDF></metadata><defs
     id="defs15" /><sodipodi:namedview
     pagecolor="#ffffff"
     bordercolor="#666666"
     borderopacity="1"
     objecttolerance="10"
     gridtolerance="10"
     guidetolerance="10"
     inkscape:pageopacity="0"
     inkscape:pageshadow="2"
     inkscape:window-width="1920"
     inkscape:window-height="1017"
     id="namedview13"
     showgrid="false"
     inkscape:zoom="5.9"
     inkscape:cx="-10.254237"
     inkscape:cy="20"
     inkscape:window-x="-8"
     inkscape:window-y="-8"
     inkscape:window-maximized="1"
     inkscape:current-layer="Calque_1" /><line
     style="fill:none;stroke:#000000;stroke-width:0.90393496"
     x1="5.7493305"
     y1="10.753672"
     x2="12.045118"
     y2="10.753672"
     id="line3" /><line
     style="fill:none;stroke:#000000;stroke-width:0.90393496"
     x1="27.784588"
     y1="10.753672"
     x2="34.081173"
     y2="10.753672"
     id="line5" /><line
     style="fill:none;stroke:#000000;stroke-width:0.90393496"
     x1="19.91485"
     y1="18.632494"
     x2="19.91485"
     y2="2.8748474"
     id="line7" /><path
     inkscape:connector-curvature="0"
     style="fill:none;stroke:#000000;stroke-width:0.80349773"
     d="m 12.026649,10.711864 c 0,-4.3848064 3.551016,-7.9391206 7.929962,-7.9391206 4.379748,0 7.929962,3.5543142 7.929962,7.9391206 0,4.384807 -3.550214,7.939121 -7.929962,7.939121 -4.378946,0 -7.929962,-3.554314 -7.929962,-7.939121"
     id="path9" /><line
     style="fill:none;stroke:#000000;stroke-width:0.90393496"
     x1="6.1730628"
     y1="29.872314"
     x2="12.46885"
     y2="29.872314"
     id="line3-1" /><line
     style="fill:none;stroke:#000000;stroke-width:0.90393496"
     x1="28.208321"
     y1="29.872314"
     x2="34.504906"
     y2="29.872314"
     id="line5-8" /><line
     style="fill:none;stroke:#000000;stroke-width:0.90393496"
     x1="20.338581"
     y1="37.751137"
     x2="20.338581"
     y2="21.993492"
     id="line7-2" /><path
     inkscape:connector-curvature="0"
     style="fill:none;stroke:#000000;stroke-width:0.80349773"
     d="m 12.450381,29.830508 c 0,-4.384806 3.551016,-7.93912 7.929961,-7.93912 4.379748,0 7.929962,3.554314 7.929962,7.93912 0,4.384807 -3.550214,7.939121 -7.929962,7.939121 -4.378945,0 -7.929961,-3.554314 -7.929961,-7.939121"
     id="path9-2" /></svg>