<?xml version="1.0" encoding="UTF-8" standalone="no"?>
<!-- Generator: Adobe Illustrator 14.0.0, SVG Export Plug-In . SVG Version: 6.00 Build 43363)  -->

<svg
   xmlns:dc="http://purl.org/dc/elements/1.1/"
   xmlns:cc="http://creativecommons.org/ns#"
   xmlns:rdf="http://www.w3.org/1999/02/22-rdf-syntax-ns#"
   xmlns:svg="http://www.w3.org/2000/svg"
   xmlns="http://www.w3.org/2000/svg"
   xmlns:sodipodi="http://sodipodi.sourceforge.net/DTD/sodipodi-0.dtd"
   xmlns:inkscape="http://www.inkscape.org/namespaces/inkscape"
   version="1.1"
   id="Calque_1"
   x="0px"
   y="0px"
   width="40px"
   height="40px"
   viewBox="0 0 40 40"
   enable-background="new 0 0 40 40"
   xml:space="preserve"
   inkscape:version="0.48.2 r9819"
   sodipodi:docname="HydraulicCapacity.svg"><metadata
   id="metadata3010"><rdf:RDF><cc:Work
       rdf:about=""><dc:format>image/svg+xml</dc:format><dc:type
         rdf:resource="http://purl.org/dc/dcmitype/StillImage" /><dc:title /></cc:Work></rdf:RDF></metadata><defs
   id="defs3008"><marker
     inkscape:stockid="TriangleInS"
     orient="auto"
     refY="0.0"
     refX="0.0"
     id="TriangleInS"
     style="overflow:visible"><path
       id="path4159"
       d="M 5.77,0.0 L -2.88,5.0 L -2.88,-5.0 L 5.77,0.0 z "
       style="fill-rule:evenodd;stroke:#000000;stroke-width:1.0pt;marker-start:none"
       transform="scale(-0.2)" /></marker><marker
     inkscape:stockid="TriangleOutS"
     orient="auto"
     refY="0.0"
     refX="0.0"
     id="TriangleOutS"
     style="overflow:visible"><path
       id="path4168"
       d="M 5.77,0.0 L -2.88,5.0 L -2.88,-5.0 L 5.77,0.0 z "
       style="fill-rule:evenodd;stroke:#000000;stroke-width:1.0pt;marker-start:none"
       transform="scale(0.2)" /></marker><marker
     inkscape:stockid="TriangleOutS"
     orient="auto"
     refY="0"
     refX="0"
     id="TriangleOutS-1"
     style="overflow:visible"><path
       inkscape:connector-curvature="0"
       id="path4168-4"
       d="m 5.77,0 -8.65,5 0,-10 8.65,5 z"
       style="fill-rule:evenodd;stroke:#000000;stroke-width:1pt;marker-start:none"
       transform="scale(0.2,0.2)" /></marker><marker
     inkscape:stockid="TriangleOutS"
     orient="auto"
     refY="0"
     refX="0"
     id="TriangleOutS-1-6"
     style="overflow:visible"><path
       inkscape:connector-curvature="0"
       id="path4168-4-8"
       d="m 5.77,0 -8.65,5 0,-10 8.65,5 z"
       style="fill-rule:evenodd;stroke:#000000;stroke-width:1pt;marker-start:none"
       transform="scale(0.2,0.2)" /></marker><marker
     inkscape:stockid="TriangleOutS"
     orient="auto"
     refY="0"
     refX="0"
     id="TriangleOutS-7"
     style="overflow:visible"><path
       inkscape:connector-curvature="0"
       id="path4168-6"
       d="m 5.77,0 -8.65,5 0,-10 8.65,5 z"
       style="fill-rule:evenodd;stroke:#000000;stroke-width:1pt;marker-start:none"
       transform="scale(0.2,0.2)" /></marker></defs><sodipodi:namedview
   pagecolor="#ffffff"
   bordercolor="#666666"
   borderopacity="1"
   objecttolerance="10"
   gridtolerance="10"
   guidetolerance="10"
   inkscape:pageopacity="0"
   inkscape:pageshadow="2"
   inkscape:window-width="1280"
   inkscape:window-height="962"
   id="namedview3006"
   showgrid="false"
   inkscape:zoom="11.8"
   inkscape:cx="11.525193"
   inkscape:cy="11.974669"
   inkscape:window-x="-8"
   inkscape:window-y="-8"
   inkscape:window-maximized="1"
   inkscape:current-layer="g3002" />
<g
   id="g3002">
	




<rect
   style="fill:none;stroke:#005a5a;stroke-width:0.86900002;stroke-linejoin:round;stroke-miterlimit:4;stroke-opacity:1;stroke-dasharray:none"
   id="rect3794"
   width="12.253913"
   height="25.551369"
   x="-25.543839"
   y="3.756315"
   transform="matrix(0,-1,1,0,0,0)"
   ry="4.237288" /><path
   style="fill:none;stroke:#005a5a;stroke-width:0.67501557;stroke-linecap:butt;stroke-linejoin:miter;stroke-miterlimit:4;stroke-opacity:1;stroke-dasharray:none"
   d="m 29.630173,19.203389 9.81402,0"
   id="path3033-4-8"
   inkscape:connector-curvature="0"
   sodipodi:nodetypes="cc" /><path
   style="fill:none;stroke:#005a5a;stroke-width:0.7318809;stroke-linecap:butt;stroke-linejoin:miter;stroke-miterlimit:4;stroke-opacity:1;stroke-dasharray:none"
   d="m 14.067797,25.233138 0,-11.537195"
   id="path3033-4-8-1"
   inkscape:connector-curvature="0"
   sodipodi:nodetypes="cc" /></g>
</svg>