<?xml version="1.0" encoding="UTF-8" standalone="no"?>
<!-- Generator: Adobe Illustrator 14.0.0, SVG Export Plug-In . SVG Version: 6.00 Build 43363)  -->

<svg
   xmlns:dc="http://purl.org/dc/elements/1.1/"
   xmlns:cc="http://creativecommons.org/ns#"
   xmlns:rdf="http://www.w3.org/1999/02/22-rdf-syntax-ns#"
   xmlns:svg="http://www.w3.org/2000/svg"
   xmlns="http://www.w3.org/2000/svg"
   xmlns:sodipodi="http://sodipodi.sourceforge.net/DTD/sodipodi-0.dtd"
   xmlns:inkscape="http://www.inkscape.org/namespaces/inkscape"
   version="1.1"
   id="Calque_1"
   x="0px"
   y="0px"
   width="40px"
   height="40px"
   viewBox="0 0 40 40"
   enable-background="new 0 0 40 40"
   xml:space="preserve"
   inkscape:version="0.91 r13725"
   sodipodi:docname="StepperMotor.svg"><metadata
     id="metadata17"><rdf:RDF><cc:Work
         rdf:about=""><dc:format>image/svg+xml</dc:format><dc:type
           rdf:resource="http://purl.org/dc/dcmitype/StillImage" /><dc:title></dc:title></cc:Work></rdf:RDF></metadata><defs
     id="defs15" /><sodipodi:namedview
     pagecolor="#ffffff"
     bordercolor="#666666"
     borderopacity="1"
     objecttolerance="10"
     gridtolerance="10"
     guidetolerance="10"
     inkscape:pageopacity="0"
     inkscape:pageshadow="2"
     inkscape:window-width="1920"
     inkscape:window-height="1017"
     id="namedview13"
     showgrid="false"
     inkscape:zoom="5.9"
     inkscape:cx="20"
     inkscape:cy="20"
     inkscape:window-x="-8"
     inkscape:window-y="-8"
     inkscape:window-maximized="1"
     inkscape:current-layer="Calque_1" /><line
     x1="7.8793221"
     y1="7.010983"
     x2="7.8793221"
     y2="36.018982"
     id="line3"
     style="fill:none;stroke:#c0c0c0;stroke-width:1.125" /><polygon
     points="5.888,6.672 4.32,2.36 2.752,6.672 "
     id="polygon5"
     transform="translate(3.559322,0)"
     style="fill:#c0c0c0;stroke:#c0c0c0" /><line
     x1="7.2752547"
     y1="19.830507"
     x2="35.700882"
     y2="19.830507"
     id="line7"
     style="fill:none;stroke:#c0c0c0;stroke-width:1.07783175" /><polygon
     fill="#C0C0C0"
     stroke="#C0C0C0"
     points="33.328,21.568 37.641,20 33.328,18.432 "
     id="polygon11" /><polyline
     transform="matrix(0.94017434,0,0,0.54503767,1.0344126,-2.7135109)"
     style="fill:none;stroke:#000000;stroke-width:1.125"
     points="4.32,33.721 12.16,33.721 12.16,11.376 20,11.376 20,33.721   27.84,33.721 27.84,11.376 35.484,11.376 "
     id="polyline11" /><polyline
     transform="matrix(-0.96880799,0,0,0.51615117,39.704946,16.920887)"
     style="fill:none;stroke:#000000;stroke-width:1.125"
     points="4.32,33.721 12.16,33.721 12.16,11.376 20,11.376 20,33.721   27.84,33.721 27.84,11.376 35.484,11.376 "
     id="polyline11-7" /></svg>