<?xml version="1.0" encoding="UTF-8" standalone="no"?>
<!-- Generator: Adobe Illustrator 14.0.0, SVG Export Plug-In . SVG Version: 6.00 Build 43363)  -->

<svg
   xmlns:osb="http://www.openswatchbook.org/uri/2009/osb"
   xmlns:dc="http://purl.org/dc/elements/1.1/"
   xmlns:cc="http://creativecommons.org/ns#"
   xmlns:rdf="http://www.w3.org/1999/02/22-rdf-syntax-ns#"
   xmlns:svg="http://www.w3.org/2000/svg"
   xmlns="http://www.w3.org/2000/svg"
   xmlns:xlink="http://www.w3.org/1999/xlink"
   xmlns:sodipodi="http://sodipodi.sourceforge.net/DTD/sodipodi-0.dtd"
   xmlns:inkscape="http://www.inkscape.org/namespaces/inkscape"
   version="1.1"
   id="Calque_1"
   x="0px"
   y="0px"
   width="40px"
   height="40px"
   viewBox="0 0 40 40"
   enable-background="new 0 0 40 40"
   xml:space="preserve"
   inkscape:version="0.91 r13725"
   sodipodi:docname="TrainEpiType2.svg"><metadata
     id="metadata3010"><rdf:RDF><cc:Work
         rdf:about=""><dc:format>image/svg+xml</dc:format><dc:type
           rdf:resource="http://purl.org/dc/dcmitype/StillImage" /><dc:title /></cc:Work></rdf:RDF></metadata><defs
     id="defs3008"><linearGradient
       inkscape:collect="always"
       xlink:href="#linearGradient5679"
       id="linearGradient5683"
       x1="3.5755594"
       y1="87.923729"
       x2="13.797322"
       y2="87.923729"
       gradientUnits="userSpaceOnUse"
       gradientTransform="matrix(0.38660287,0,0,0.40984679,4.2966915,-0.61492782)" /><linearGradient
       id="linearGradient5679"
       osb:paint="solid"><stop
         style="stop-color:#000000;stop-opacity:1;"
         offset="0"
         id="stop5681" /></linearGradient><linearGradient
       gradientTransform="matrix(0.38660287,0,0,0.40984679,31.871259,-0.96642817)"
       inkscape:collect="always"
       xlink:href="#linearGradient5679"
       id="linearGradient5683-8"
       x1="3.5755594"
       y1="87.923729"
       x2="13.797322"
       y2="87.923729"
       gradientUnits="userSpaceOnUse" /><linearGradient
       gradientTransform="matrix(0.38660287,0,0,0.40984679,20.070763,-0.91975359)"
       inkscape:collect="always"
       xlink:href="#linearGradient5679"
       id="linearGradient5683-8-5"
       x1="3.5755594"
       y1="87.923729"
       x2="13.797322"
       y2="87.923729"
       gradientUnits="userSpaceOnUse" /></defs><sodipodi:namedview
     pagecolor="#ffffff"
     bordercolor="#666666"
     borderopacity="1"
     objecttolerance="10"
     gridtolerance="10"
     guidetolerance="10"
     inkscape:pageopacity="0"
     inkscape:pageshadow="2"
     inkscape:window-width="1920"
     inkscape:window-height="1017"
     id="namedview3006"
     showgrid="false"
     inkscape:zoom="11.8"
     inkscape:cx="-5.3389831"
     inkscape:cy="12.825157"
     inkscape:window-x="-8"
     inkscape:window-y="-8"
     inkscape:window-maximized="1"
     inkscape:current-layer="Calque_1" /><path
     inkscape:connector-curvature="0"
     id="path4136"
     d="m 4.7881352,30.47091 6.7164058,0 0,-8.162203"
     style="fill:none;fill-rule:evenodd;stroke:#000000;stroke-width:0.3980552px;stroke-linecap:butt;stroke-linejoin:miter;stroke-opacity:1" /><path
     inkscape:connector-curvature="0"
     id="path4138"
     d="m 13.558346,22.436774 c -4.3554737,0 -4.511026,0 -4.511026,0"
     style="fill:none;fill-rule:evenodd;stroke:#000000;stroke-width:0.37797898px;stroke-linecap:butt;stroke-linejoin:miter;stroke-opacity:1" /><path
     inkscape:connector-curvature="0"
     id="path4140"
     d="m 11.225057,14.191523 c 0.155552,8.080347 0.155552,8.080347 0.155552,8.080347"
     style="fill:none;fill-rule:evenodd;stroke:#000000;stroke-width:0.37797898px;stroke-linecap:butt;stroke-linejoin:miter;stroke-opacity:1" /><path
     inkscape:connector-curvature="0"
     id="path4138-5"
     d="m 13.636123,14.026619 c -4.3554747,0 -4.5110269,0 -4.5110269,0"
     style="fill:none;fill-rule:evenodd;stroke:#000000;stroke-width:0.37797898px;stroke-linecap:butt;stroke-linejoin:miter;stroke-opacity:1" /><rect
     y="29.0816"
     x="5.7710242"
     height="2.9522862"
     width="3.44011"
     id="rect4174"
     style="fill:none;fill-opacity:1;stroke:#000000;stroke-width:0.18947428;stroke-miterlimit:4;stroke-dasharray:none;stroke-opacity:1" /><rect
     y="34.465183"
     x="5.7710242"
     height="1.9103028"
     width="3.76774"
     id="rect4178"
     style="fill:url(#linearGradient5683);fill-opacity:1;stroke:#000000;stroke-width:0.18947428;stroke-miterlimit:4;stroke-dasharray:none;stroke-opacity:1" /><path
     inkscape:connector-curvature="0"
     id="path5697"
     d="M 7.5729865,35.333499 7.409172,31.686557"
     style="fill:none;fill-rule:evenodd;stroke:#000000;stroke-width:0.3980552px;stroke-linecap:butt;stroke-linejoin:miter;stroke-opacity:1" /><rect
     y="28.730097"
     x="33.345592"
     height="2.9522862"
     width="3.44011"
     id="rect4174-3"
     style="fill:none;fill-opacity:1;stroke:#000000;stroke-width:0.18947428;stroke-miterlimit:4;stroke-dasharray:none;stroke-opacity:1" /><rect
     y="34.113678"
     x="33.345592"
     height="1.9103028"
     width="3.76774"
     id="rect4178-4"
     style="fill:url(#linearGradient5683-8);fill-opacity:1;stroke:#000000;stroke-width:0.18947428;stroke-miterlimit:4;stroke-dasharray:none;stroke-opacity:1" /><path
     inkscape:connector-curvature="0"
     id="path5697-2"
     d="M 35.147554,34.981999 34.98374,31.335057"
     style="fill:none;fill-rule:evenodd;stroke:#000000;stroke-width:0.3980552px;stroke-linecap:butt;stroke-linejoin:miter;stroke-opacity:1" /><rect
     y="28.77783"
     x="21.54608"
     height="2.9501715"
     width="3.5172067"
     id="rect4174-3-3"
     style="fill:none;fill-opacity:1;stroke:#000000;stroke-width:0.19151706;stroke-miterlimit:4;stroke-dasharray:none;stroke-opacity:1" /><rect
     y="34.160358"
     x="21.545094"
     height="1.9103028"
     width="3.76774"
     id="rect4178-4-5"
     style="fill:url(#linearGradient5683-8-5);fill-opacity:1;stroke:#000000;stroke-width:0.18947428;stroke-miterlimit:4;stroke-dasharray:none;stroke-opacity:1" /><path
     inkscape:connector-curvature="0"
     id="path5697-2-9"
     d="M 23.347059,35.028673 23.183244,31.381732"
     style="fill:none;fill-rule:evenodd;stroke:#000000;stroke-width:0.3980552px;stroke-linecap:butt;stroke-linejoin:miter;stroke-opacity:1" /><path
     inkscape:connector-curvature="0"
     id="path4734"
     d="m 5.2230203,28.983051 -0.07907,2.966101"
     style="fill:none;fill-rule:evenodd;stroke:#000000;stroke-width:0.28977972;stroke-linecap:butt;stroke-linejoin:miter;stroke-miterlimit:4;stroke-dasharray:none;stroke-opacity:1" /><path
     inkscape:connector-curvature="0"
     id="path4734-5"
     d="m 9.7695425,29.11017 -0.07907,2.966101"
     style="fill:none;fill-rule:evenodd;stroke:#000000;stroke-width:0.28977972;stroke-linecap:butt;stroke-linejoin:miter;stroke-miterlimit:4;stroke-dasharray:none;stroke-opacity:1" /><path
     inkscape:connector-curvature="0"
     id="path4734-4"
     d="m 21.042491,28.822035 -0.07907,2.966101"
     style="fill:none;fill-rule:evenodd;stroke:#000000;stroke-width:0.28977972;stroke-linecap:butt;stroke-linejoin:miter;stroke-miterlimit:4;stroke-dasharray:none;stroke-opacity:1" /><path
     inkscape:connector-curvature="0"
     id="path4734-40"
     d="m 25.707618,28.822035 -0.07907,2.966101"
     style="fill:none;fill-rule:evenodd;stroke:#000000;stroke-width:0.28977972;stroke-linecap:butt;stroke-linejoin:miter;stroke-miterlimit:4;stroke-dasharray:none;stroke-opacity:1" /><path
     inkscape:connector-curvature="0"
     id="path4734-40-1"
     d="m 32.756353,28.855933 -0.07907,2.966101"
     style="fill:none;fill-rule:evenodd;stroke:#000000;stroke-width:0.28977972;stroke-linecap:butt;stroke-linejoin:miter;stroke-miterlimit:4;stroke-dasharray:none;stroke-opacity:1" /><path
     inkscape:connector-curvature="0"
     id="path4734-40-3"
     d="m 37.42148,28.686442 -0.07907,2.966101"
     style="fill:none;fill-rule:evenodd;stroke:#000000;stroke-width:0.28977972;stroke-linecap:butt;stroke-linejoin:miter;stroke-miterlimit:4;stroke-dasharray:none;stroke-opacity:1" /><path
     inkscape:connector-curvature="0"
     id="path4138-52"
     d="m 29.711372,22.590817 c -4.355473,0 -4.511026,0 -4.511026,0"
     style="fill:none;fill-rule:evenodd;stroke:#000000;stroke-width:0.37797898px;stroke-linecap:butt;stroke-linejoin:miter;stroke-opacity:1" /><path
     inkscape:connector-curvature="0"
     id="path4140-0"
     d="m 27.378083,14.345566 c 0.155552,8.080347 0.155552,8.080347 0.155552,8.080347"
     style="fill:none;fill-rule:evenodd;stroke:#000000;stroke-width:0.37797898px;stroke-linecap:butt;stroke-linejoin:miter;stroke-opacity:1" /><path
     inkscape:connector-curvature="0"
     id="path4138-5-7"
     d="m 29.789149,14.180662 c -4.355474,0 -4.511027,0 -4.511027,0"
     style="fill:none;fill-rule:evenodd;stroke:#000000;stroke-width:0.37797898px;stroke-linecap:butt;stroke-linejoin:miter;stroke-opacity:1" /><path
     inkscape:connector-curvature="0"
     id="path4180"
     d="M 11.239495,18.224796 27.414277,18.38574"
     style="fill:none;fill-rule:evenodd;stroke:#000000;stroke-width:0.47478211;stroke-linecap:butt;stroke-linejoin:miter;stroke-miterlimit:4;stroke-dasharray:none;stroke-opacity:1" /><rect
     y="16.904581"
     x="17.587461"
     height="2.8013773"
     width="3.3398137"
     id="rect4174-3-3-1"
     style="fill:none;fill-opacity:1;stroke:#000000;stroke-width:0.18185775;stroke-miterlimit:4;stroke-dasharray:none;stroke-opacity:1" /><path
     inkscape:connector-curvature="0"
     id="path4734-4-9"
     d="m 17.109272,16.946555 -0.07508,2.816503"
     style="fill:none;fill-rule:evenodd;stroke:#000000;stroke-width:0.27516446;stroke-linecap:butt;stroke-linejoin:miter;stroke-miterlimit:4;stroke-dasharray:none;stroke-opacity:1" /><path
     inkscape:connector-curvature="0"
     id="path4734-40-8"
     d="m 21.53911,16.946555 -0.07508,2.816503"
     style="fill:none;fill-rule:evenodd;stroke:#000000;stroke-width:0.27516446;stroke-linecap:butt;stroke-linejoin:miter;stroke-miterlimit:4;stroke-dasharray:none;stroke-opacity:1" /><path
     inkscape:connector-curvature="0"
     id="path4203"
     d="m 19.152542,19.830508 c 0,10.508475 0,10.508475 0,10.508475 l 7.881356,0"
     style="fill:none;fill-rule:evenodd;stroke:#000000;stroke-width:0.5;stroke-linecap:butt;stroke-linejoin:miter;stroke-miterlimit:4;stroke-dasharray:none;stroke-opacity:1" /><path
     style="fill:none;fill-rule:evenodd;stroke:#000000;stroke-width:0.5;stroke-linecap:butt;stroke-linejoin:miter;stroke-miterlimit:4;stroke-dasharray:none;stroke-opacity:1"
     d="m 27.309729,14.24318 0,-5.1638748 4.141983,0 0,21.1634228 6.357465,0"
     id="path4166"
     inkscape:connector-curvature="0" /></svg>