<?xml version="1.0" encoding="UTF-8"?>
<!DOCTYPE svg PUBLIC '-//W3C//DTD SVG 1.0//EN'
          'http://www.w3.org/TR/2001/REC-SVG-20010904/DTD/svg10.dtd'>
<svg xmlns:xlink="http://www.w3.org/1999/xlink" style="fill-opacity:1; color-rendering:auto; color-interpolation:auto; text-rendering:auto; stroke:black; stroke-linecap:square; stroke-miterlimit:10; shape-rendering:auto; stroke-opacity:1; fill:black; stroke-dasharray:none; font-weight:normal; stroke-width:1; font-family:'Dialog'; font-style:normal; stroke-linejoin:miter; font-size:12px; stroke-dashoffset:0; image-rendering:auto;" width="610" height="460" xmlns="http://www.w3.org/2000/svg"
><!--Generated by Scilab with Batik SVG Generator--><defs id="genericDefs"
  /><g
  ><defs id="defs1"
    ><clipPath clipPathUnits="userSpaceOnUse" id="clipPath1"
      ><path d="M97.9959 22.9959 L512.0042 22.9959 L512.0042 437.0042 L97.9959 437.0042 L97.9959 22.9959 Z"
      /></clipPath
      ><font horiz-adv-x="44.0" id="font1"
      ><font-face ascent="92.77344" descent="24.414062" units-per-em="100" style="font-style:normal; font-family:sans-serif; font-weight:normal;"
        /><missing-glyph horiz-adv-x="44.0" d="M4.8906 0 L4.8906 71.0938 L39.4531 71.0938 L39.4531 0 L4.8906 0 ZM9.4688 68.4531 L22.0781 38.875 L34.625 68.4531 L9.4688 68.4531 ZM23.4375 35.5469 L36.8125 4.1094 L36.8125 67 L23.4375 35.5469 ZM7.5156 66.4062 L7.5156 4.6875 L20.6094 35.5469 L7.5156 66.4062 ZM9.4688 2.6406 L34.625 2.6406 L22.0781 32.2344 L9.4688 2.6406 Z"
        /><glyph unicode="0" horiz-adv-x="56.0" d="M50.5312 41.2188 L50.5312 30.375 Q50.5312 12.8906 44.5078 5.9531 Q38.4844 -0.9844 28.125 -0.9844 Q17.9219 -0.9844 11.7656 5.9531 Q5.6094 12.8906 5.6094 30.375 L5.6094 41.2188 Q5.6094 58.6406 11.7188 65.3594 Q17.8281 72.0781 28.0312 72.0781 Q38.375 72.0781 44.4531 65.3594 Q50.5312 58.6406 50.5312 41.2188 ZM41.4531 28.9062 L41.4531 42.7188 Q41.4531 54.7344 38.0391 59.7188 Q34.625 64.7031 28.0312 64.7031 Q21.5781 64.7031 18.1406 59.7188 Q14.7031 54.7344 14.7031 42.7188 L14.7031 28.9062 Q14.7031 17 18.1953 11.7266 Q21.6875 6.4531 28.125 6.4531 Q34.7656 6.4531 38.1094 11.7266 Q41.4531 17 41.4531 28.9062 Z"
        /><glyph unicode="8" horiz-adv-x="56.0" d="M50.6875 19.2344 Q50.6875 9.4688 44.1641 4.2422 Q37.6406 -0.9844 28.0781 -0.9844 Q18.5 -0.9844 11.9844 4.2422 Q5.4688 9.4688 5.4688 19.2344 Q5.4688 25.2031 8.6641 29.7656 Q11.8594 34.3281 17.3281 36.6719 Q12.5938 38.9688 9.8359 43.1641 Q7.0781 47.3594 7.0781 52.5938 Q7.0781 61.9219 13.0156 67 Q18.9531 72.0781 28.0312 72.0781 Q37.1562 72.0781 43.0938 67 Q49.0312 61.9219 49.0312 52.5938 Q49.0312 47.3125 46.1953 43.1406 Q43.3594 38.9688 38.625 36.6719 Q44.1406 34.3281 47.4141 29.7344 Q50.6875 25.1406 50.6875 19.2344 ZM39.9844 52.4375 Q39.9844 57.7656 36.6641 61.2109 Q33.3438 64.6562 28.0312 64.6562 Q22.7031 64.6562 19.4297 61.3594 Q16.1562 58.0625 16.1562 52.4375 Q16.1562 46.9219 19.4297 43.6016 Q22.7031 40.2812 28.0781 40.2812 Q33.4062 40.2812 36.6953 43.6016 Q39.9844 46.9219 39.9844 52.4375 ZM41.6094 19.4375 Q41.6094 25.3906 37.8203 29.1484 Q34.0312 32.9062 27.9844 32.9062 Q21.7812 32.9062 18.1406 29.1484 Q14.5 25.3906 14.5 19.4375 Q14.5 13.2812 18.1406 9.8672 Q21.7812 6.4531 28.0781 6.4531 Q34.375 6.4531 37.9922 9.8672 Q41.6094 13.2812 41.6094 19.4375 Z"
        /><glyph unicode="-" horiz-adv-x="28.0" d="M25.6875 33.9375 L25.6875 26.5156 L1.8594 26.5156 L1.8594 33.9375 L25.6875 33.9375 Z"
        /><glyph unicode="6" horiz-adv-x="56.0" d="M51.4219 23.1875 Q51.4219 13.0938 45.7812 6.0547 Q40.1406 -0.9844 29.3438 -0.9844 Q21.6875 -0.9844 16.6094 3.0938 Q11.5312 7.1719 9.0156 13.4531 Q6.5 19.7344 6.5 26.3125 L6.5 30.5625 Q6.5 40.5781 9.3047 49.9062 Q12.1094 59.2344 19.4844 65.2109 Q26.8594 71.1875 40.5781 71.1875 L41.3594 71.1875 L41.3594 63.5312 L40.5781 63.5312 Q31.9375 63.5312 26.6641 60.2109 Q21.3906 56.8906 18.8281 51.5938 Q16.2656 46.2969 15.7188 40.2344 Q18.6562 43.5625 22.5859 45.0938 Q26.5156 46.625 31 46.625 Q38.0938 46.625 42.6094 43.2109 Q47.125 39.7969 49.2734 34.3984 Q51.4219 29 51.4219 23.1875 ZM15.5781 26.0312 Q15.5781 16.5469 19.8047 11.5234 Q24.0312 6.5 29.3438 6.5 Q35.5938 6.5 39.0391 11.0625 Q42.4844 15.625 42.4844 22.75 Q42.4844 29.1094 39.3125 34.1328 Q36.1406 39.1562 29.5469 39.1562 Q24.8125 39.1562 20.9531 36.3281 Q17.0938 33.5 15.5781 29.4375 L15.5781 26.0312 Z"
        /><glyph unicode="4" horiz-adv-x="56.0" d="M2.5938 21.8281 L34.4219 71.0938 L44.0469 71.0938 L44.0469 23.9219 L53.9531 23.9219 L53.9531 16.5 L44.0469 16.5 L44.0469 0 L35.0156 0 L35.0156 16.5 L2.5938 16.5 L2.5938 21.8281 ZM12.8438 23.9219 L35.0156 23.9219 L35.0156 58.8438 L33.8906 56.8438 L12.8438 23.9219 Z"
        /><glyph unicode="2" horiz-adv-x="56.0" d="M52.4844 7.4219 L52.4844 0 L5.9531 0 L5.9531 6.5 L29.25 32.4219 Q35.6875 39.5938 37.9375 43.7266 Q40.1875 47.8594 40.1875 52 Q40.1875 57.2344 36.9375 60.9453 Q33.6875 64.6562 27.7812 64.6562 Q20.6562 64.6562 17.1406 60.6016 Q13.625 56.5469 13.625 50.2031 L4.5938 50.2031 Q4.5938 59.1875 10.5 65.6328 Q16.4062 72.0781 27.7812 72.0781 Q37.8438 72.0781 43.5312 66.8516 Q49.2188 61.625 49.2188 53.0781 Q49.2188 46.7812 45.2891 40.3828 Q41.3594 33.9844 35.8906 28.0781 L16.8438 7.4219 L52.4844 7.4219 Z"
        /><glyph unicode="7" horiz-adv-x="56.0" d="M51.8594 71.0938 L51.8594 66.0156 L22.4062 0 L12.8906 0 L42.2812 63.6719 L3.8125 63.6719 L3.8125 71.0938 L51.8594 71.0938 Z"
        /><glyph unicode="5" horiz-adv-x="56.0" d="M17.3281 33.8438 L10.1094 35.6875 L13.6719 71.0938 L50.1406 71.0938 L50.1406 62.75 L21.3438 62.75 L19.1875 43.4062 Q21.1406 44.5312 24.1484 45.5078 Q27.1562 46.4844 31.0625 46.4844 Q40.875 46.4844 46.5625 40.0156 Q52.25 33.5469 52.25 22.6562 Q52.25 12.4531 46.6797 5.7344 Q41.1094 -0.9844 29.7344 -0.9844 Q21.0938 -0.9844 14.7969 3.875 Q8.5 8.7344 7.5156 18.7031 L16.1094 18.7031 Q17.8281 6.4531 29.7344 6.4531 Q36.1406 6.4531 39.6562 10.7969 Q43.1719 15.1406 43.1719 22.5625 Q43.1719 29.25 39.4844 33.8125 Q35.7969 38.375 28.9531 38.375 Q24.4219 38.375 22.0781 37.1562 Q19.7344 35.9375 17.3281 33.8438 Z"
        /><glyph unicode="3" horiz-adv-x="56.0" d="M25.5312 32.5625 L19.0938 32.5625 L19.0938 39.9844 L25.5312 39.9844 Q32.625 39.9844 36.0859 43.4531 Q39.5469 46.9219 39.5469 52.1562 Q39.5469 64.6562 27.1562 64.6562 Q21.3906 64.6562 17.8281 61.3594 Q14.2656 58.0625 14.2656 52.4844 L5.2188 52.4844 Q5.2188 60.6406 11.25 66.3594 Q17.2812 72.0781 27.1562 72.0781 Q36.7656 72.0781 42.7031 66.9688 Q48.6406 61.8594 48.6406 51.9531 Q48.6406 48 45.9766 43.5078 Q43.3125 39.0156 37.4531 36.5312 Q44.5312 34.2344 47.1172 29.4453 Q49.7031 24.6562 49.7031 19.8281 Q49.7031 9.8594 43.2578 4.4375 Q36.8125 -0.9844 27.2031 -0.9844 Q17.9219 -0.9844 11.2812 4.1719 Q4.6406 9.3281 4.6406 18.7969 L13.6719 18.7969 Q13.6719 13.1875 17.3125 9.8203 Q20.9531 6.4531 27.2031 6.4531 Q33.4062 6.4531 37.0156 9.7188 Q40.625 12.9844 40.625 19.625 Q40.625 26.2656 36.5234 29.4141 Q32.4219 32.5625 25.5312 32.5625 Z"
        /><glyph unicode="1" horiz-adv-x="56.0" d="M35.5938 71.4844 L35.5938 0 L26.5625 0 L26.5625 60.2031 L8.3438 53.5625 L8.3438 61.7188 L34.1875 71.4844 L35.5938 71.4844 Z"
      /></font
    ></defs
    ><g style="fill:white; text-rendering:optimizeLegibility; stroke:white;"
    ><rect x="0" width="610" height="460" y="0" style="stroke:none;"
    /></g
    ><g style="stroke-linecap:butt; fill:white; text-rendering:geometricPrecision; stroke-linejoin:bevel; shape-rendering:crispEdges; stroke:white; stroke-width:0;"
    ><path style="stroke:none;" d="M512 23 L512 437 L98 23 Z"
      /><path style="stroke:none;" d="M512 437 L98 437 L98 23 Z"
      /><path style="stroke:none;" d="M512 23 L512 437 L512 437 Z"
      /><path style="stroke:none;" d="M98 23 L98 437 L98 437 Z"
      /><path style="stroke:none;" d="M512 23 L512 437 L98 23 Z"
      /><path style="stroke:none;" d="M512 437 L98 437 L98 23 Z"
      /><path style="stroke:none;" d="M512 23 L512 23 L512 437 Z"
      /><path style="stroke:none;" d="M98 23 L98 23 L98 437 Z"
      /><path style="stroke:none;" d="M512 23 L98 23 L512 23 Z"
      /><path style="stroke:none;" d="M98 23 L98 23 L512 23 Z"
      /><path style="stroke:none;" d="M512 437 L98 437 L512 437 Z"
      /><path style="stroke:none;" d="M98 437 L98 437 L512 437 Z"
    /></g
    ><g transform="translate(301.5,446)" style="font-size:10px; stroke-linecap:butt; text-rendering:geometricPrecision; font-family:sans-serif; stroke-linejoin:bevel; stroke-width:0;"
    ><text x="-0.5625" xml:space="preserve" y="9.2773" style="stroke:none;"
      >0</text
    ></g
    ><g transform="translate(90,446)" style="font-size:10px; stroke-linecap:butt; text-rendering:geometricPrecision; font-family:sans-serif; stroke-linejoin:bevel; stroke-width:0;"
    ><text x="-0.1875" xml:space="preserve" y="9.2773" style="stroke:none;"
      >-80</text
    ></g
    ><g transform="translate(141.75,446)" style="font-size:10px; stroke-linecap:butt; text-rendering:geometricPrecision; font-family:sans-serif; stroke-linejoin:bevel; stroke-width:0;"
    ><text x="-0.1875" xml:space="preserve" y="9.2773" style="stroke:none;"
      >-60</text
    ></g
    ><g transform="translate(193.5,446)" style="font-size:10px; stroke-linecap:butt; text-rendering:geometricPrecision; font-family:sans-serif; stroke-linejoin:bevel; stroke-width:0;"
    ><text x="-0.1875" xml:space="preserve" y="9.2773" style="stroke:none;"
      >-40</text
    ></g
    ><g transform="translate(245.25,446)" style="font-size:10px; stroke-linecap:butt; text-rendering:geometricPrecision; font-family:sans-serif; stroke-linejoin:bevel; stroke-width:0;"
    ><text x="-0.1875" xml:space="preserve" y="9.2773" style="stroke:none;"
      >-20</text
    ></g
    ><g transform="translate(350.25,446)" style="font-size:10px; stroke-linecap:butt; text-rendering:geometricPrecision; font-family:sans-serif; stroke-linejoin:bevel; stroke-width:0;"
    ><text x="-0.4531" xml:space="preserve" y="9.2773" style="stroke:none;"
      >20</text
    ></g
    ><g transform="translate(402,446)" style="font-size:10px; stroke-linecap:butt; text-rendering:geometricPrecision; font-family:sans-serif; stroke-linejoin:bevel; stroke-width:0;"
    ><text x="-0.2656" xml:space="preserve" y="9.2773" style="stroke:none;"
      >40</text
    ></g
    ><g transform="translate(453.75,446)" style="font-size:10px; stroke-linecap:butt; text-rendering:geometricPrecision; font-family:sans-serif; stroke-linejoin:bevel; stroke-width:0;"
    ><text x="-0.6562" xml:space="preserve" y="9.2773" style="stroke:none;"
      >60</text
    ></g
    ><g transform="translate(505.5,446)" style="font-size:10px; stroke-linecap:butt; text-rendering:geometricPrecision; font-family:sans-serif; stroke-linejoin:bevel; stroke-width:0;"
    ><text x="-0.5469" xml:space="preserve" y="9.2773" style="stroke:none;"
      >80</text
    ></g
    ><g style="text-rendering:geometricPrecision; font-size:10px; shape-rendering:crispEdges; font-family:sans-serif; stroke-linecap:butt;"
    ><path style="fill:none;" d="M98 437 L98 443"
      /><path style="fill:none;" d="M149.75 437 L149.75 443"
      /><path style="fill:none;" d="M201.5 437 L201.5 443"
      /><path style="fill:none;" d="M253.25 437 L253.25 443"
      /><path style="fill:none;" d="M305 437 L305 443"
      /><path style="fill:none;" d="M356.75 437 L356.75 443"
      /><path style="fill:none;" d="M408.5 437 L408.5 443"
      /><path style="fill:none;" d="M460.25 437 L460.25 443"
      /><path style="fill:none;" d="M512 437 L512 443"
      /><path style="fill:none;" d="M98 437 L98 440"
      /><path style="fill:none;" d="M123.875 437 L123.875 440"
      /><path style="fill:none;" d="M149.75 437 L149.75 440"
      /><path style="fill:none;" d="M175.625 437 L175.625 440"
      /><path style="fill:none;" d="M201.5 437 L201.5 440"
      /><path style="fill:none;" d="M227.375 437 L227.375 440"
      /><path style="fill:none;" d="M253.25 437 L253.25 440"
      /><path style="fill:none;" d="M279.125 437 L279.125 440"
      /><path style="fill:none;" d="M305 437 L305 440"
      /><path style="fill:none;" d="M330.875 437 L330.875 440"
      /><path style="fill:none;" d="M356.75 437 L356.75 440"
      /><path style="fill:none;" d="M382.625 437 L382.625 440"
      /><path style="fill:none;" d="M408.5 437 L408.5 440"
      /><path style="fill:none;" d="M434.375 437 L434.375 440"
      /><path style="fill:none;" d="M460.25 437 L460.25 440"
      /><path style="fill:none;" d="M486.125 437 L486.125 440"
      /><path style="fill:none;" d="M512 437 L512 440"
      /><path style="fill:none;" d="M512 437 L98 437"
      /><text x="-0.5625" y="9.2773" transform="translate(82,223.5)" style="stroke-linejoin:bevel; shape-rendering:auto; stroke:none; stroke-width:0;" xml:space="preserve"
      >0</text
    ></g
    ><g transform="translate(73,430.5)" style="font-size:10px; stroke-linecap:butt; text-rendering:geometricPrecision; font-family:sans-serif; stroke-linejoin:bevel; stroke-width:0;"
    ><text x="-0.1875" xml:space="preserve" y="9.2773" style="stroke:none;"
      >-80</text
    ></g
    ><g transform="translate(73,378.75)" style="font-size:10px; stroke-linecap:butt; text-rendering:geometricPrecision; font-family:sans-serif; stroke-linejoin:bevel; stroke-width:0;"
    ><text x="-0.1875" xml:space="preserve" y="9.2773" style="stroke:none;"
      >-60</text
    ></g
    ><g transform="translate(73,327)" style="font-size:10px; stroke-linecap:butt; text-rendering:geometricPrecision; font-family:sans-serif; stroke-linejoin:bevel; stroke-width:0;"
    ><text x="-0.1875" xml:space="preserve" y="9.2773" style="stroke:none;"
      >-40</text
    ></g
    ><g transform="translate(73,275.25)" style="font-size:10px; stroke-linecap:butt; text-rendering:geometricPrecision; font-family:sans-serif; stroke-linejoin:bevel; stroke-width:0;"
    ><text x="-0.1875" xml:space="preserve" y="9.2773" style="stroke:none;"
      >-20</text
    ></g
    ><g transform="translate(76,171.75)" style="font-size:10px; stroke-linecap:butt; text-rendering:geometricPrecision; font-family:sans-serif; stroke-linejoin:bevel; stroke-width:0;"
    ><text x="-0.4531" xml:space="preserve" y="9.2773" style="stroke:none;"
      >20</text
    ></g
    ><g transform="translate(76,120)" style="font-size:10px; stroke-linecap:butt; text-rendering:geometricPrecision; font-family:sans-serif; stroke-linejoin:bevel; stroke-width:0;"
    ><text x="-0.2656" xml:space="preserve" y="9.2773" style="stroke:none;"
      >40</text
    ></g
    ><g transform="translate(76,68.25)" style="font-size:10px; stroke-linecap:butt; text-rendering:geometricPrecision; font-family:sans-serif; stroke-linejoin:bevel; stroke-width:0;"
    ><text x="-0.6562" xml:space="preserve" y="9.2773" style="stroke:none;"
      >60</text
    ></g
    ><g transform="translate(76,16.5)" style="font-size:10px; stroke-linecap:butt; text-rendering:geometricPrecision; font-family:sans-serif; stroke-linejoin:bevel; stroke-width:0;"
    ><text x="-0.5469" xml:space="preserve" y="9.2773" style="stroke:none;"
      >80</text
    ></g
    ><g transform="translate(73,404.625)" style="font-size:10px; stroke-linecap:butt; text-rendering:geometricPrecision; font-family:sans-serif; stroke-linejoin:bevel; stroke-width:0;"
    ><text x="-0.1875" xml:space="preserve" y="9.2773" style="stroke:none;"
      >-70</text
    ></g
    ><g transform="translate(73,352.875)" style="font-size:10px; stroke-linecap:butt; text-rendering:geometricPrecision; font-family:sans-serif; stroke-linejoin:bevel; stroke-width:0;"
    ><text x="-0.1875" xml:space="preserve" y="9.2773" style="stroke:none;"
      >-50</text
    ></g
    ><g transform="translate(73,301.125)" style="font-size:10px; stroke-linecap:butt; text-rendering:geometricPrecision; font-family:sans-serif; stroke-linejoin:bevel; stroke-width:0;"
    ><text x="-0.1875" xml:space="preserve" y="9.2773" style="stroke:none;"
      >-30</text
    ></g
    ><g transform="translate(73,249.375)" style="font-size:10px; stroke-linecap:butt; text-rendering:geometricPrecision; font-family:sans-serif; stroke-linejoin:bevel; stroke-width:0;"
    ><text x="-0.1875" xml:space="preserve" y="9.2773" style="stroke:none;"
      >-10</text
    ></g
    ><g transform="translate(76,197.625)" style="font-size:10px; stroke-linecap:butt; text-rendering:geometricPrecision; font-family:sans-serif; stroke-linejoin:bevel; stroke-width:0;"
    ><text x="-0.8281" xml:space="preserve" y="9.2773" style="stroke:none;"
      >10</text
    ></g
    ><g transform="translate(76,145.875)" style="font-size:10px; stroke-linecap:butt; text-rendering:geometricPrecision; font-family:sans-serif; stroke-linejoin:bevel; stroke-width:0;"
    ><text x="-0.4688" xml:space="preserve" y="9.2773" style="stroke:none;"
      >30</text
    ></g
    ><g transform="translate(76,94.125)" style="font-size:10px; stroke-linecap:butt; text-rendering:geometricPrecision; font-family:sans-serif; stroke-linejoin:bevel; stroke-width:0;"
    ><text x="-0.75" xml:space="preserve" y="9.2773" style="stroke:none;"
      >50</text
    ></g
    ><g transform="translate(76,42.375)" style="font-size:10px; stroke-linecap:butt; text-rendering:geometricPrecision; font-family:sans-serif; stroke-linejoin:bevel; stroke-width:0;"
    ><text x="-0.375" xml:space="preserve" y="9.2773" style="stroke:none;"
      >70</text
    ></g
    ><g style="text-rendering:geometricPrecision; font-size:10px; shape-rendering:crispEdges; font-family:sans-serif; stroke-linecap:butt;"
    ><path style="fill:none;" d="M98 437 L92 437"
      /><path style="fill:none;" d="M98 411.125 L92 411.125"
      /><path style="fill:none;" d="M98 385.25 L92 385.25"
      /><path style="fill:none;" d="M98 359.375 L92 359.375"
      /><path style="fill:none;" d="M98 333.5 L92 333.5"
      /><path style="fill:none;" d="M98 307.625 L92 307.625"
      /><path style="fill:none;" d="M98 281.75 L92 281.75"
      /><path style="fill:none;" d="M98 255.875 L92 255.875"
      /><path style="fill:none;" d="M98 230 L92 230"
      /><path style="fill:none;" d="M98 204.125 L92 204.125"
      /><path style="fill:none;" d="M98 178.25 L92 178.25"
      /><path style="fill:none;" d="M98 152.375 L92 152.375"
      /><path style="fill:none;" d="M98 126.5 L92 126.5"
      /><path style="fill:none;" d="M98 100.625 L92 100.625"
      /><path style="fill:none;" d="M98 74.75 L92 74.75"
      /><path style="fill:none;" d="M98 48.875 L92 48.875"
      /><path style="fill:none;" d="M98 23 L92 23"
      /><path style="fill:none;" d="M98 437 L95 437"
      /><path style="fill:none;" d="M98 424.0625 L95 424.0625"
      /><path style="fill:none;" d="M98 411.125 L95 411.125"
      /><path style="fill:none;" d="M98 398.1875 L95 398.1875"
      /><path style="fill:none;" d="M98 385.25 L95 385.25"
      /><path style="fill:none;" d="M98 372.3125 L95 372.3125"
      /><path style="fill:none;" d="M98 359.375 L95 359.375"
      /><path style="fill:none;" d="M98 346.4375 L95 346.4375"
      /><path style="fill:none;" d="M98 333.5 L95 333.5"
      /><path style="fill:none;" d="M98 320.5625 L95 320.5625"
      /><path style="fill:none;" d="M98 307.625 L95 307.625"
      /><path style="fill:none;" d="M98 294.6875 L95 294.6875"
      /><path style="fill:none;" d="M98 281.75 L95 281.75"
      /><path style="fill:none;" d="M98 268.8125 L95 268.8125"
      /><path style="fill:none;" d="M98 255.875 L95 255.875"
      /><path style="fill:none;" d="M98 242.9375 L95 242.9375"
      /><path style="fill:none;" d="M98 230 L95 230"
      /><path style="fill:none;" d="M98 217.0625 L95 217.0625"
      /><path style="fill:none;" d="M98 204.125 L95 204.125"
      /><path style="fill:none;" d="M98 191.1875 L95 191.1875"
      /><path style="fill:none;" d="M98 178.25 L95 178.25"
      /><path style="fill:none;" d="M98 165.3125 L95 165.3125"
      /><path style="fill:none;" d="M98 152.375 L95 152.375"
      /><path style="fill:none;" d="M98 139.4375 L95 139.4375"
      /><path style="fill:none;" d="M98 126.5 L95 126.5"
      /><path style="fill:none;" d="M98 113.5625 L95 113.5625"
      /><path style="fill:none;" d="M98 100.625 L95 100.625"
      /><path style="fill:none;" d="M98 87.6875 L95 87.6875"
      /><path style="fill:none;" d="M98 74.75 L95 74.75"
      /><path style="fill:none;" d="M98 61.8125 L95 61.8125"
      /><path style="fill:none;" d="M98 48.875 L95 48.875"
      /><path style="fill:none;" d="M98 35.9375 L95 35.9375"
      /><path style="fill:none;" d="M98 23 L95 23"
      /><path style="fill:none;" d="M98 23 L98 437"
    /></g
    ><g style="stroke-linecap:butt; font-size:10px; fill:rgb(223,128,21); text-rendering:geometricPrecision; font-family:sans-serif; stroke-linejoin:bevel; shape-rendering:crispEdges; stroke:rgb(223,128,21); stroke-width:0;"
    ><path style="stroke:none;" d="M424.6363 138.1999 L444.3194 172.292 L477.0066 158.7525 Z"
      /><path style="stroke:none;" d="M424.6363 138.1999 L477.0066 158.7525 L452.7054 116.6616 Z"
    /></g
    ><g style="text-rendering:geometricPrecision; stroke-width:2; font-size:10px; shape-rendering:crispEdges; font-family:sans-serif; stroke-linecap:butt;"
    ><path style="fill:none;" d="M424.6363 138.1999 L444.3194 172.292 L477.0066 158.7525 L452.7054 116.6616 L424.6363 138.1999 L424.6363 138.1999"
    /></g
    ><g style="stroke-linecap:butt; font-size:10px; fill:rgb(223,128,21); text-rendering:geometricPrecision; font-family:sans-serif; stroke-linejoin:bevel; shape-rendering:crispEdges; stroke:rgb(223,128,21); stroke-width:0;"
    ><path style="stroke:none;" d="M362.708 90.6806 L396.8001 110.3637 L418.3383 82.2946 Z"
      /><path style="stroke:none;" d="M362.708 90.6806 L418.3383 82.2946 L376.2475 57.9934 Z"
    /></g
    ><g style="text-rendering:geometricPrecision; stroke-width:2; font-size:10px; shape-rendering:crispEdges; font-family:sans-serif; stroke-linecap:butt;"
    ><path style="fill:none;" d="M362.708 90.6806 L396.8001 110.3637 L418.3383 82.2946 L376.2475 57.9934 L362.708 90.6806 L362.708 90.6806"
    /></g
    ><g style="stroke-linecap:butt; font-size:10px; fill:rgb(223,128,21); text-rendering:geometricPrecision; font-family:sans-serif; stroke-linejoin:bevel; shape-rendering:crispEdges; stroke:rgb(223,128,21); stroke-width:0;"
    ><path style="stroke:none;" d="M285.3169 80.4919 L324.6831 80.4919 L329.3012 45.4142 Z"
      /><path style="stroke:none;" d="M285.3169 80.4919 L329.3012 45.4142 L280.6988 45.4142 Z"
    /></g
    ><g style="text-rendering:geometricPrecision; stroke-width:2; font-size:10px; shape-rendering:crispEdges; font-family:sans-serif; stroke-linecap:butt;"
    ><path style="fill:none;" d="M285.3169 80.4919 L324.6831 80.4919 L329.3012 45.4142 L280.6988 45.4142 L285.3169 80.4919 L285.3169 80.4919"
    /></g
    ><g style="stroke-linecap:butt; font-size:10px; fill:rgb(223,128,21); text-rendering:geometricPrecision; font-family:sans-serif; stroke-linejoin:bevel; shape-rendering:crispEdges; stroke:rgb(223,128,21); stroke-width:0;"
    ><path style="stroke:none;" d="M213.1999 110.3637 L247.292 90.6806 L233.7525 57.9934 Z"
      /><path style="stroke:none;" d="M213.1999 110.3637 L233.7525 57.9934 L191.6616 82.2946 Z"
    /></g
    ><g style="text-rendering:geometricPrecision; stroke-width:2; font-size:10px; shape-rendering:crispEdges; font-family:sans-serif; stroke-linecap:butt;"
    ><path style="fill:none;" d="M213.1999 110.3637 L247.292 90.6806 L233.7525 57.9934 L191.6616 82.2946 L213.1999 110.3637 L213.1999 110.3637"
    /></g
    ><g style="stroke-linecap:butt; font-size:10px; fill:rgb(223,128,21); text-rendering:geometricPrecision; font-family:sans-serif; stroke-linejoin:bevel; shape-rendering:crispEdges; stroke:rgb(223,128,21); stroke-width:0;"
    ><path style="stroke:none;" d="M165.6806 172.292 L185.3637 138.1999 L157.2946 116.6616 Z"
      /><path style="stroke:none;" d="M165.6806 172.292 L157.2946 116.6616 L132.9934 158.7525 Z"
    /></g
    ><g style="text-rendering:geometricPrecision; stroke-width:2; font-size:10px; shape-rendering:crispEdges; font-family:sans-serif; stroke-linecap:butt;"
    ><path style="fill:none;" d="M165.6806 172.292 L185.3637 138.1999 L157.2946 116.6616 L132.9934 158.7525 L165.6806 172.292 L165.6806 172.292"
    /></g
    ><g style="stroke-linecap:butt; font-size:10px; fill:rgb(223,128,21); text-rendering:geometricPrecision; font-family:sans-serif; stroke-linejoin:bevel; shape-rendering:crispEdges; stroke:rgb(223,128,21); stroke-width:0;"
    ><path style="stroke:none;" d="M155.4919 249.6831 L155.4919 210.3169 L120.4142 205.6988 Z"
      /><path style="stroke:none;" d="M155.4919 249.6831 L120.4142 205.6988 L120.4142 254.3012 Z"
    /></g
    ><g style="text-rendering:geometricPrecision; stroke-width:2; font-size:10px; shape-rendering:crispEdges; font-family:sans-serif; stroke-linecap:butt;"
    ><path style="fill:none;" d="M155.4919 249.6831 L155.4919 210.3169 L120.4142 205.6988 L120.4142 254.3012 L155.4919 249.6831 L155.4919 249.6831"
    /></g
    ><g style="stroke-linecap:butt; font-size:10px; fill:rgb(223,128,21); text-rendering:geometricPrecision; font-family:sans-serif; stroke-linejoin:bevel; shape-rendering:crispEdges; stroke:rgb(223,128,21); stroke-width:0;"
    ><path style="stroke:none;" d="M185.3637 321.8001 L165.6806 287.708 L132.9934 301.2475 Z"
      /><path style="stroke:none;" d="M185.3637 321.8001 L132.9934 301.2475 L157.2946 343.3383 Z"
    /></g
    ><g style="text-rendering:geometricPrecision; stroke-width:2; font-size:10px; shape-rendering:crispEdges; font-family:sans-serif; stroke-linecap:butt;"
    ><path style="fill:none;" d="M185.3637 321.8001 L165.6806 287.708 L132.9934 301.2475 L157.2946 343.3383 L185.3637 321.8001 L185.3637 321.8001"
    /></g
    ><g style="stroke-linecap:butt; font-size:10px; fill:rgb(223,128,21); text-rendering:geometricPrecision; font-family:sans-serif; stroke-linejoin:bevel; shape-rendering:crispEdges; stroke:rgb(223,128,21); stroke-width:0;"
    ><path style="stroke:none;" d="M247.292 369.3194 L213.1999 349.6363 L191.6616 377.7054 Z"
      /><path style="stroke:none;" d="M247.292 369.3194 L191.6616 377.7054 L233.7525 402.0066 Z"
    /></g
    ><g style="text-rendering:geometricPrecision; stroke-width:2; font-size:10px; shape-rendering:crispEdges; font-family:sans-serif; stroke-linecap:butt;"
    ><path style="fill:none;" d="M247.292 369.3194 L213.1999 349.6363 L191.6616 377.7054 L233.7525 402.0066 L247.292 369.3194 L247.292 369.3194"
    /></g
    ><g style="stroke-linecap:butt; font-size:10px; fill:rgb(223,128,21); text-rendering:geometricPrecision; font-family:sans-serif; stroke-linejoin:bevel; shape-rendering:crispEdges; stroke:rgb(223,128,21); stroke-width:0;"
    ><path style="stroke:none;" d="M324.6831 379.5081 L285.3169 379.5081 L280.6988 414.5858 Z"
      /><path style="stroke:none;" d="M324.6831 379.5081 L280.6988 414.5858 L329.3012 414.5858 Z"
    /></g
    ><g style="text-rendering:geometricPrecision; stroke-width:2; font-size:10px; shape-rendering:crispEdges; font-family:sans-serif; stroke-linecap:butt;"
    ><path style="fill:none;" d="M324.6831 379.5081 L285.3169 379.5081 L280.6988 414.5858 L329.3012 414.5858 L324.6831 379.5081 L324.6831 379.5081"
    /></g
    ><g style="stroke-linecap:butt; font-size:10px; fill:rgb(223,128,21); text-rendering:geometricPrecision; font-family:sans-serif; stroke-linejoin:bevel; shape-rendering:crispEdges; stroke:rgb(223,128,21); stroke-width:0;"
    ><path style="stroke:none;" d="M396.8001 349.6363 L362.708 369.3194 L376.2475 402.0066 Z"
      /><path style="stroke:none;" d="M396.8001 349.6363 L376.2475 402.0066 L418.3383 377.7054 Z"
    /></g
    ><g style="text-rendering:geometricPrecision; stroke-width:2; font-size:10px; shape-rendering:crispEdges; font-family:sans-serif; stroke-linecap:butt;"
    ><path style="fill:none;" d="M396.8001 349.6363 L362.708 369.3194 L376.2475 402.0066 L418.3383 377.7054 L396.8001 349.6363 L396.8001 349.6363"
    /></g
    ><g style="stroke-linecap:butt; font-size:10px; fill:rgb(223,128,21); text-rendering:geometricPrecision; font-family:sans-serif; stroke-linejoin:bevel; shape-rendering:crispEdges; stroke:rgb(223,128,21); stroke-width:0;"
    ><path style="stroke:none;" d="M444.3194 287.708 L424.6363 321.8001 L452.7054 343.3383 Z"
      /><path style="stroke:none;" d="M444.3194 287.708 L452.7054 343.3383 L477.0066 301.2475 Z"
    /></g
    ><g style="text-rendering:geometricPrecision; stroke-width:2; font-size:10px; shape-rendering:crispEdges; font-family:sans-serif; stroke-linecap:butt;"
    ><path style="fill:none;" d="M444.3194 287.708 L424.6363 321.8001 L452.7054 343.3383 L477.0066 301.2475 L444.3194 287.708 L444.3194 287.708"
    /></g
    ><g style="stroke-linecap:butt; font-size:10px; fill:rgb(223,128,21); text-rendering:geometricPrecision; font-family:sans-serif; stroke-linejoin:bevel; shape-rendering:crispEdges; stroke:rgb(223,128,21); stroke-width:0;"
    ><path style="stroke:none;" d="M454.5081 210.3169 L454.5081 249.6831 L489.5858 254.3012 Z"
      /><path style="stroke:none;" d="M454.5081 210.3169 L489.5858 254.3012 L489.5858 205.6988 Z"
    /></g
    ><g style="text-rendering:geometricPrecision; stroke-width:2; font-size:10px; shape-rendering:crispEdges; font-family:sans-serif; stroke-linecap:butt;"
    ><path style="fill:none;" d="M454.5081 210.3169 L454.5081 249.6831 L489.5858 254.3012 L489.5858 205.6988 L454.5081 210.3169 L454.5081 210.3169"
    /></g
    ><g style="stroke-linecap:butt; font-size:10px; fill:red; text-rendering:geometricPrecision; font-family:sans-serif; shape-rendering:crispEdges; stroke-dasharray:11,5; stroke:red;"
    ><path d="M455.7982 230 L454.5602 210.7164 L450.8663 191.7493 L444.7774 173.4104 L436.3933 156.0007 L425.8517 139.806 L413.3258 125.0923 L399.0211 112.1012 L383.1727 101.046 L366.0406 92.1082 L347.9062 85.4346 L329.0674 81.1348 L309.8333 79.2793 L290.5199 79.8986 L271.4442 82.9826 L252.9196 88.4807 L235.2501 96.3024 L218.7258 106.3195 L203.6182 118.3674 L190.1753 132.2483 L178.6178 147.7343 L169.1355 164.5711 L161.8841 182.4823 L156.9826 201.1736 L154.5116 220.3383 L154.5116 239.6617 L156.9826 258.8264 L161.8841 277.5178 L169.1355 295.4289 L178.6178 312.2657 L190.1753 327.7517 L203.6182 341.6326 L218.7258 353.6805 L235.2501 363.6976 L252.9196 371.5193 L271.4442 377.0174 L290.5199 380.1014 L309.8333 380.7207 L329.0674 378.8652 L347.9062 374.5654 L366.0406 367.8918 L383.1727 358.954 L399.0211 347.8988 L413.3258 334.9077 L425.8517 320.194 L436.3933 303.9993 L444.7774 286.5896 L450.8663 268.2506 L454.5602 249.2836 L455.7982 230" style="fill:none; clip-path:url(#clipPath1);"
      /><path d="M489.5858 230 L488.0704 206.3957 L483.5489 183.179 L476.0957 160.731 L465.8331 139.4205 L452.9296 119.5973 L437.5971 101.5869 L420.0874 85.685 L400.6879 72.1528 L379.7173 61.2124 L357.5197 53.0435 L334.4599 47.7802 L310.9163 45.509 L287.2755 46.2671 L263.9258 50.0421 L241.2505 56.772 L219.622 66.3463 L199.3954 78.6078 L180.9028 93.3552 L164.4479 110.3462 L150.3008 129.302 L138.6939 149.9112 L129.8177 171.8355 L123.8181 194.7148 L120.7934 218.1735 L120.7934 241.8265 L123.8181 265.2852 L129.8177 288.1645 L138.6939 310.0888 L150.3008 330.698 L164.4479 349.6538 L180.9028 366.6448 L199.3954 381.3922 L219.622 393.6537 L241.2505 403.228 L263.9258 409.9579 L287.2755 413.7329 L310.9163 414.491 L334.4599 412.2198 L357.5197 406.9565 L379.7173 398.7876 L400.6879 387.8473 L420.0874 374.315 L437.5971 358.4131 L452.9296 340.4027 L465.8331 320.5795 L476.0957 299.269 L483.5489 276.821 L488.0704 253.6043 L489.5858 230" style="fill:none; clip-path:url(#clipPath1);"
    /></g
    ><g transform="translate(305,230)" style="font-size:10px; stroke-linecap:butt; fill:blue; text-rendering:geometricPrecision; font-family:sans-serif; stroke:blue;"
    ><path style="fill:none;" d="M-3 0 L3 0"
      /><path style="fill:none;" d="M0 -3 L0 3"
    /></g
    ><g style="stroke-linecap:butt; font-size:10px; fill:blue; text-rendering:geometricPrecision; font-family:sans-serif; shape-rendering:crispEdges; stroke:blue;"
    ><path d="M305 230 L330 46" style="fill:none; clip-path:url(#clipPath1);"
      /><path d="M305 230 L377 59" style="fill:none; clip-path:url(#clipPath1);"
    /></g
  ></g
></svg
>
