<?xml version="1.0" encoding="UTF-8"?>
<!DOCTYPE svg PUBLIC '-//W3C//DTD SVG 1.0//EN'
          'http://www.w3.org/TR/2001/REC-SVG-20010904/DTD/svg10.dtd'>
<svg xmlns:xlink="http://www.w3.org/1999/xlink" style="fill-opacity:1; color-rendering:auto; color-interpolation:auto; text-rendering:auto; stroke:black; stroke-linecap:square; stroke-miterlimit:10; shape-rendering:auto; stroke-opacity:1; fill:black; stroke-dasharray:none; font-weight:normal; stroke-width:1; font-family:'Dialog'; font-style:normal; stroke-linejoin:miter; font-size:12px; stroke-dashoffset:0; image-rendering:auto;" width="610" height="460" xmlns="http://www.w3.org/2000/svg"
><!--Generated by Scilab with Batik SVG Generator--><defs id="genericDefs"
  /><g
  ><defs id="defs1"
    ><clipPath clipPathUnits="userSpaceOnUse" id="clipPath1"
      ><path d="M76.2454 82.9435 L533.7546 82.9435 L533.7546 377.0565 L76.2454 377.0565 L76.2454 82.9435 Z"
      /></clipPath
      ><font horiz-adv-x="44.0" id="font1"
      ><font-face ascent="92.77344" descent="24.414062" units-per-em="100" style="font-style:normal; font-family:sans-serif; font-weight:normal;"
        /><missing-glyph horiz-adv-x="44.0" d="M4.8906 0 L4.8906 71.0938 L39.4531 71.0938 L39.4531 0 L4.8906 0 ZM9.4688 68.4531 L22.0781 38.875 L34.625 68.4531 L9.4688 68.4531 ZM23.4375 35.5469 L36.8125 4.1094 L36.8125 67 L23.4375 35.5469 ZM7.5156 66.4062 L7.5156 4.6875 L20.6094 35.5469 L7.5156 66.4062 ZM9.4688 2.6406 L34.625 2.6406 L22.0781 32.2344 L9.4688 2.6406 Z"
        /><glyph unicode="0" horiz-adv-x="56.0" d="M50.5312 41.2188 L50.5312 30.375 Q50.5312 12.8906 44.5078 5.9531 Q38.4844 -0.9844 28.125 -0.9844 Q17.9219 -0.9844 11.7656 5.9531 Q5.6094 12.8906 5.6094 30.375 L5.6094 41.2188 Q5.6094 58.6406 11.7188 65.3594 Q17.8281 72.0781 28.0312 72.0781 Q38.375 72.0781 44.4531 65.3594 Q50.5312 58.6406 50.5312 41.2188 ZM41.4531 28.9062 L41.4531 42.7188 Q41.4531 54.7344 38.0391 59.7188 Q34.625 64.7031 28.0312 64.7031 Q21.5781 64.7031 18.1406 59.7188 Q14.7031 54.7344 14.7031 42.7188 L14.7031 28.9062 Q14.7031 17 18.1953 11.7266 Q21.6875 6.4531 28.125 6.4531 Q34.7656 6.4531 38.1094 11.7266 Q41.4531 17 41.4531 28.9062 Z"
        /><glyph unicode="1" horiz-adv-x="56.0" d="M35.5938 71.4844 L35.5938 0 L26.5625 0 L26.5625 60.2031 L8.3438 53.5625 L8.3438 61.7188 L34.1875 71.4844 L35.5938 71.4844 Z"
        /><glyph unicode="-" horiz-adv-x="28.0" d="M25.6875 33.9375 L25.6875 26.5156 L1.8594 26.5156 L1.8594 33.9375 L25.6875 33.9375 Z"
        /><glyph unicode="5" horiz-adv-x="56.0" d="M17.3281 33.8438 L10.1094 35.6875 L13.6719 71.0938 L50.1406 71.0938 L50.1406 62.75 L21.3438 62.75 L19.1875 43.4062 Q21.1406 44.5312 24.1484 45.5078 Q27.1562 46.4844 31.0625 46.4844 Q40.875 46.4844 46.5625 40.0156 Q52.25 33.5469 52.25 22.6562 Q52.25 12.4531 46.6797 5.7344 Q41.1094 -0.9844 29.7344 -0.9844 Q21.0938 -0.9844 14.7969 3.875 Q8.5 8.7344 7.5156 18.7031 L16.1094 18.7031 Q17.8281 6.4531 29.7344 6.4531 Q36.1406 6.4531 39.6562 10.7969 Q43.1719 15.1406 43.1719 22.5625 Q43.1719 29.25 39.4844 33.8125 Q35.7969 38.375 28.9531 38.375 Q24.4219 38.375 22.0781 37.1562 Q19.7344 35.9375 17.3281 33.8438 Z"
        /><glyph unicode="2" horiz-adv-x="56.0" d="M52.4844 7.4219 L52.4844 0 L5.9531 0 L5.9531 6.5 L29.25 32.4219 Q35.6875 39.5938 37.9375 43.7266 Q40.1875 47.8594 40.1875 52 Q40.1875 57.2344 36.9375 60.9453 Q33.6875 64.6562 27.7812 64.6562 Q20.6562 64.6562 17.1406 60.6016 Q13.625 56.5469 13.625 50.2031 L4.5938 50.2031 Q4.5938 59.1875 10.5 65.6328 Q16.4062 72.0781 27.7812 72.0781 Q37.8438 72.0781 43.5312 66.8516 Q49.2188 61.625 49.2188 53.0781 Q49.2188 46.7812 45.2891 40.3828 Q41.3594 33.9844 35.8906 28.0781 L16.8438 7.4219 L52.4844 7.4219 Z"
        /><glyph unicode="4" horiz-adv-x="56.0" d="M2.5938 21.8281 L34.4219 71.0938 L44.0469 71.0938 L44.0469 23.9219 L53.9531 23.9219 L53.9531 16.5 L44.0469 16.5 L44.0469 0 L35.0156 0 L35.0156 16.5 L2.5938 16.5 L2.5938 21.8281 ZM12.8438 23.9219 L35.0156 23.9219 L35.0156 58.8438 L33.8906 56.8438 L12.8438 23.9219 Z"
        /><glyph unicode="6" horiz-adv-x="56.0" d="M51.4219 23.1875 Q51.4219 13.0938 45.7812 6.0547 Q40.1406 -0.9844 29.3438 -0.9844 Q21.6875 -0.9844 16.6094 3.0938 Q11.5312 7.1719 9.0156 13.4531 Q6.5 19.7344 6.5 26.3125 L6.5 30.5625 Q6.5 40.5781 9.3047 49.9062 Q12.1094 59.2344 19.4844 65.2109 Q26.8594 71.1875 40.5781 71.1875 L41.3594 71.1875 L41.3594 63.5312 L40.5781 63.5312 Q31.9375 63.5312 26.6641 60.2109 Q21.3906 56.8906 18.8281 51.5938 Q16.2656 46.2969 15.7188 40.2344 Q18.6562 43.5625 22.5859 45.0938 Q26.5156 46.625 31 46.625 Q38.0938 46.625 42.6094 43.2109 Q47.125 39.7969 49.2734 34.3984 Q51.4219 29 51.4219 23.1875 ZM15.5781 26.0312 Q15.5781 16.5469 19.8047 11.5234 Q24.0312 6.5 29.3438 6.5 Q35.5938 6.5 39.0391 11.0625 Q42.4844 15.625 42.4844 22.75 Q42.4844 29.1094 39.3125 34.1328 Q36.1406 39.1562 29.5469 39.1562 Q24.8125 39.1562 20.9531 36.3281 Q17.0938 33.5 15.5781 29.4375 L15.5781 26.0312 Z"
        /><glyph unicode="8" horiz-adv-x="56.0" d="M50.6875 19.2344 Q50.6875 9.4688 44.1641 4.2422 Q37.6406 -0.9844 28.0781 -0.9844 Q18.5 -0.9844 11.9844 4.2422 Q5.4688 9.4688 5.4688 19.2344 Q5.4688 25.2031 8.6641 29.7656 Q11.8594 34.3281 17.3281 36.6719 Q12.5938 38.9688 9.8359 43.1641 Q7.0781 47.3594 7.0781 52.5938 Q7.0781 61.9219 13.0156 67 Q18.9531 72.0781 28.0312 72.0781 Q37.1562 72.0781 43.0938 67 Q49.0312 61.9219 49.0312 52.5938 Q49.0312 47.3125 46.1953 43.1406 Q43.3594 38.9688 38.625 36.6719 Q44.1406 34.3281 47.4141 29.7344 Q50.6875 25.1406 50.6875 19.2344 ZM39.9844 52.4375 Q39.9844 57.7656 36.6641 61.2109 Q33.3438 64.6562 28.0312 64.6562 Q22.7031 64.6562 19.4297 61.3594 Q16.1562 58.0625 16.1562 52.4375 Q16.1562 46.9219 19.4297 43.6016 Q22.7031 40.2812 28.0781 40.2812 Q33.4062 40.2812 36.6953 43.6016 Q39.9844 46.9219 39.9844 52.4375 ZM41.6094 19.4375 Q41.6094 25.3906 37.8203 29.1484 Q34.0312 32.9062 27.9844 32.9062 Q21.7812 32.9062 18.1406 29.1484 Q14.5 25.3906 14.5 19.4375 Q14.5 13.2812 18.1406 9.8672 Q21.7812 6.4531 28.0781 6.4531 Q34.375 6.4531 37.9922 9.8672 Q41.6094 13.2812 41.6094 19.4375 Z"
      /></font
    ></defs
    ><g style="fill:white; text-rendering:optimizeLegibility; stroke:white;"
    ><rect x="0" width="610" height="460" y="0" style="stroke:none;"
    /></g
    ><g style="stroke-linecap:butt; fill:white; text-rendering:geometricPrecision; stroke-linejoin:bevel; shape-rendering:crispEdges; stroke:white; stroke-width:0;"
    ><path style="stroke:none;" d="M533.75 82.9464 L533.75 377.0536 L76.25 82.9464 Z"
      /><path style="stroke:none;" d="M533.75 377.0536 L76.25 377.0536 L76.25 82.9464 Z"
      /><path style="stroke:none;" d="M533.75 82.9464 L533.75 377.0536 L533.75 377.0536 Z"
      /><path style="stroke:none;" d="M76.25 82.9464 L76.25 377.0536 L76.25 377.0536 Z"
      /><path style="stroke:none;" d="M533.75 82.9464 L533.75 377.0536 L76.25 82.9464 Z"
      /><path style="stroke:none;" d="M533.75 377.0536 L76.25 377.0536 L76.25 82.9464 Z"
      /><path style="stroke:none;" d="M533.75 82.9464 L533.75 82.9464 L533.75 377.0536 Z"
      /><path style="stroke:none;" d="M76.25 82.9464 L76.25 82.9464 L76.25 377.0536 Z"
      /><path style="stroke:none;" d="M533.75 82.9464 L76.25 82.9464 L533.75 82.9464 Z"
      /><path style="stroke:none;" d="M76.25 82.9464 L76.25 82.9464 L533.75 82.9464 Z"
      /><path style="stroke:none;" d="M533.75 377.0536 L76.25 377.0536 L533.75 377.0536 Z"
      /><path style="stroke:none;" d="M76.25 377.0536 L76.25 377.0536 L533.75 377.0536 Z"
    /></g
    ><g transform="translate(301.5,386.0536)" style="font-size:10px; stroke-linecap:butt; text-rendering:geometricPrecision; font-family:sans-serif; stroke-linejoin:bevel; stroke-width:0;"
    ><text x="-0.5625" xml:space="preserve" y="9.2773" style="stroke:none;"
      >0</text
    ></g
    ><g transform="translate(130.6071,386.0536)" style="font-size:10px; stroke-linecap:butt; text-rendering:geometricPrecision; font-family:sans-serif; stroke-linejoin:bevel; stroke-width:0;"
    ><text x="-0.1875" xml:space="preserve" y="9.2773" style="stroke:none;"
      >-100</text
    ></g
    ><g transform="translate(458.8929,386.0536)" style="font-size:10px; stroke-linecap:butt; text-rendering:geometricPrecision; font-family:sans-serif; stroke-linejoin:bevel; stroke-width:0;"
    ><text x="-0.8281" xml:space="preserve" y="9.2773" style="stroke:none;"
      >100</text
    ></g
    ><g transform="translate(215.3036,386.0536)" style="font-size:10px; stroke-linecap:butt; text-rendering:geometricPrecision; font-family:sans-serif; stroke-linejoin:bevel; stroke-width:0;"
    ><text x="-0.1875" xml:space="preserve" y="9.2773" style="stroke:none;"
      >-50</text
    ></g
    ><g transform="translate(380.1964,386.0536)" style="font-size:10px; stroke-linecap:butt; text-rendering:geometricPrecision; font-family:sans-serif; stroke-linejoin:bevel; stroke-width:0;"
    ><text x="-0.75" xml:space="preserve" y="9.2773" style="stroke:none;"
      >50</text
    ></g
    ><g style="text-rendering:geometricPrecision; font-size:10px; shape-rendering:crispEdges; font-family:sans-serif; stroke-linecap:butt;"
    ><path style="fill:none;" d="M141.6071 377.0536 L141.6071 383.0536"
      /><path style="fill:none;" d="M223.3036 377.0536 L223.3036 383.0536"
      /><path style="fill:none;" d="M305 377.0536 L305 383.0536"
      /><path style="fill:none;" d="M386.6964 377.0536 L386.6964 383.0536"
      /><path style="fill:none;" d="M468.3929 377.0536 L468.3929 383.0536"
      /><path style="fill:none;" d="M76.25 377.0536 L76.25 380.0536"
      /><path style="fill:none;" d="M92.5893 377.0536 L92.5893 380.0536"
      /><path style="fill:none;" d="M108.9286 377.0536 L108.9286 380.0536"
      /><path style="fill:none;" d="M125.2679 377.0536 L125.2679 380.0536"
      /><path style="fill:none;" d="M141.6071 377.0536 L141.6071 380.0536"
      /><path style="fill:none;" d="M157.9464 377.0536 L157.9464 380.0536"
      /><path style="fill:none;" d="M174.2857 377.0536 L174.2857 380.0536"
      /><path style="fill:none;" d="M190.625 377.0536 L190.625 380.0536"
      /><path style="fill:none;" d="M206.9643 377.0536 L206.9643 380.0536"
      /><path style="fill:none;" d="M223.3036 377.0536 L223.3036 380.0536"
      /><path style="fill:none;" d="M239.6429 377.0536 L239.6429 380.0536"
      /><path style="fill:none;" d="M255.9821 377.0536 L255.9821 380.0536"
      /><path style="fill:none;" d="M272.3214 377.0536 L272.3214 380.0536"
      /><path style="fill:none;" d="M288.6607 377.0536 L288.6607 380.0536"
      /><path style="fill:none;" d="M305 377.0536 L305 380.0536"
      /><path style="fill:none;" d="M321.3393 377.0536 L321.3393 380.0536"
      /><path style="fill:none;" d="M337.6786 377.0536 L337.6786 380.0536"
      /><path style="fill:none;" d="M354.0179 377.0536 L354.0179 380.0536"
      /><path style="fill:none;" d="M370.3571 377.0536 L370.3571 380.0536"
      /><path style="fill:none;" d="M386.6964 377.0536 L386.6964 380.0536"
      /><path style="fill:none;" d="M403.0357 377.0536 L403.0357 380.0536"
      /><path style="fill:none;" d="M419.375 377.0536 L419.375 380.0536"
      /><path style="fill:none;" d="M435.7143 377.0536 L435.7143 380.0536"
      /><path style="fill:none;" d="M452.0536 377.0536 L452.0536 380.0536"
      /><path style="fill:none;" d="M468.3929 377.0536 L468.3929 380.0536"
      /><path style="fill:none;" d="M484.7321 377.0536 L484.7321 380.0536"
      /><path style="fill:none;" d="M501.0714 377.0536 L501.0714 380.0536"
      /><path style="fill:none;" d="M517.4107 377.0536 L517.4107 380.0536"
      /><path style="fill:none;" d="M533.75 377.0536 L533.75 380.0536"
      /><path style="fill:none;" d="M533.75 377.0536 L76.25 377.0536"
      /><text x="-0.5625" y="9.2773" transform="translate(60.25,370.5536)" style="stroke-linejoin:bevel; shape-rendering:auto; stroke:none; stroke-width:0;" xml:space="preserve"
      >0</text
    ></g
    ><g transform="translate(48.25,207.1607)" style="font-size:10px; stroke-linecap:butt; text-rendering:geometricPrecision; font-family:sans-serif; stroke-linejoin:bevel; stroke-width:0;"
    ><text x="-0.8281" xml:space="preserve" y="9.2773" style="stroke:none;"
      >100</text
    ></g
    ><g transform="translate(54.25,337.875)" style="font-size:10px; stroke-linecap:butt; text-rendering:geometricPrecision; font-family:sans-serif; stroke-linejoin:bevel; stroke-width:0;"
    ><text x="-0.4531" xml:space="preserve" y="9.2773" style="stroke:none;"
      >20</text
    ></g
    ><g transform="translate(54.25,305.1964)" style="font-size:10px; stroke-linecap:butt; text-rendering:geometricPrecision; font-family:sans-serif; stroke-linejoin:bevel; stroke-width:0;"
    ><text x="-0.2656" xml:space="preserve" y="9.2773" style="stroke:none;"
      >40</text
    ></g
    ><g transform="translate(54.25,272.5179)" style="font-size:10px; stroke-linecap:butt; text-rendering:geometricPrecision; font-family:sans-serif; stroke-linejoin:bevel; stroke-width:0;"
    ><text x="-0.6562" xml:space="preserve" y="9.2773" style="stroke:none;"
      >60</text
    ></g
    ><g transform="translate(54.25,239.8393)" style="font-size:10px; stroke-linecap:butt; text-rendering:geometricPrecision; font-family:sans-serif; stroke-linejoin:bevel; stroke-width:0;"
    ><text x="-0.5469" xml:space="preserve" y="9.2773" style="stroke:none;"
      >80</text
    ></g
    ><g transform="translate(48.25,174.4821)" style="font-size:10px; stroke-linecap:butt; text-rendering:geometricPrecision; font-family:sans-serif; stroke-linejoin:bevel; stroke-width:0;"
    ><text x="-0.8281" xml:space="preserve" y="9.2773" style="stroke:none;"
      >120</text
    ></g
    ><g transform="translate(48.25,141.8036)" style="font-size:10px; stroke-linecap:butt; text-rendering:geometricPrecision; font-family:sans-serif; stroke-linejoin:bevel; stroke-width:0;"
    ><text x="-0.8281" xml:space="preserve" y="9.2773" style="stroke:none;"
      >140</text
    ></g
    ><g transform="translate(48.25,109.125)" style="font-size:10px; stroke-linecap:butt; text-rendering:geometricPrecision; font-family:sans-serif; stroke-linejoin:bevel; stroke-width:0;"
    ><text x="-0.8281" xml:space="preserve" y="9.2773" style="stroke:none;"
      >160</text
    ></g
    ><g transform="translate(48.25,76.4464)" style="font-size:10px; stroke-linecap:butt; text-rendering:geometricPrecision; font-family:sans-serif; stroke-linejoin:bevel; stroke-width:0;"
    ><text x="-0.8281" xml:space="preserve" y="9.2773" style="stroke:none;"
      >180</text
    ></g
    ><g style="text-rendering:geometricPrecision; font-size:10px; shape-rendering:crispEdges; font-family:sans-serif; stroke-linecap:butt;"
    ><path style="fill:none;" d="M76.25 377.0536 L70.25 377.0536"
      /><path style="fill:none;" d="M76.25 344.375 L70.25 344.375"
      /><path style="fill:none;" d="M76.25 311.6964 L70.25 311.6964"
      /><path style="fill:none;" d="M76.25 279.0179 L70.25 279.0179"
      /><path style="fill:none;" d="M76.25 246.3393 L70.25 246.3393"
      /><path style="fill:none;" d="M76.25 213.6607 L70.25 213.6607"
      /><path style="fill:none;" d="M76.25 180.9821 L70.25 180.9821"
      /><path style="fill:none;" d="M76.25 148.3036 L70.25 148.3036"
      /><path style="fill:none;" d="M76.25 115.625 L70.25 115.625"
      /><path style="fill:none;" d="M76.25 82.9464 L70.25 82.9464"
      /><path style="fill:none;" d="M76.25 377.0536 L73.25 377.0536"
      /><path style="fill:none;" d="M76.25 360.7143 L73.25 360.7143"
      /><path style="fill:none;" d="M76.25 344.375 L73.25 344.375"
      /><path style="fill:none;" d="M76.25 328.0357 L73.25 328.0357"
      /><path style="fill:none;" d="M76.25 311.6964 L73.25 311.6964"
      /><path style="fill:none;" d="M76.25 295.3571 L73.25 295.3571"
      /><path style="fill:none;" d="M76.25 279.0179 L73.25 279.0179"
      /><path style="fill:none;" d="M76.25 262.6786 L73.25 262.6786"
      /><path style="fill:none;" d="M76.25 246.3393 L73.25 246.3393"
      /><path style="fill:none;" d="M76.25 230 L73.25 230"
      /><path style="fill:none;" d="M76.25 213.6607 L73.25 213.6607"
      /><path style="fill:none;" d="M76.25 197.3214 L73.25 197.3214"
      /><path style="fill:none;" d="M76.25 180.9821 L73.25 180.9821"
      /><path style="fill:none;" d="M76.25 164.6429 L73.25 164.6429"
      /><path style="fill:none;" d="M76.25 148.3036 L73.25 148.3036"
      /><path style="fill:none;" d="M76.25 131.9643 L73.25 131.9643"
      /><path style="fill:none;" d="M76.25 115.625 L73.25 115.625"
      /><path style="fill:none;" d="M76.25 99.2857 L73.25 99.2857"
      /><path style="fill:none;" d="M76.25 82.9464 L73.25 82.9464"
      /><path style="fill:none;" d="M76.25 82.9464 L76.25 377.0536"
      /><path d="M451.3055 377.0536 L305 377.0536 L305 347.6429 L451.3055 347.6429 L451.3055 377.0536" style="fill:none; clip-path:url(#clipPath1);"
      /><path d="M158.6946 377.0536 L305 377.0536 L305 347.6429 L158.6946 347.6429 L158.6946 377.0536" style="fill:none; clip-path:url(#clipPath1);"
      /><path d="M470.4508 347.6429 L425.4925 347.6429 L425.4925 318.2321 L470.4508 318.2321 L470.4508 347.6429" style="fill:none; clip-path:url(#clipPath1);"
      /><path d="M139.5491 347.6429 L184.5075 347.6429 L184.5075 318.2321 L139.5491 318.2321 L139.5491 347.6429" style="fill:none; clip-path:url(#clipPath1);"
      /><path d="M480.8569 318.2321 L452.1796 318.2321 L452.1796 288.8214 L480.8569 288.8214 L480.8569 318.2321" style="fill:none; clip-path:url(#clipPath1);"
      /><path d="M129.1431 318.2321 L157.8204 318.2321 L157.8204 288.8214 L129.1431 288.8214 L129.1431 318.2321" style="fill:none; clip-path:url(#clipPath1);"
      /><path d="M488.0789 288.8214 L463.3808 288.8214 L463.3808 259.4107 L488.0789 259.4107 L488.0789 288.8214" style="fill:none; clip-path:url(#clipPath1);"
      /><path d="M121.9211 288.8214 L146.6192 288.8214 L146.6192 259.4107 L121.9211 259.4107 L121.9211 288.8214" style="fill:none; clip-path:url(#clipPath1);"
      /><path d="M493.265 259.4107 L471.0057 259.4107 L471.0057 230 L493.265 230 L493.265 259.4107" style="fill:none; clip-path:url(#clipPath1);"
      /><path d="M116.735 259.4107 L138.9942 259.4107 L138.9942 230 L116.735 230 L116.735 259.4107" style="fill:none; clip-path:url(#clipPath1);"
      /><path d="M496.5275 230 L476.0778 230 L476.0778 200.5893 L496.5275 200.5893 L496.5275 230" style="fill:none; clip-path:url(#clipPath1);"
      /><path d="M113.4725 230 L133.9222 230 L133.9222 200.5893 L113.4725 200.5893 L113.4725 230" style="fill:none; clip-path:url(#clipPath1);"
      /><path d="M498.5641 200.5893 L479.4065 200.5893 L479.4065 171.1786 L498.5641 171.1786 L498.5641 200.5893" style="fill:none; clip-path:url(#clipPath1);"
      /><path d="M111.4359 200.5893 L130.5936 200.5893 L130.5936 171.1786 L111.4359 171.1786 L111.4359 200.5893" style="fill:none; clip-path:url(#clipPath1);"
      /><path d="M505.7138 171.1786 L481.3883 171.1786 L481.3883 141.7679 L505.7138 141.7679 L505.7138 171.1786" style="fill:none; clip-path:url(#clipPath1);"
      /><path d="M104.2862 171.1786 L128.6117 171.1786 L128.6117 141.7679 L104.2862 141.7679 L104.2862 171.1786" style="fill:none; clip-path:url(#clipPath1);"
      /><path d="M505.9696 141.7679 L479.4173 141.7679 L479.4173 112.3571 L505.9696 112.3571 L505.9696 141.7679" style="fill:none; clip-path:url(#clipPath1);"
      /><path d="M104.0304 141.7679 L130.5827 141.7679 L130.5827 112.3571 L104.0304 112.3571 L104.0304 141.7679" style="fill:none; clip-path:url(#clipPath1);"
      /><path d="M305 377.0536 L370.1615 377.0536 L371.418 376.9442 L372.6742 376.8347 L373.9297 376.7245 L375.1843 376.6135 L376.4375 376.5015 L377.689 376.388 L378.9385 376.2729 L380.1857 376.1558 L381.4302 376.0365 L382.6718 375.9147 L383.9099 375.7902 L385.1445 375.6625 L386.375 375.5316 L387.6012 375.3971 L388.8227 375.2587 L390.0392 375.1161 L391.2504 374.9691 L392.4559 374.8174 L393.6554 374.6607 L394.8485 374.4987 L396.035 374.3312 L397.2145 374.1579 L398.3867 373.9785 L399.5511 373.7927 L400.7076 373.6003 L401.8557 373.4009 L402.9952 373.1943 L404.1256 372.9802 L405.2468 372.7584 L406.3582 372.5286 L407.4596 372.2904 L408.5507 372.0437 L409.6312 371.788 L410.7006 371.5233 L411.7586 371.2491 L412.8051 370.9652 L413.8394 370.6713 L414.8615 370.3672 L415.8709 370.0526 L416.8673 369.7272 L417.8509 369.3914 L418.8217 369.0453 L419.7798 368.6895 L420.7255 368.324 L421.6588 367.9493 L422.5797 367.5657 L423.4886 367.1735 L424.3854 366.7729 L425.2703 366.3644 L426.1434 365.9482 L427.0049 365.5246 L427.8549 365.094 L428.6934 364.6566 L429.5207 364.2129 L430.3368 363.763 L431.1418 363.3073 L431.936 362.8461 L432.7194 362.3798 L433.492 361.9086 L434.2542 361.4328 L435.0059 360.9528 L435.7473 360.4689 L436.4786 359.9814 L437.1998 359.4906 L437.911 358.9968 L438.6125 358.5003 L439.3043 358.0015 L439.9865 357.5006 L440.6593 356.998 L441.3228 356.494 L441.9771 355.989 L442.6223 355.4831 L443.2585 354.9767 L443.886 354.4702 L444.5047 353.9637 L445.1149 353.4578 L445.7166 352.9527 L446.31 352.4486 L446.8952 351.9458 L447.4724 351.444 L448.0418 350.9428 L448.6036 350.4418 L449.158 349.9406 L449.7051 349.4387 L450.2453 348.9359 L450.7787 348.4315 L451.3055 347.9254 L451.8258 347.4169 L452.3399 346.9059 L452.8481 346.3917 L453.3505 345.8741 L453.8472 345.3527 L454.3385 344.8269 L454.8247 344.2965 L455.3058 343.761 L455.7821 343.22 L456.2539 342.6732 L456.7212 342.12 L457.1843 341.5601 L457.6435 340.993 L458.0988 340.4185 L458.5505 339.8361 L458.9988 339.2453 L459.4439 338.6458 L459.886 338.0371 L460.3253 337.4189 L460.7621 336.7908 L461.1964 336.1523 L461.6284 335.5031 L462.0586 334.8426 L462.4868 334.1706 L462.9136 333.4866 L463.3389 332.7903 L463.763 332.0811 L464.1861 331.3588 L464.6084 330.6229 L465.0301 329.8729 L465.4513 329.1087 L465.8721 328.3302 L466.2924 327.5376 L466.712 326.731 L467.131 325.9106 L467.5492 325.0767 L467.9667 324.2292 L468.3833 323.3684 L468.7989 322.4944 L469.2136 321.6074 L469.6272 320.7075 L470.0396 319.7949 L470.4508 318.8698 L470.8608 317.9322 L471.2695 316.9824 L471.6767 316.0204 L472.0825 315.0466 L472.4868 314.0609 L472.8894 313.0636 L473.2903 312.0549 L473.6896 311.0348 L474.087 310.0035 L474.4826 308.9612 L474.8763 307.908 L475.2679 306.8441 L475.6574 305.7697 L476.0449 304.6848 L476.4301 303.5897 L476.8131 302.4845 L477.1937 301.3693 L477.5719 300.2444 L477.9477 299.1098 L478.3209 297.9658 L478.6915 296.8123 L479.0595 295.6498 L479.4247 294.4782 L479.7871 293.2978 L480.1467 292.1086 L480.5033 290.9109 L480.8569 289.7047 L481.2075 288.4905 L481.555 287.2685 L481.8994 286.039 L482.2406 284.8022 L482.5787 283.5585 L482.9135 282.3083 L483.2451 281.0516 L483.5735 279.789 L483.8984 278.5207 L484.2201 277.2469 L484.5383 275.9679 L484.8531 274.6842 L485.1644 273.3959 L485.4722 272.1034 L485.7765 270.8069 L486.0772 269.5068 L486.3743 268.2033 L486.6677 266.8968 L486.9575 265.5875 L487.2435 264.2758 L487.5258 262.9619 L487.8043 261.6462 L488.0789 260.3289 L488.3497 259.0104 L488.6166 257.6909 L488.8796 256.3707 L489.1386 255.0502 L489.3936 253.7295 L489.6445 252.4091 L489.8913 251.0893 L490.1341 249.7702 L490.3727 248.4523 L490.6071 247.1358 L490.8372 245.821 L491.0632 244.5082 L491.2848 243.1977 L491.5021 241.8898 L491.715 240.5848 L491.9236 239.2831 L492.1277 237.9846 L492.3277 236.6896 L492.5234 235.3982 L492.7149 234.1105 L492.9023 232.8266 L493.0857 231.5467 L493.265 230.271 L493.4405 228.9994 L493.6121 227.7322 L493.7798 226.4695 L493.9438 225.2115 L494.1042 223.9581 L494.2609 222.7097 L494.414 221.4663 L494.5636 220.228 L494.7097 218.9949 L494.8525 217.7673 L494.9919 216.5451 L495.1281 215.3286 L495.261 214.118 L495.3907 212.9132 L495.5174 211.7144 L495.641 210.5218 L495.7616 209.3355 L495.8793 208.1556 L495.9942 206.9823 L496.1062 205.8157 L496.2155 204.6558 L496.3221 203.5029 L496.4261 202.3571 L496.5275 201.2185 L496.6264 200.0872 L496.7229 198.9633 L496.817 197.847 L496.9087 196.7385 L496.9982 195.6378 L497.0854 194.545 L497.1705 193.4604 L497.2535 192.384 L497.3344 191.3161 L497.4132 190.257 L497.49 189.2071 L497.5647 188.1666 L497.6373 187.1357 L497.7079 186.1149 L497.7765 185.1044 L497.843 184.1045 L497.9074 183.1154 L497.9699 182.1376 L498.0303 181.1712 L498.0887 180.2166 L498.1451 179.2741 L498.1996 178.3439 L498.252 177.4265 L498.3025 176.5219 L498.351 175.6307 L498.3975 174.753 L498.442 173.8891 L498.4846 173.0394 L498.5253 172.2041 L498.5641 171.3836 L498.6009 170.5781 L498.6357 169.7879 L498.6687 169.0134 L498.6998 168.2548 L498.7289 167.5124 L498.7562 166.7865 L498.7816 166.0774 L498.8051 165.3854 L498.8267 164.7108 L498.8464 164.054 L498.8643 163.4151 L498.8804 162.7945 L498.8946 162.1925 L498.907 161.6094 L498.9175 161.0454 L498.9262 160.501 L498.9331 159.9761 L498.9384 159.4706 L498.9424 158.9839 L498.945 158.5156 L498.9467 158.0652 L498.9475 157.6323 L498.9478 157.2164 L498.9476 156.817 L498.9472 156.4336 L498.9468 156.0659 L498.9466 155.7133 L498.9468 155.3753 L498.9475 155.0516 L498.9491 154.7416 L498.9516 154.4449 L498.9553 154.161 L498.9604 153.8895 L498.9671 153.6299 L498.9756 153.3817 L498.986 153.1444 L498.9987 152.9177 L499.0137 152.701 L499.0313 152.4939 L499.0518 152.2959 L499.0752 152.1066 L499.1017 151.9254 L499.1317 151.752 L499.1653 151.5858 L499.2026 151.4264 L499.244 151.2734 L499.2895 151.1262 L499.3394 150.9844 L499.3939 150.8476 L499.4532 150.7153 L499.5175 150.5869 L499.5869 150.4622 L499.6618 150.3405 L499.7423 150.2214 L499.8285 150.1046 L499.9207 149.9894 L500.0185 149.8757 L500.1217 149.7632 L500.2301 149.6516 L500.3434 149.5408 L500.4611 149.4303 L500.5831 149.3201 L500.7091 149.2097 L500.8387 149.0991 L500.9718 148.9878 L501.1079 148.8758 L501.2469 148.7626 L501.3884 148.6482 L501.5321 148.5321 L501.6777 148.4142 L501.825 148.2942 L501.9737 148.1718 L502.1235 148.0469 L502.274 147.9191 L502.425 147.7881 L502.5763 147.6539 L502.7274 147.516 L502.8782 147.3742 L503.0284 147.2283 L503.1776 147.0781 L503.3255 146.9232 L503.4719 146.7634 L503.6165 146.5986 L503.7591 146.4283 L503.8992 146.2524 L504.0366 146.0706 L504.1711 145.8826 L504.3023 145.6883 L504.43 145.4873 L504.5538 145.2794 L504.6735 145.0643 L504.7888 144.8418 L504.8994 144.6117 L505.005 144.3737 L505.1053 144.1276 L505.2003 143.8737 L505.29 143.6125 L505.3743 143.3445 L505.4532 143.07 L505.5266 142.7894 L505.5945 142.5033 L505.657 142.2119 L505.7138 141.9158 L505.7651 141.6154 L505.8107 141.311 L505.8506 141.0032 L505.8849 140.6923 L505.9135 140.3788 L505.9362 140.0631 L505.9532 139.7457 L505.9643 139.4268 L505.9696 139.1071 L505.9689 138.7869 L505.9623 138.4666 L505.9498 138.1466 L505.9312 137.8275 L505.9066 137.5095 L505.8759 137.1932 L505.8391 136.879 L505.7961 136.5673 L505.747 136.2584 L505.6917 135.953 L505.63 135.6513 L505.5622 135.3537 L505.4879 135.0609 L505.4074 134.773 L505.3204 134.4907 L505.227 134.2142 L505.1272 133.9441 L505.0208 133.6807 L504.908 133.4246 L504.7885 133.176 L504.6625 132.9354 L504.5299 132.7033 L504.3911 132.4794 L504.2462 132.2636 L504.0958 132.0558 L503.9401 131.8558 L503.7795 131.6634 L503.6144 131.4784 L503.4451 131.3007 L503.2719 131.1301 L503.0952 130.9664 L502.9153 130.8095 L502.7325 130.6592 L502.5473 130.5153 L502.36 130.3777 L502.1709 130.2461 L501.9803 130.1205 L501.7887 130.0006 L501.5963 129.8863 L501.4034 129.7773 L501.2105 129.6736 L501.0179 129.575 L500.826 129.4812 L500.635 129.3922 L500.4454 129.3077 L500.2574 129.2276 L500.0714 129.1517 L499.8878 129.0799 L499.7069 129.0119 L499.5291 128.9477 L499.3547 128.8869 L499.184 128.8295 L499.0174 128.7753 L498.8552 128.7242 L498.6978 128.6758 L498.5456 128.6302 L498.3989 128.5871 L498.2579 128.5463 L498.1232 128.5077 L497.9949 128.471 L497.8734 128.4363 L497.7586 128.4033 L497.6503 128.372 L497.5483 128.3425 L497.4525 128.3145 L497.3626 128.2882 L497.2785 128.2634 L497.1999 128.2401 L497.1268 128.2183 L497.0589 128.1979 L496.996 128.1788 L496.938 128.1611 L496.8847 128.1446 L496.8359 128.1294 L496.7914 128.1153 L496.751 128.1023 L496.7146 128.0905 L496.6819 128.0796 L496.6529 128.0698 L496.6272 128.0608 L496.6048 128.0528 L496.5854 128.0456 L496.5689 128.0392 L496.5551 128.0336 L496.5437 128.0287 L496.5347 128.0244 L496.5278 128.0207 L496.5229 128.0176 L496.5197 128.015 L496.5181 128.0129 L496.5179 128.0112 L496.519 128.0099 L496.5211 128.0089 L496.524 128.0082 L496.5277 128.0077 L496.5318 128.0074 L496.5363 128.0073 L496.5409 128.0072" style="fill:none; clip-path:url(#clipPath1); stroke:blue;"
      /><path d="M305 377.0536 L239.8385 377.0536 L238.582 376.9442 L237.3258 376.8347 L236.0703 376.7245 L234.8157 376.6135 L233.5625 376.5015 L232.311 376.388 L231.0615 376.2729 L229.8143 376.1558 L228.5698 376.0365 L227.3282 375.9147 L226.09 375.7902 L224.8555 375.6625 L223.625 375.5316 L222.3988 375.3971 L221.1773 375.2587 L219.9608 375.1161 L218.7496 374.9691 L217.5441 374.8174 L216.3446 374.6607 L215.1515 374.4987 L213.965 374.3312 L212.7855 374.1579 L211.6134 373.9785 L210.4489 373.7927 L209.2924 373.6003 L208.1443 373.4009 L207.0048 373.1943 L205.8744 372.9802 L204.7533 372.7584 L203.6418 372.5286 L202.5404 372.2904 L201.4493 372.0437 L200.3689 371.788 L199.2994 371.5233 L198.2413 371.2491 L197.1949 370.9652 L196.1606 370.6713 L195.1385 370.3672 L194.1291 370.0526 L193.1327 369.7272 L192.1491 369.3914 L191.1783 369.0453 L190.2202 368.6895 L189.2745 368.324 L188.3412 367.9493 L187.4203 367.5657 L186.5114 367.1735 L185.6146 366.7729 L184.7297 366.3644 L183.8566 365.9482 L182.9951 365.5246 L182.1451 365.094 L181.3066 364.6566 L180.4793 364.2129 L179.6632 363.763 L178.8582 363.3073 L178.064 362.8461 L177.2806 362.3798 L176.5079 361.9086 L175.7458 361.4328 L174.9941 360.9528 L174.2527 360.4689 L173.5214 359.9814 L172.8002 359.4906 L172.0889 358.9968 L171.3875 358.5003 L170.6957 358.0015 L170.0135 357.5006 L169.3407 356.998 L168.6772 356.494 L168.023 355.989 L167.3777 355.4831 L166.7415 354.9767 L166.114 354.4702 L165.4953 353.9637 L164.8851 353.4578 L164.2834 352.9527 L163.69 352.4486 L163.1048 351.9458 L162.5276 351.444 L161.9582 350.9428 L161.3964 350.4418 L160.842 349.9406 L160.2949 349.4387 L159.7547 348.9359 L159.2213 348.4315 L158.6946 347.9254 L158.1742 347.4169 L157.66 346.9059 L157.1519 346.3917 L156.6495 345.8741 L156.1528 345.3527 L155.6615 344.8269 L155.1753 344.2965 L154.6942 343.761 L154.2178 343.22 L153.7461 342.6732 L153.2788 342.12 L152.8157 341.5601 L152.3566 340.993 L151.9012 340.4185 L151.4495 339.8361 L151.0012 339.2453 L150.5561 338.6458 L150.114 338.0371 L149.6747 337.4189 L149.238 336.7908 L148.8036 336.1523 L148.3716 335.5031 L147.9414 334.8426 L147.5131 334.1706 L147.0864 333.4866 L146.6611 332.7903 L146.237 332.0811 L145.8139 331.3588 L145.3916 330.6229 L144.9699 329.8729 L144.5487 329.1087 L144.1279 328.3302 L143.7077 327.5376 L143.288 326.731 L142.869 325.9106 L142.4508 325.0767 L142.0333 324.2292 L141.6167 323.3684 L141.2011 322.4944 L140.7864 321.6074 L140.3728 320.7075 L139.9604 319.7949 L139.5491 318.8698 L139.1392 317.9322 L138.7305 316.9824 L138.3233 316.0204 L137.9175 315.0466 L137.5133 314.0609 L137.1106 313.0636 L136.7096 312.0549 L136.3104 311.0348 L135.913 310.0035 L135.5174 308.9612 L135.1237 307.908 L134.7321 306.8441 L134.3425 305.7697 L133.9551 304.6848 L133.5699 303.5897 L133.1869 302.4845 L132.8063 301.3693 L132.4281 300.2444 L132.0523 299.1098 L131.6791 297.9658 L131.3085 296.8123 L130.9405 295.6498 L130.5753 294.4782 L130.2129 293.2978 L129.8533 292.1086 L129.4967 290.9109 L129.1431 289.7047 L128.7925 288.4905 L128.445 287.2685 L128.1006 286.039 L127.7594 284.8022 L127.4213 283.5585 L127.0865 282.3083 L126.7549 281.0516 L126.4266 279.789 L126.1016 278.5207 L125.7799 277.2469 L125.4617 275.9679 L125.1469 274.6842 L124.8356 273.3959 L124.5278 272.1034 L124.2235 270.8069 L123.9228 269.5068 L123.6257 268.2033 L123.3323 266.8968 L123.0425 265.5875 L122.7565 264.2758 L122.4742 262.9619 L122.1957 261.6462 L121.9211 260.3289 L121.6503 259.0104 L121.3834 257.6909 L121.1204 256.3707 L120.8614 255.0502 L120.6065 253.7295 L120.3555 252.4091 L120.1087 251.0893 L119.8659 249.7702 L119.6273 248.4523 L119.3929 247.1358 L119.1627 245.821 L118.9368 244.5082 L118.7152 243.1977 L118.4979 241.8898 L118.285 240.5848 L118.0764 239.2831 L117.8722 237.9846 L117.6723 236.6896 L117.4766 235.3982 L117.2851 234.1105 L117.0977 232.8266 L116.9143 231.5467 L116.735 230.271 L116.5595 228.9994 L116.3879 227.7322 L116.2202 226.4695 L116.0561 225.2115 L115.8958 223.9581 L115.7391 222.7097 L115.586 221.4663 L115.4364 220.228 L115.2903 218.9949 L115.1475 217.7673 L115.0081 216.5451 L114.872 215.3286 L114.739 214.118 L114.6093 212.9132 L114.4826 211.7144 L114.359 210.5218 L114.2384 209.3355 L114.1207 208.1556 L114.0058 206.9823 L113.8938 205.8157 L113.7845 204.6558 L113.6779 203.5029 L113.5739 202.3571 L113.4725 201.2185 L113.3736 200.0872 L113.2771 198.9633 L113.183 197.847 L113.0913 196.7385 L113.0018 195.6378 L112.9146 194.545 L112.8295 193.4604 L112.7465 192.384 L112.6656 191.3161 L112.5867 190.257 L112.51 189.2071 L112.4353 188.1666 L112.3627 187.1357 L112.2921 186.1149 L112.2235 185.1044 L112.1571 184.1045 L112.0926 183.1154 L112.0301 182.1376 L111.9697 181.1712 L111.9113 180.2166 L111.8549 179.2741 L111.8004 178.3439 L111.748 177.4265 L111.6975 176.5219 L111.649 175.6307 L111.6025 174.753 L111.558 173.8891 L111.5153 173.0394 L111.4747 172.2041 L111.4359 171.3836 L111.3991 170.5781 L111.3643 169.7879 L111.3313 169.0134 L111.3002 168.2548 L111.2711 167.5124 L111.2438 166.7865 L111.2184 166.0774 L111.1949 165.3854 L111.1733 164.7108 L111.1536 164.054 L111.1357 163.4151 L111.1196 162.7945 L111.1054 162.1925 L111.0931 161.6094 L111.0825 161.0454 L111.0738 160.501 L111.0669 159.9761 L111.0616 159.4706 L111.0577 158.9839 L111.055 158.5156 L111.0533 158.0652 L111.0525 157.6323 L111.0522 157.2164 L111.0524 156.817 L111.0528 156.4336 L111.0532 156.0659 L111.0534 155.7133 L111.0532 155.3753 L111.0525 155.0516 L111.0509 154.7416 L111.0484 154.4449 L111.0447 154.161 L111.0396 153.8895 L111.0329 153.6299 L111.0244 153.3817 L111.014 153.1444 L111.0013 152.9177 L110.9863 152.701 L110.9687 152.4939 L110.9482 152.2959 L110.9249 152.1066 L110.8983 151.9254 L110.8683 151.752 L110.8347 151.5858 L110.7974 151.4264 L110.756 151.2734 L110.7105 151.1262 L110.6606 150.9844 L110.6061 150.8476 L110.5468 150.7153 L110.4825 150.5869 L110.413 150.4622 L110.3382 150.3405 L110.2577 150.2214 L110.1715 150.1046 L110.0794 149.9894 L109.9815 149.8757 L109.8783 149.7632 L109.7699 149.6516 L109.6567 149.5408 L109.5389 149.4303 L109.4169 149.3201 L109.2909 149.2097 L109.1613 149.0991 L109.0282 148.9878 L108.8921 148.8758 L108.7531 148.7626 L108.6116 148.6482 L108.4679 148.5321 L108.3223 148.4142 L108.175 148.2942 L108.0263 148.1718 L107.8765 148.0469 L107.726 147.9191 L107.575 147.7881 L107.4237 147.6539 L107.2726 147.516 L107.1218 147.3742 L106.9716 147.2283 L106.8224 147.0781 L106.6745 146.9232 L106.5281 146.7634 L106.3834 146.5986 L106.2409 146.4283 L106.1008 146.2524 L105.9634 146.0706 L105.8289 145.8826 L105.6977 145.6883 L105.57 145.4873 L105.4462 145.2794 L105.3265 145.0643 L105.2112 144.8418 L105.1006 144.6117 L104.995 144.3737 L104.8947 144.1276 L104.7997 143.8737 L104.71 143.6125 L104.6257 143.3445 L104.5468 143.07 L104.4734 142.7894 L104.4055 142.5033 L104.343 142.2119 L104.2862 141.9158 L104.2349 141.6154 L104.1893 141.311 L104.1494 141.0032 L104.1151 140.6923 L104.0866 140.3788 L104.0638 140.0631 L104.0468 139.7457 L104.0357 139.4268 L104.0304 139.1071 L104.0311 138.7869 L104.0377 138.4666 L104.0502 138.1466 L104.0688 137.8275 L104.0934 137.5095 L104.1241 137.1932 L104.1609 136.879 L104.2039 136.5673 L104.253 136.2584 L104.3083 135.953 L104.37 135.6513 L104.4379 135.3537 L104.5121 135.0609 L104.5926 134.773 L104.6796 134.4907 L104.773 134.2142 L104.8728 133.9441 L104.9792 133.6807 L105.092 133.4246 L105.2114 133.176 L105.3375 132.9354 L105.4701 132.7033 L105.609 132.4794 L105.7538 132.2636 L105.9042 132.0558 L106.0599 131.8558 L106.2204 131.6634 L106.3856 131.4784 L106.5549 131.3007 L106.7281 131.1301 L106.9048 130.9664 L107.0847 130.8095 L107.2674 130.6592 L107.4527 130.5153 L107.64 130.3777 L107.8291 130.2461 L108.0197 130.1205 L108.2113 130.0006 L108.4038 129.8863 L108.5966 129.7773 L108.7895 129.6736 L108.982 129.575 L109.174 129.4812 L109.365 129.3922 L109.5546 129.3077 L109.7426 129.2276 L109.9286 129.1517 L110.1122 129.0799 L110.2931 129.0119 L110.4709 128.9477 L110.6453 128.8869 L110.816 128.8295 L110.9826 128.7753 L111.1448 128.7242 L111.3021 128.6758 L111.4544 128.6302 L111.6012 128.5871 L111.7421 128.5463 L111.8768 128.5077 L112.0051 128.471 L112.1266 128.4363 L112.2414 128.4033 L112.3497 128.372 L112.4517 128.3425 L112.5475 128.3145 L112.6374 128.2882 L112.7215 128.2634 L112.8001 128.2401 L112.8732 128.2183 L112.9411 128.1979 L113.004 128.1788 L113.062 128.1611 L113.1153 128.1446 L113.1641 128.1294 L113.2086 128.1153 L113.249 128.1023 L113.2854 128.0905 L113.3181 128.0796 L113.3471 128.0698 L113.3728 128.0608 L113.3952 128.0528 L113.4146 128.0456 L113.4311 128.0392 L113.445 128.0336 L113.4563 128.0287 L113.4653 128.0244 L113.4722 128.0207 L113.4771 128.0176 L113.4803 128.015 L113.4819 128.0129 L113.4821 128.0112 L113.481 128.0099 L113.4789 128.0089 L113.476 128.0082 L113.4723 128.0077 L113.4682 128.0074 L113.4637 128.0073 L113.4591 128.0072" style="fill:none; clip-path:url(#clipPath1); stroke:blue;"
      /><path d="M305 360.7143 L369.9979 360.6668 L371.2463 360.5579 L372.49 360.4488 L373.7287 360.3392 L374.9621 360.2289 L376.1898 360.1176 L377.4115 360.0051 L378.6267 359.891 L379.8351 359.7752 L381.0364 359.6575 L382.23 359.5374 L383.4157 359.415 L384.593 359.2898 L385.7615 359.1617 L386.9208 359.0305 L388.0706 358.8958 L389.2102 358.7577 L390.3393 358.6158 L391.4576 358.4699 L392.5645 358.3199 L393.6595 358.1656 L394.7422 358.0067 L395.8123 357.8433 L396.869 357.675 L397.9121 357.5019 L398.941 357.3237 L399.9553 357.1403 L400.9543 356.9517 L401.9377 356.7577 L402.9049 356.5584 L403.8555 356.3536 L404.7888 356.1433 L405.7044 355.9276 L406.6018 355.7064 L407.4805 355.4798 L408.3399 355.2479 L409.1796 355.0106 L409.999 354.7682 L410.7994 354.5203 L411.5874 354.2645 L412.3651 354.0005 L413.1325 353.7285 L413.89 353.4487 L414.6378 353.1612 L415.3761 352.8662 L416.1053 352.5639 L416.8254 352.2545 L417.5368 351.9382 L418.2397 351.6151 L418.9341 351.2854 L419.6205 350.9492 L420.2989 350.6068 L420.9695 350.2583 L421.6325 349.9038 L422.2882 349.5435 L422.9366 349.1777 L423.5779 348.8064 L424.2123 348.4298 L424.8399 348.0481 L425.4609 347.6614 L426.0755 347.27 L426.6837 346.8739 L427.2858 346.4734 L427.8818 346.0687 L428.4718 345.6599 L429.0561 345.2471 L429.6348 344.8306 L430.2079 344.4106 L430.7756 343.9872 L431.338 343.5605 L431.8953 343.1309 L432.4475 342.6984 L432.9949 342.2632 L433.5376 341.8257 L434.0756 341.3857 L434.6092 340.9438 L435.1384 340.4998 L435.6621 340.0553 L436.1752 339.6148 L436.6766 339.1794 L437.1666 338.7485 L437.6455 338.3219 L438.1137 337.8991 L438.5716 337.4798 L439.0194 337.0635 L439.4576 336.6499 L439.8867 336.2384 L440.307 335.8286 L440.719 335.42 L441.1231 335.0121 L441.5199 334.6043 L441.9097 334.1961 L442.2931 333.787 L442.6706 333.3763 L443.0426 332.9635 L443.4097 332.5479 L443.7723 332.1288 L444.1309 331.7057 L444.486 331.2779 L444.838 330.8445 L445.1874 330.4051 L445.5346 329.9589 L445.88 329.5052 L446.2242 329.0432 L446.5672 328.5724 L446.9097 328.0919 L447.2519 327.6012 L447.5941 327.0995 L447.9367 326.5863 L448.2799 326.0607 L448.6241 325.5222 L448.9693 324.9702 L449.3159 324.404 L449.6642 323.823 L450.0143 323.2267 L450.3663 322.6144 L450.7206 321.9856 L451.0773 321.3395 L451.4364 320.6762 L451.7976 319.9959 L452.1607 319.2991 L452.5255 318.5859 L452.8917 317.8566 L453.2592 317.1115 L453.6277 316.3509 L453.9971 315.575 L454.3672 314.784 L454.7379 313.9783 L455.109 313.158 L455.4803 312.3234 L455.8517 311.4747 L456.2231 310.6122 L456.5943 309.7361 L456.9652 308.8466 L457.3357 307.9439 L457.7056 307.0283 L458.0749 306.1 L458.4433 305.1591 L458.8109 304.2059 L459.1774 303.2407 L459.5429 302.2635 L459.9071 301.2747 L460.27 300.2744 L460.6315 299.2628 L460.9914 298.2401 L461.3497 297.2065 L461.7064 296.1622 L462.0612 295.1074 L462.4141 294.0423 L462.765 292.9671 L463.1139 291.882 L463.4605 290.7871 L463.805 289.6827 L464.1471 288.5689 L464.4868 287.446 L464.824 286.3139 L465.1588 285.1723 L465.4913 284.0214 L465.8213 282.8615 L466.1487 281.693 L466.4735 280.5162 L466.7957 279.3315 L467.1151 278.1393 L467.4317 276.9398 L467.7455 275.7335 L468.0563 274.5207 L468.3642 273.3016 L468.6691 272.0766 L468.9709 270.8462 L469.2696 269.6105 L469.5652 268.37 L469.8575 267.125 L470.1465 265.8758 L470.4321 264.6227 L470.7144 263.3661 L470.9933 262.1064 L471.2687 260.8437 L471.5406 259.5785 L471.809 258.3112 L472.0737 257.0419 L472.3348 255.7711 L472.5921 254.4991 L472.8457 253.2261 L473.0956 251.9526 L473.3416 250.6789 L473.5837 249.4053 L473.8219 248.132 L474.0562 246.8596 L474.2864 245.5882 L474.5126 244.3181 L474.7347 243.0498 L474.9527 241.7836 L475.1664 240.5197 L475.3761 239.2586 L475.5815 238.0003 L475.7827 236.7447 L475.9797 235.4918 L476.1728 234.2416 L476.3618 232.9944 L476.547 231.7503 L476.7281 230.5094 L476.9055 229.2717 L477.0791 228.0376 L477.249 226.807 L477.4151 225.5802 L477.5777 224.3572 L477.7366 223.1382 L477.8921 221.9234 L478.0441 220.7128 L478.1927 219.5065 L478.3379 218.3048 L478.4798 217.1077 L478.6185 215.9154 L478.754 214.728 L478.8864 213.5456 L479.0156 212.3683 L479.1419 211.1964 L479.2652 210.0298 L479.3855 208.8688 L479.5031 207.7135 L479.6178 206.5639 L479.7297 205.4203 L479.839 204.2827 L479.9456 203.1513 L480.0497 202.0262 L480.1512 200.9075 L480.2503 199.7954 L480.347 198.69 L480.4413 197.5913 L480.5333 196.4995 L480.6231 195.4148 L480.7107 194.3373 L480.7962 193.267 L480.8796 192.2043 L480.9609 191.1495 L481.0402 190.1033 L481.1175 189.0657 L481.1927 188.0372 L481.2658 187.0181 L481.3369 186.0087 L481.4061 185.0093 L481.4732 184.0201 L481.5383 183.0416 L481.6013 182.0741 L481.6624 181.1178 L481.7215 180.173 L481.7786 179.2402 L481.8338 178.3196 L481.8869 177.4115 L481.9381 176.5163 L481.9873 175.6343 L482.0346 174.7658 L482.0799 173.9112 L482.1233 173.0707 L482.1647 172.2448 L482.2042 171.4337 L482.2418 170.6378 L482.2775 169.8575 L482.3112 169.0932 L482.3431 168.345 L482.3731 167.6136 L482.4012 166.8992 L482.4273 166.2021 L482.4517 165.5229 L482.4742 164.862 L482.4948 164.2196 L482.5135 163.5964 L482.5305 162.9927 L482.5456 162.4091 L482.559 161.8461 L482.5705 161.3042 L482.5803 160.784 L482.5883 160.2852 L482.5948 159.8044 L482.5997 159.3397 L482.6033 158.8903 L482.6059 158.455 L482.6075 158.033 L482.6083 157.6229 L482.6085 157.2235 L482.6083 156.8335 L482.608 156.4515 L482.6075 156.0759 L482.6073 155.7051 L482.6075 155.3372 L482.6085 154.9703 L482.6104 154.6024 L482.6137 154.2311 L482.6189 153.8541 L482.6266 153.4688 L482.6373 153.0723 L482.6522 152.6618 L482.6721 152.2343 L482.6986 151.7867 L482.7333 151.3157 L482.7782 150.8185 L482.8358 150.2921 L482.909 149.7341 L483.0011 149.1429 L483.1158 148.5173 L483.257 147.8577 L483.4286 147.1658 L483.6345 146.4448 L483.8776 145.6998 L484.1602 144.9377 L484.4828 144.1671 L491.7984 143.673 L491.6849 143.6364 L491.5637 143.5966 L491.4319 143.5525 L491.2855 143.5023 L491.119 143.4437 L490.925 143.3731 L490.6926 143.2853 L490.4053 143.1714 L490.0376 143.0168 L489.5471 142.7941 L488.8592 142.4486 L487.8328 141.8544 L486.1849 140.6706 L483.4164 137.776 L480.2612 129.6517 L483.7471 117.8191 L489.53 113.2408" style="fill:none; clip-path:url(#clipPath1); stroke:red;"
      /><path d="M305 360.7143 L240.0021 360.6668 L238.7537 360.5579 L237.51 360.4488 L236.2713 360.3392 L235.0379 360.2289 L233.8102 360.1176 L232.5885 360.0051 L231.3733 359.891 L230.1649 359.7752 L228.9636 359.6575 L227.77 359.5374 L226.5843 359.415 L225.407 359.2898 L224.2385 359.1617 L223.0791 359.0305 L221.9295 358.8958 L220.7898 358.7577 L219.6607 358.6158 L218.5424 358.4699 L217.4355 358.3199 L216.3405 358.1656 L215.2578 358.0067 L214.1877 357.8433 L213.131 357.675 L212.0879 357.5019 L211.059 357.3237 L210.0447 357.1403 L209.0457 356.9517 L208.0623 356.7577 L207.095 356.5584 L206.1445 356.3536 L205.2112 356.1433 L204.2956 355.9276 L203.3982 355.7064 L202.5195 355.4798 L201.6601 355.2479 L200.8204 355.0106 L200.001 354.7682 L199.2006 354.5203 L198.4126 354.2645 L197.6349 354.0005 L196.8675 353.7285 L196.11 353.4487 L195.3622 353.1612 L194.6239 352.8662 L193.8947 352.5639 L193.1746 352.2545 L192.4632 351.9382 L191.7603 351.6151 L191.0659 351.2854 L190.3795 350.9492 L189.7011 350.6068 L189.0305 350.2583 L188.3675 349.9038 L187.7118 349.5435 L187.0634 349.1777 L186.4221 348.8064 L185.7877 348.4298 L185.1601 348.0481 L184.5391 347.6614 L183.9245 347.27 L183.3163 346.8739 L182.7142 346.4734 L182.1182 346.0687 L181.5282 345.6599 L180.9439 345.2471 L180.3652 344.8306 L179.7921 344.4106 L179.2244 343.9872 L178.662 343.5605 L178.1047 343.1309 L177.5525 342.6984 L177.0051 342.2632 L176.4624 341.8257 L175.9244 341.3857 L175.3908 340.9438 L174.8616 340.4998 L174.3379 340.0553 L173.8248 339.6148 L173.3234 339.1794 L172.8334 338.7485 L172.3545 338.3219 L171.8863 337.8991 L171.4284 337.4798 L170.9806 337.0635 L170.5424 336.6499 L170.1133 336.2384 L169.693 335.8286 L169.281 335.42 L168.8769 335.0121 L168.4801 334.6043 L168.0903 334.1961 L167.7069 333.787 L167.3294 333.3763 L166.9574 332.9635 L166.5903 332.5479 L166.2277 332.1288 L165.8691 331.7057 L165.514 331.2779 L165.162 330.8445 L164.8126 330.4051 L164.4654 329.9589 L164.1199 329.5052 L163.7759 329.0432 L163.4328 328.5724 L163.0903 328.0919 L162.7481 327.6012 L162.4059 327.0995 L162.0633 326.5863 L161.7201 326.0607 L161.3759 325.5222 L161.0307 324.9702 L160.6841 324.404 L160.3358 323.823 L159.9857 323.2267 L159.6337 322.6144 L159.2794 321.9856 L158.9227 321.3395 L158.5636 320.6762 L158.2023 319.9959 L157.8392 319.2991 L157.4745 318.5859 L157.1083 317.8566 L156.7408 317.1115 L156.3723 316.3509 L156.0029 315.575 L155.6328 314.784 L155.2621 313.9783 L154.891 313.158 L154.5197 312.3234 L154.1483 311.4747 L153.7769 310.6122 L153.4057 309.7361 L153.0348 308.8466 L152.6643 307.9439 L152.2944 307.0283 L151.9252 306.1 L151.5567 305.1591 L151.1891 304.2059 L150.8226 303.2407 L150.4571 302.2635 L150.0929 301.2747 L149.73 300.2744 L149.3685 299.2628 L149.0086 298.2401 L148.6503 297.2065 L148.2937 296.1622 L147.9388 295.1074 L147.5859 294.0423 L147.235 292.9671 L146.8861 291.882 L146.5395 290.7871 L146.195 289.6827 L145.8529 288.5689 L145.5132 287.446 L145.176 286.3139 L144.8412 285.1723 L144.5087 284.0214 L144.1788 282.8615 L143.8513 281.693 L143.5265 280.5162 L143.2044 279.3315 L142.8849 278.1393 L142.5683 276.9398 L142.2545 275.7335 L141.9437 274.5207 L141.6358 273.3016 L141.3309 272.0766 L141.0291 270.8462 L140.7304 269.6105 L140.4349 268.37 L140.1425 267.125 L139.8535 265.8758 L139.5679 264.6227 L139.2856 263.3661 L139.0067 262.1064 L138.7313 260.8437 L138.4594 259.5785 L138.191 258.3112 L137.9263 257.0419 L137.6652 255.7711 L137.4079 254.4991 L137.1543 253.2261 L136.9044 251.9526 L136.6584 250.6789 L136.4163 249.4053 L136.1781 248.132 L135.9439 246.8596 L135.7136 245.5882 L135.4874 244.3181 L135.2653 243.0498 L135.0473 241.7836 L134.8335 240.5197 L134.6239 239.2586 L134.4186 238.0003 L134.2174 236.7447 L134.0202 235.4918 L133.8272 234.2416 L133.6382 232.9944 L133.453 231.7503 L133.2718 230.5094 L133.0945 229.2717 L132.9209 228.0376 L132.751 226.807 L132.5849 225.5802 L132.4223 224.3572 L132.2634 223.1382 L132.1079 221.9234 L131.9559 220.7128 L131.8073 219.5065 L131.6621 218.3048 L131.5202 217.1077 L131.3815 215.9154 L131.246 214.728 L131.1136 213.5456 L130.9844 212.3683 L130.8581 211.1964 L130.7348 210.0298 L130.6145 208.8688 L130.497 207.7135 L130.3822 206.5639 L130.2703 205.4203 L130.161 204.2827 L130.0544 203.1513 L129.9503 202.0262 L129.8487 200.9075 L129.7497 199.7954 L129.653 198.69 L129.5587 197.5913 L129.4667 196.4995 L129.3769 195.4148 L129.2893 194.3373 L129.2038 193.267 L129.1204 192.2043 L129.0391 191.1495 L128.9598 190.1033 L128.8826 189.0657 L128.8074 188.0372 L128.7342 187.0181 L128.663 186.0087 L128.5939 185.0093 L128.5268 184.0201 L128.4617 183.0416 L128.3987 182.0741 L128.3376 181.1178 L128.2785 180.173 L128.2214 179.2402 L128.1662 178.3196 L128.1131 177.4115 L128.0619 176.5163 L128.0127 175.6343 L127.9654 174.7658 L127.9201 173.9112 L127.8767 173.0707 L127.8353 172.2448 L127.7958 171.4337 L127.7582 170.6378 L127.7225 169.8575 L127.6888 169.0932 L127.6569 168.345 L127.6269 167.6136 L127.5989 166.8992 L127.5726 166.2021 L127.5483 165.5229 L127.5258 164.862 L127.5052 164.2196 L127.4865 163.5964 L127.4695 162.9927 L127.4544 162.4091 L127.441 161.8461 L127.4295 161.3042 L127.4197 160.784 L127.4117 160.2852 L127.4053 159.8044 L127.4003 159.3397 L127.3967 158.8903 L127.3941 158.455 L127.3926 158.033 L127.3917 157.6229 L127.3915 157.2235 L127.3917 156.8335 L127.392 156.4515 L127.3925 156.0759 L127.3927 155.7051 L127.3925 155.3372 L127.3916 154.9703 L127.3896 154.6024 L127.3863 154.2311 L127.3811 153.8541 L127.3734 153.4688 L127.3627 153.0723 L127.3478 152.6618 L127.3279 152.2343 L127.3014 151.7867 L127.2667 151.3157 L127.2218 150.8185 L127.1642 150.2921 L127.091 149.7341 L126.9989 149.1429 L126.8842 148.5173 L126.743 147.8577 L126.5714 147.1658 L126.3656 146.4448 L126.1224 145.6998 L125.8398 144.9377 L125.5172 144.1671 L118.2016 143.673 L118.3151 143.6364 L118.4363 143.5966 L118.5681 143.5525 L118.7145 143.5023 L118.881 143.4437 L119.0749 143.3731 L119.3074 143.2853 L119.5947 143.1714 L119.9624 143.0168 L120.4529 142.7941 L121.1408 142.4486 L122.1672 141.8544 L123.8151 140.6706 L126.5836 137.776 L129.7388 129.6517 L126.2529 117.8191 L120.47 113.2408" style="fill:none; clip-path:url(#clipPath1); stroke:red;"
    /></g
  ></g
></svg
>
