<?xml version="1.0" encoding="UTF-8"?>
<!DOCTYPE svg PUBLIC '-//W3C//DTD SVG 1.0//EN'
          'http://www.w3.org/TR/2001/REC-SVG-20010904/DTD/svg10.dtd'>
<svg xmlns:xlink="http://www.w3.org/1999/xlink" style="fill-opacity:1; color-rendering:auto; color-interpolation:auto; text-rendering:auto; stroke:black; stroke-linecap:square; stroke-miterlimit:10; shape-rendering:auto; stroke-opacity:1; fill:black; stroke-dasharray:none; font-weight:normal; stroke-width:1; font-family:'Dialog'; font-style:normal; stroke-linejoin:miter; font-size:12px; stroke-dashoffset:0; image-rendering:auto;" width="610" height="460" xmlns="http://www.w3.org/2000/svg"
><!--Generated by Scilab with Batik SVG Generator--><defs id="genericDefs"
  /><g
  ><defs id="defs1"
    ><clipPath clipPathUnits="userSpaceOnUse" id="clipPath1"
      ><path d="M97.9959 22.9959 L512.0042 22.9959 L512.0042 437.0042 L97.9959 437.0042 L97.9959 22.9959 Z"
      /></clipPath
      ><font horiz-adv-x="75.0" id="font1"
      ><font-face ascent="92.163086" descent="19.555664" units-per-em="100" style="font-style:normal; font-family:sans-serif; font-weight:normal;"
        /><missing-glyph horiz-adv-x="75.0" d="M12.5 0 L12.5 62.5 L62.5 62.5 L62.5 0 L12.5 0 ZM14.0625 1.5625 L60.9375 1.5625 L60.9375 60.9375 L14.0625 60.9375 L14.0625 1.5625 Z"
        /><glyph unicode="0" horiz-adv-x="56.0" d="M4.1562 35.2969 Q4.1562 48 6.7656 55.7422 Q9.375 63.4844 14.5234 67.6797 Q19.6719 71.875 27.4844 71.875 Q33.25 71.875 37.5938 69.5547 Q41.9375 67.2344 44.7734 62.8672 Q47.6094 58.5 49.2188 52.2266 Q50.8281 45.9531 50.8281 35.2969 Q50.8281 22.7031 48.2422 14.9688 Q45.6562 7.2344 40.5078 3.0078 Q35.3594 -1.2188 27.4844 -1.2188 Q17.1406 -1.2188 11.2344 6.2031 Q4.1562 15.1406 4.1562 35.2969 ZM13.1875 35.2969 Q13.1875 17.6719 17.3125 11.8359 Q21.4375 6 27.4844 6 Q33.5469 6 37.6719 11.8594 Q41.7969 17.7188 41.7969 35.2969 Q41.7969 52.9844 37.6719 58.7891 Q33.5469 64.5938 27.3906 64.5938 Q21.3438 64.5938 17.7188 59.4688 Q13.1875 52.9375 13.1875 35.2969 Z"
        /><glyph unicode="1" horiz-adv-x="56.0" d="M37.25 0 L28.4688 0 L28.4688 56 Q25.2969 52.9844 20.1406 49.9531 Q14.9844 46.9219 10.8906 45.4062 L10.8906 53.9062 Q18.2656 57.375 23.7812 62.3047 Q29.2969 67.2344 31.5938 71.875 L37.25 71.875 L37.25 0 Z"
        /><glyph unicode="-" horiz-adv-x="33.0" d="M3.1719 21.4844 L3.1719 30.3281 L30.1719 30.3281 L30.1719 21.4844 L3.1719 21.4844 Z"
        /><glyph unicode="2" horiz-adv-x="56.0" d="M50.3438 8.4531 L50.3438 0 L3.0312 0 Q2.9375 3.1719 4.0469 6.1094 Q5.8594 10.9375 9.8359 15.625 Q13.8125 20.3125 21.3438 26.4688 Q33.0156 36.0312 37.1172 41.625 Q41.2188 47.2188 41.2188 52.2031 Q41.2188 57.4219 37.4766 61.0078 Q33.7344 64.5938 27.7344 64.5938 Q21.3906 64.5938 17.5781 60.7891 Q13.7656 56.9844 13.7188 50.25 L4.6875 51.1719 Q5.6094 61.2812 11.6641 66.5781 Q17.7188 71.875 27.9375 71.875 Q38.2344 71.875 44.2422 66.1641 Q50.25 60.4531 50.25 52 Q50.25 47.7031 48.4922 43.5547 Q46.7344 39.4062 42.6562 34.8125 Q38.5781 30.2188 29.1094 22.2188 Q21.1875 15.5781 18.9453 13.2109 Q16.7031 10.8438 15.2344 8.4531 L50.3438 8.4531 Z"
        /><glyph unicode="8" horiz-adv-x="56.0" d="M17.6719 38.8125 Q12.2031 40.8281 9.5703 44.5391 Q6.9375 48.25 6.9375 53.4219 Q6.9375 61.2344 12.5547 66.5547 Q18.1719 71.875 27.4844 71.875 Q36.8594 71.875 42.5781 66.4297 Q48.2969 60.9844 48.2969 53.1719 Q48.2969 48.1875 45.6797 44.5078 Q43.0625 40.8281 37.75 38.8125 Q44.3438 36.6719 47.7812 31.8828 Q51.2188 27.0938 51.2188 20.4531 Q51.2188 11.2812 44.7266 5.0312 Q38.2344 -1.2188 27.6406 -1.2188 Q17.0469 -1.2188 10.5469 5.0547 Q4.0469 11.3281 4.0469 20.7031 Q4.0469 27.6875 7.5938 32.3984 Q11.1406 37.1094 17.6719 38.8125 ZM15.9219 53.7188 Q15.9219 48.6406 19.1953 45.4141 Q22.4688 42.1875 27.6875 42.1875 Q32.7656 42.1875 36.0156 45.3828 Q39.2656 48.5781 39.2656 53.2188 Q39.2656 58.0625 35.9141 61.3594 Q32.5625 64.6562 27.5938 64.6562 Q22.5625 64.6562 19.2422 61.4297 Q15.9219 58.2031 15.9219 53.7188 ZM13.0938 20.6562 Q13.0938 16.8906 14.875 13.375 Q16.6562 9.8594 20.1719 7.9297 Q23.6875 6 27.7344 6 Q34.0312 6 38.1328 10.0547 Q42.2344 14.1094 42.2344 20.3594 Q42.2344 26.7031 38.0156 30.8594 Q33.7969 35.0156 27.4375 35.0156 Q21.2344 35.0156 17.1641 30.9141 Q13.0938 26.8125 13.0938 20.6562 Z"
        /><glyph unicode="6" horiz-adv-x="56.0" d="M49.75 54.0469 L41.0156 53.375 Q39.8438 58.5469 37.7031 60.8906 Q34.125 64.6562 28.9062 64.6562 Q24.7031 64.6562 21.5312 62.3125 Q17.3906 59.2812 14.9922 53.4688 Q12.5938 47.6562 12.5 36.9219 Q15.6719 41.75 20.2656 44.0938 Q24.8594 46.4375 29.8906 46.4375 Q38.6719 46.4375 44.8516 39.9688 Q51.0312 33.5 51.0312 23.25 Q51.0312 16.5 48.125 10.7188 Q45.2188 4.9375 40.1406 1.8594 Q35.0625 -1.2188 28.6094 -1.2188 Q17.625 -1.2188 10.6953 6.8594 Q3.7656 14.9375 3.7656 33.5 Q3.7656 54.25 11.4219 63.6719 Q18.1094 71.875 29.4375 71.875 Q37.8906 71.875 43.2891 67.1406 Q48.6875 62.4062 49.75 54.0469 ZM13.875 23.1875 Q13.875 18.6562 15.7969 14.5078 Q17.7188 10.3594 21.1875 8.1797 Q24.6562 6 28.4688 6 Q34.0312 6 38.0391 10.4922 Q42.0469 14.9844 42.0469 22.7031 Q42.0469 30.125 38.0859 34.3984 Q34.125 38.6719 28.125 38.6719 Q22.1719 38.6719 18.0234 34.3984 Q13.875 30.125 13.875 23.1875 Z"
        /><glyph unicode="4" horiz-adv-x="56.0" d="M32.3281 0 L32.3281 17.1406 L1.2656 17.1406 L1.2656 25.2031 L33.9375 71.5781 L41.1094 71.5781 L41.1094 25.2031 L50.7812 25.2031 L50.7812 17.1406 L41.1094 17.1406 L41.1094 0 L32.3281 0 ZM32.3281 25.2031 L32.3281 57.4688 L9.9062 25.2031 L32.3281 25.2031 Z"
        /><glyph unicode="m" horiz-adv-x="84.0" d="M6.5938 0 L6.5938 51.8594 L14.4531 51.8594 L14.4531 44.5781 Q16.8906 48.3906 20.9453 50.7109 Q25 53.0312 30.1719 53.0312 Q35.9375 53.0312 39.625 50.6406 Q43.3125 48.25 44.8281 43.9531 Q50.9844 53.0312 60.8438 53.0312 Q68.5625 53.0312 72.7109 48.7578 Q76.8594 44.4844 76.8594 35.5938 L76.8594 0 L68.1094 0 L68.1094 32.6719 Q68.1094 37.9375 67.2578 40.2578 Q66.4062 42.5781 64.1641 43.9922 Q61.9219 45.4062 58.8906 45.4062 Q53.4219 45.4062 49.8047 41.7734 Q46.1875 38.1406 46.1875 30.125 L46.1875 0 L37.4062 0 L37.4062 33.6875 Q37.4062 39.5469 35.2578 42.4766 Q33.1094 45.4062 28.2188 45.4062 Q24.5156 45.4062 21.3672 43.4531 Q18.2188 41.5 16.7969 37.7422 Q15.375 33.9844 15.375 26.9062 L15.375 0 L6.5938 0 Z"
        /><glyph unicode=" " horiz-adv-x="28.0" d=""
        /><glyph unicode="9" horiz-adv-x="56.0" d="M5.4688 16.5469 L13.9219 17.3281 Q14.9844 11.375 18.0156 8.6875 Q21.0469 6 25.7812 6 Q29.8281 6 32.8828 7.8594 Q35.9375 9.7188 37.8906 12.8203 Q39.8438 15.9219 41.1641 21.1953 Q42.4844 26.4688 42.4844 31.9375 Q42.4844 32.5156 42.4375 33.6875 Q39.7969 29.5 35.2344 26.8828 Q30.6719 24.2656 25.3438 24.2656 Q16.4531 24.2656 10.3047 30.7109 Q4.1562 37.1562 4.1562 47.7031 Q4.1562 58.5938 10.5781 65.2344 Q17 71.875 26.6562 71.875 Q33.6406 71.875 39.4297 68.1172 Q45.2188 64.3594 48.2188 57.3984 Q51.2188 50.4375 51.2188 37.25 Q51.2188 23.5312 48.2422 15.4062 Q45.2656 7.2812 39.3828 3.0312 Q33.5 -1.2188 25.5938 -1.2188 Q17.1875 -1.2188 11.8672 3.4453 Q6.5469 8.1094 5.4688 16.5469 ZM41.4531 48.1406 Q41.4531 55.7188 37.4297 60.1562 Q33.4062 64.5938 27.7344 64.5938 Q21.875 64.5938 17.5312 59.8125 Q13.1875 55.0312 13.1875 47.4062 Q13.1875 40.5781 17.3125 36.3047 Q21.4375 32.0312 27.4844 32.0312 Q33.5938 32.0312 37.5234 36.3047 Q41.4531 40.5781 41.4531 48.1406 Z"
        /><glyph unicode="3" horiz-adv-x="56.0" d="M4.2031 18.8906 L12.9844 20.0625 Q14.5 12.5938 18.1406 9.2969 Q21.7812 6 27 6 Q33.2031 6 37.4766 10.2969 Q41.75 14.5938 41.75 20.9531 Q41.75 27 37.7969 30.9297 Q33.8438 34.8594 27.7344 34.8594 Q25.25 34.8594 21.5312 33.8906 L22.5156 41.6094 Q23.3906 41.5 23.9219 41.5 Q29.5469 41.5 34.0391 44.4297 Q38.5312 47.3594 38.5312 53.4688 Q38.5312 58.2969 35.2578 61.4766 Q31.9844 64.6562 26.8125 64.6562 Q21.6875 64.6562 18.2656 61.4297 Q14.8438 58.2031 13.875 51.7656 L5.0781 53.3281 Q6.6875 62.1562 12.3984 67.0156 Q18.1094 71.875 26.6094 71.875 Q32.4688 71.875 37.3984 69.3594 Q42.3281 66.8438 44.9453 62.5 Q47.5625 58.1562 47.5625 53.2656 Q47.5625 48.6406 45.0703 44.8281 Q42.5781 41.0156 37.7031 38.7656 Q44.0469 37.3125 47.5625 32.6953 Q51.0781 28.0781 51.0781 21.1406 Q51.0781 11.7656 44.2422 5.25 Q37.4062 -1.2656 26.9531 -1.2656 Q17.5312 -1.2656 11.3047 4.3516 Q5.0781 9.9688 4.2031 18.8906 Z"
        /><glyph unicode="5" horiz-adv-x="56.0" d="M4.1562 18.75 L13.375 19.5312 Q14.4062 12.7969 18.1406 9.3984 Q21.875 6 27.1562 6 Q33.5 6 37.8906 10.7891 Q42.2812 15.5781 42.2812 23.4844 Q42.2812 31 38.0625 35.3516 Q33.8438 39.7031 27 39.7031 Q22.75 39.7031 19.3359 37.7734 Q15.9219 35.8438 13.9688 32.7656 L5.7188 33.8438 L12.6406 70.6094 L48.25 70.6094 L48.25 62.2031 L19.6719 62.2031 L15.8281 42.9688 Q22.2656 47.4688 29.3438 47.4688 Q38.7188 47.4688 45.1641 40.9688 Q51.6094 34.4688 51.6094 24.2656 Q51.6094 14.5469 45.9531 7.4688 Q39.0625 -1.2188 27.1562 -1.2188 Q17.3906 -1.2188 11.2109 4.25 Q5.0312 9.7188 4.1562 18.75 Z"
        /><glyph unicode="7" horiz-adv-x="56.0" d="M4.7344 62.2031 L4.7344 70.6562 L51.0781 70.6562 L51.0781 63.8125 Q44.2344 56.5469 37.5234 44.4844 Q30.8125 32.4219 27.1562 19.6719 Q24.5156 10.6875 23.7812 0 L14.75 0 Q14.8906 8.4531 18.0625 20.4141 Q21.2344 32.375 27.1719 43.4844 Q33.1094 54.5938 39.7969 62.2031 L4.7344 62.2031 Z"
        /><glyph unicode="r" horiz-adv-x="33.0" d="M6.5 0 L6.5 51.8594 L14.4062 51.8594 L14.4062 44 Q17.4375 49.5156 20 51.2734 Q22.5625 53.0312 25.6406 53.0312 Q30.0781 53.0312 34.6719 50.2031 L31.6406 42.0469 Q28.4219 43.9531 25.2031 43.9531 Q22.3125 43.9531 20.0156 42.2188 Q17.7188 40.4844 16.75 37.4062 Q15.2812 32.7188 15.2812 27.1562 L15.2812 0 L6.5 0 Z"
        /><glyph unicode="e" horiz-adv-x="56.0" d="M42.0938 16.7031 L51.1719 15.5781 Q49.0312 7.625 43.2188 3.2266 Q37.4062 -1.1719 28.375 -1.1719 Q17 -1.1719 10.3281 5.8359 Q3.6562 12.8438 3.6562 25.4844 Q3.6562 38.5781 10.3984 45.8047 Q17.1406 53.0312 27.875 53.0312 Q38.2812 53.0312 44.875 45.9531 Q51.4688 38.875 51.4688 26.0312 Q51.4688 25.25 51.4219 23.6875 L12.75 23.6875 Q13.2344 15.1406 17.5781 10.6016 Q21.9219 6.0625 28.4219 6.0625 Q33.25 6.0625 36.6719 8.6016 Q40.0938 11.1406 42.0938 16.7031 ZM13.2344 30.9062 L42.1875 30.9062 Q41.6094 37.4531 38.875 40.7188 Q34.6719 45.7969 27.9844 45.7969 Q21.9219 45.7969 17.7969 41.75 Q13.6719 37.7031 13.2344 30.9062 Z"
        /><glyph unicode="b" horiz-adv-x="56.0" d="M14.7031 0 L6.5469 0 L6.5469 71.5781 L15.3281 71.5781 L15.3281 46.0469 Q20.9062 53.0312 29.5469 53.0312 Q34.3281 53.0312 38.6016 51.1016 Q42.875 49.1719 45.6328 45.6797 Q48.3906 42.1875 49.9531 37.2578 Q51.5156 32.3281 51.5156 26.7031 Q51.5156 13.375 44.9219 6.1016 Q38.3281 -1.1719 29.1094 -1.1719 Q19.9219 -1.1719 14.7031 6.5 L14.7031 0 ZM14.5938 26.3125 Q14.5938 17 17.1406 12.8438 Q21.2969 6.0625 28.375 6.0625 Q34.125 6.0625 38.3281 11.0625 Q42.5312 16.0625 42.5312 25.9844 Q42.5312 36.1406 38.5 40.9688 Q34.4688 45.7969 28.7656 45.7969 Q23 45.7969 18.7969 40.7969 Q14.5938 35.7969 14.5938 26.3125 Z"
        /><glyph unicode="u" horiz-adv-x="56.0" d="M40.5781 0 L40.5781 7.625 Q34.5156 -1.1719 24.125 -1.1719 Q19.5312 -1.1719 15.5547 0.5859 Q11.5781 2.3438 9.6484 5.0078 Q7.7188 7.6719 6.9375 11.5312 Q6.3906 14.1094 6.3906 19.7344 L6.3906 51.8594 L15.1875 51.8594 L15.1875 23.0938 Q15.1875 16.2188 15.7188 13.8125 Q16.5469 10.3594 19.2344 8.375 Q21.9219 6.3906 25.875 6.3906 Q29.8281 6.3906 33.2969 8.4219 Q36.7656 10.4531 38.2109 13.9453 Q39.6562 17.4375 39.6562 24.0781 L39.6562 51.8594 L48.4375 51.8594 L48.4375 0 L40.5781 0 Z"
        /><glyph unicode="g" horiz-adv-x="55.0" d="M4.9844 -4.2969 L13.5312 -5.5625 Q14.0625 -9.5156 16.5 -11.3281 Q19.7812 -13.7656 25.4375 -13.7656 Q31.5469 -13.7656 34.8672 -11.3281 Q38.1875 -8.8906 39.3594 -4.5 Q40.0469 -1.8125 39.9844 6.7812 Q34.2344 0 25.6406 0 Q14.9375 0 9.0781 7.7188 Q3.2188 15.4375 3.2188 26.2188 Q3.2188 33.6406 5.9062 39.9141 Q8.5938 46.1875 13.6953 49.6094 Q18.7969 53.0312 25.6875 53.0312 Q34.8594 53.0312 40.8281 45.6094 L40.8281 51.8594 L48.9219 51.8594 L48.9219 7.0312 Q48.9219 -5.0781 46.4609 -10.1328 Q44 -15.1875 38.6484 -18.1172 Q33.2969 -21.0469 25.4844 -21.0469 Q16.2188 -21.0469 10.5 -16.875 Q4.7812 -12.7031 4.9844 -4.2969 ZM12.25 26.8594 Q12.25 16.6562 16.3047 11.9688 Q20.3594 7.2812 26.4688 7.2812 Q32.5156 7.2812 36.6172 11.9453 Q40.7188 16.6094 40.7188 26.5625 Q40.7188 36.0781 36.5 40.9141 Q32.2812 45.75 26.3125 45.75 Q20.4531 45.75 16.3516 40.9922 Q12.25 36.2344 12.25 26.8594 Z"
        /><glyph unicode="n" horiz-adv-x="56.0" d="M6.5938 0 L6.5938 51.8594 L14.5 51.8594 L14.5 44.4844 Q20.2188 53.0312 31 53.0312 Q35.6875 53.0312 39.625 51.3438 Q43.5625 49.6562 45.5156 46.9219 Q47.4688 44.1875 48.25 40.4375 Q48.7344 37.9844 48.7344 31.8906 L48.7344 0 L39.9375 0 L39.9375 31.5469 Q39.9375 36.9219 38.9141 39.5781 Q37.8906 42.2344 35.2812 43.8203 Q32.6719 45.4062 29.1562 45.4062 Q23.5312 45.4062 19.4531 41.8438 Q15.375 38.2812 15.375 28.3281 L15.375 0 L6.5938 0 Z"
        /><glyph unicode="i" horiz-adv-x="22.0" d="M6.6406 61.4688 L6.6406 71.5781 L15.4375 71.5781 L15.4375 61.4688 L6.6406 61.4688 ZM6.6406 0 L6.6406 51.8594 L15.4375 51.8594 L15.4375 0 L6.6406 0 Z"
        /><glyph unicode="R" horiz-adv-x="72.0" d="M7.8594 0 L7.8594 71.5781 L39.5938 71.5781 Q49.1719 71.5781 54.1484 69.6484 Q59.125 67.7188 62.1094 62.8359 Q65.0938 57.9531 65.0938 52.0469 Q65.0938 44.4375 60.1562 39.2109 Q55.2188 33.9844 44.9219 32.5625 Q48.6875 30.7656 50.6406 29 Q54.7812 25.2031 58.5 19.4844 L70.9531 0 L59.0312 0 L49.5625 14.8906 Q45.4062 21.3438 42.7266 24.7578 Q40.0469 28.1719 37.9219 29.5391 Q35.7969 30.9062 33.5938 31.4531 Q31.9844 31.7812 28.3281 31.7812 L17.3281 31.7812 L17.3281 0 L7.8594 0 ZM17.3281 39.9844 L37.7031 39.9844 Q44.1875 39.9844 47.8516 41.3281 Q51.5156 42.6719 53.4219 45.625 Q55.3281 48.5781 55.3281 52.0469 Q55.3281 57.125 51.6406 60.3984 Q47.9531 63.6719 39.9844 63.6719 L17.3281 63.6719 L17.3281 39.9844 Z"
      /></font
    ></defs
    ><g style="fill:white; text-rendering:optimizeLegibility; stroke:white;"
    ><rect x="0" width="610" height="460" y="0" style="stroke:none;"
    /></g
    ><g style="stroke-linecap:butt; fill:white; text-rendering:geometricPrecision; stroke-linejoin:bevel; shape-rendering:crispEdges; stroke:white; stroke-width:0;"
    ><path style="stroke:none;" d="M512 23 L512 437 L98 23 Z"
      /><path style="stroke:none;" d="M512 437 L98 437 L98 23 Z"
      /><path style="stroke:none;" d="M512 23 L512 437 L512 437 Z"
      /><path style="stroke:none;" d="M98 23 L98 437 L98 437 Z"
      /><path style="stroke:none;" d="M512 23 L512 437 L98 23 Z"
      /><path style="stroke:none;" d="M512 437 L98 437 L98 23 Z"
      /><path style="stroke:none;" d="M512 23 L512 23 L512 437 Z"
      /><path style="stroke:none;" d="M98 23 L98 23 L98 437 Z"
      /><path style="stroke:none;" d="M512 23 L98 23 L512 23 Z"
      /><path style="stroke:none;" d="M98 23 L98 23 L512 23 Z"
      /><path style="stroke:none;" d="M512 437 L98 437 L512 437 Z"
      /><path style="stroke:none;" d="M98 437 L98 437 L512 437 Z"
    /></g
    ><g transform="translate(301.5,446)" style="font-size:10px; stroke-linecap:butt; text-rendering:geometricPrecision; font-family:sans-serif; stroke-linejoin:bevel; stroke-width:0;"
    ><text x="-0.4219" xml:space="preserve" y="9.2163" style="stroke:none;"
      >0</text
    ></g
    ><g transform="translate(121.5,446)" style="font-size:10px; stroke-linecap:butt; text-rendering:geometricPrecision; font-family:sans-serif; stroke-linejoin:bevel; stroke-width:0;"
    ><text x="-0.3125" xml:space="preserve" y="9.2163" style="stroke:none;"
      >-100</text
    ></g
    ><g transform="translate(468.5,446)" style="font-size:10px; stroke-linecap:butt; text-rendering:geometricPrecision; font-family:sans-serif; stroke-linejoin:bevel; stroke-width:0;"
    ><text x="-1.0938" xml:space="preserve" y="9.2163" style="stroke:none;"
      >100</text
    ></g
    ><g transform="translate(87,446)" style="font-size:10px; stroke-linecap:butt; text-rendering:geometricPrecision; font-family:sans-serif; stroke-linejoin:bevel; stroke-width:0;"
    ><text x="-0.3125" xml:space="preserve" y="9.2163" style="stroke:none;"
      >-120</text
    ></g
    ><g transform="translate(159,446)" style="font-size:10px; stroke-linecap:butt; text-rendering:geometricPrecision; font-family:sans-serif; stroke-linejoin:bevel; stroke-width:0;"
    ><text x="-0.3125" xml:space="preserve" y="9.2163" style="stroke:none;"
      >-80</text
    ></g
    ><g transform="translate(193.5,446)" style="font-size:10px; stroke-linecap:butt; text-rendering:geometricPrecision; font-family:sans-serif; stroke-linejoin:bevel; stroke-width:0;"
    ><text x="-0.3125" xml:space="preserve" y="9.2163" style="stroke:none;"
      >-60</text
    ></g
    ><g transform="translate(228,446)" style="font-size:10px; stroke-linecap:butt; text-rendering:geometricPrecision; font-family:sans-serif; stroke-linejoin:bevel; stroke-width:0;"
    ><text x="-0.3125" xml:space="preserve" y="9.2163" style="stroke:none;"
      >-40</text
    ></g
    ><g transform="translate(262.5,446)" style="font-size:10px; stroke-linecap:butt; text-rendering:geometricPrecision; font-family:sans-serif; stroke-linejoin:bevel; stroke-width:0;"
    ><text x="-0.3125" xml:space="preserve" y="9.2163" style="stroke:none;"
      >-20</text
    ></g
    ><g transform="translate(333,446)" style="font-size:10px; stroke-linecap:butt; text-rendering:geometricPrecision; font-family:sans-serif; stroke-linejoin:bevel; stroke-width:0;"
    ><text x="-0.2969" xml:space="preserve" y="9.2163" style="stroke:none;"
      >20</text
    ></g
    ><g transform="translate(367.5,446)" style="font-size:10px; stroke-linecap:butt; text-rendering:geometricPrecision; font-family:sans-serif; stroke-linejoin:bevel; stroke-width:0;"
    ><text x="-0.125" xml:space="preserve" y="9.2163" style="stroke:none;"
      >40</text
    ></g
    ><g transform="translate(402,446)" style="font-size:10px; stroke-linecap:butt; text-rendering:geometricPrecision; font-family:sans-serif; stroke-linejoin:bevel; stroke-width:0;"
    ><text x="-0.375" xml:space="preserve" y="9.2163" style="stroke:none;"
      >60</text
    ></g
    ><g transform="translate(436.5,446)" style="font-size:10px; stroke-linecap:butt; text-rendering:geometricPrecision; font-family:sans-serif; stroke-linejoin:bevel; stroke-width:0;"
    ><text x="-0.4062" xml:space="preserve" y="9.2163" style="stroke:none;"
      >80</text
    ></g
    ><g transform="translate(503,446)" style="font-size:10px; stroke-linecap:butt; text-rendering:geometricPrecision; font-family:sans-serif; stroke-linejoin:bevel; stroke-width:0;"
    ><text x="-1.0938" xml:space="preserve" y="9.2163" style="stroke:none;"
      >120</text
    ></g
    ><g style="text-rendering:geometricPrecision; font-size:10px; shape-rendering:crispEdges; font-family:sans-serif; stroke-linecap:butt;"
    ><path style="fill:none;" d="M98 437 L98 443"
      /><path style="fill:none;" d="M132.5 437 L132.5 443"
      /><path style="fill:none;" d="M167 437 L167 443"
      /><path style="fill:none;" d="M201.5 437 L201.5 443"
      /><path style="fill:none;" d="M236 437 L236 443"
      /><path style="fill:none;" d="M270.5 437 L270.5 443"
      /><path style="fill:none;" d="M305 437 L305 443"
      /><path style="fill:none;" d="M339.5 437 L339.5 443"
      /><path style="fill:none;" d="M374 437 L374 443"
      /><path style="fill:none;" d="M408.5 437 L408.5 443"
      /><path style="fill:none;" d="M443 437 L443 443"
      /><path style="fill:none;" d="M477.5 437 L477.5 443"
      /><path style="fill:none;" d="M512 437 L512 443"
      /><path style="fill:none;" d="M98 437 L98 440"
      /><path style="fill:none;" d="M115.25 437 L115.25 440"
      /><path style="fill:none;" d="M132.5 437 L132.5 440"
      /><path style="fill:none;" d="M149.75 437 L149.75 440"
      /><path style="fill:none;" d="M167 437 L167 440"
      /><path style="fill:none;" d="M184.25 437 L184.25 440"
      /><path style="fill:none;" d="M201.5 437 L201.5 440"
      /><path style="fill:none;" d="M218.75 437 L218.75 440"
      /><path style="fill:none;" d="M236 437 L236 440"
      /><path style="fill:none;" d="M253.25 437 L253.25 440"
      /><path style="fill:none;" d="M270.5 437 L270.5 440"
      /><path style="fill:none;" d="M287.75 437 L287.75 440"
      /><path style="fill:none;" d="M305 437 L305 440"
      /><path style="fill:none;" d="M322.25 437 L322.25 440"
      /><path style="fill:none;" d="M339.5 437 L339.5 440"
      /><path style="fill:none;" d="M356.75 437 L356.75 440"
      /><path style="fill:none;" d="M374 437 L374 440"
      /><path style="fill:none;" d="M391.25 437 L391.25 440"
      /><path style="fill:none;" d="M408.5 437 L408.5 440"
      /><path style="fill:none;" d="M425.75 437 L425.75 440"
      /><path style="fill:none;" d="M443 437 L443 440"
      /><path style="fill:none;" d="M460.25 437 L460.25 440"
      /><path style="fill:none;" d="M477.5 437 L477.5 440"
      /><path style="fill:none;" d="M494.75 437 L494.75 440"
      /><path style="fill:none;" d="M512 437 L512 440"
      /><path style="fill:none;" d="M512 437 L98 437"
      /><text x="-0.4219" y="9.2163" transform="translate(82,223.5)" style="stroke-linejoin:bevel; shape-rendering:auto; stroke:none; stroke-width:0;" xml:space="preserve"
      >0</text
    ></g
    ><g transform="translate(67,396)" style="font-size:10px; stroke-linecap:butt; text-rendering:geometricPrecision; font-family:sans-serif; stroke-linejoin:bevel; stroke-width:0;"
    ><text x="-0.3125" xml:space="preserve" y="9.2163" style="stroke:none;"
      >-100</text
    ></g
    ><g transform="translate(71,51)" style="font-size:10px; stroke-linecap:butt; text-rendering:geometricPrecision; font-family:sans-serif; stroke-linejoin:bevel; stroke-width:0;"
    ><text x="-1.0938" xml:space="preserve" y="9.2163" style="stroke:none;"
      >100</text
    ></g
    ><g transform="translate(67,430.5)" style="font-size:10px; stroke-linecap:butt; text-rendering:geometricPrecision; font-family:sans-serif; stroke-linejoin:bevel; stroke-width:0;"
    ><text x="-0.3125" xml:space="preserve" y="9.2163" style="stroke:none;"
      >-120</text
    ></g
    ><g transform="translate(73,361.5)" style="font-size:10px; stroke-linecap:butt; text-rendering:geometricPrecision; font-family:sans-serif; stroke-linejoin:bevel; stroke-width:0;"
    ><text x="-0.3125" xml:space="preserve" y="9.2163" style="stroke:none;"
      >-80</text
    ></g
    ><g transform="translate(73,327)" style="font-size:10px; stroke-linecap:butt; text-rendering:geometricPrecision; font-family:sans-serif; stroke-linejoin:bevel; stroke-width:0;"
    ><text x="-0.3125" xml:space="preserve" y="9.2163" style="stroke:none;"
      >-60</text
    ></g
    ><g transform="translate(73,292.5)" style="font-size:10px; stroke-linecap:butt; text-rendering:geometricPrecision; font-family:sans-serif; stroke-linejoin:bevel; stroke-width:0;"
    ><text x="-0.3125" xml:space="preserve" y="9.2163" style="stroke:none;"
      >-40</text
    ></g
    ><g transform="translate(73,258)" style="font-size:10px; stroke-linecap:butt; text-rendering:geometricPrecision; font-family:sans-serif; stroke-linejoin:bevel; stroke-width:0;"
    ><text x="-0.3125" xml:space="preserve" y="9.2163" style="stroke:none;"
      >-20</text
    ></g
    ><g transform="translate(76,189)" style="font-size:10px; stroke-linecap:butt; text-rendering:geometricPrecision; font-family:sans-serif; stroke-linejoin:bevel; stroke-width:0;"
    ><text x="-0.2969" xml:space="preserve" y="9.2163" style="stroke:none;"
      >20</text
    ></g
    ><g transform="translate(76,154.5)" style="font-size:10px; stroke-linecap:butt; text-rendering:geometricPrecision; font-family:sans-serif; stroke-linejoin:bevel; stroke-width:0;"
    ><text x="-0.125" xml:space="preserve" y="9.2163" style="stroke:none;"
      >40</text
    ></g
    ><g transform="translate(76,120)" style="font-size:10px; stroke-linecap:butt; text-rendering:geometricPrecision; font-family:sans-serif; stroke-linejoin:bevel; stroke-width:0;"
    ><text x="-0.375" xml:space="preserve" y="9.2163" style="stroke:none;"
      >60</text
    ></g
    ><g transform="translate(76,85.5)" style="font-size:10px; stroke-linecap:butt; text-rendering:geometricPrecision; font-family:sans-serif; stroke-linejoin:bevel; stroke-width:0;"
    ><text x="-0.4062" xml:space="preserve" y="9.2163" style="stroke:none;"
      >80</text
    ></g
    ><g transform="translate(71,16.5)" style="font-size:10px; stroke-linecap:butt; text-rendering:geometricPrecision; font-family:sans-serif; stroke-linejoin:bevel; stroke-width:0;"
    ><text x="-1.0938" xml:space="preserve" y="9.2163" style="stroke:none;"
      >120</text
    ></g
    ><g style="text-rendering:geometricPrecision; font-size:10px; shape-rendering:crispEdges; font-family:sans-serif; stroke-linecap:butt;"
    ><path style="fill:none;" d="M98 437 L92 437"
      /><path style="fill:none;" d="M98 402.5 L92 402.5"
      /><path style="fill:none;" d="M98 368 L92 368"
      /><path style="fill:none;" d="M98 333.5 L92 333.5"
      /><path style="fill:none;" d="M98 299 L92 299"
      /><path style="fill:none;" d="M98 264.5 L92 264.5"
      /><path style="fill:none;" d="M98 230 L92 230"
      /><path style="fill:none;" d="M98 195.5 L92 195.5"
      /><path style="fill:none;" d="M98 161 L92 161"
      /><path style="fill:none;" d="M98 126.5 L92 126.5"
      /><path style="fill:none;" d="M98 92 L92 92"
      /><path style="fill:none;" d="M98 57.5 L92 57.5"
      /><path style="fill:none;" d="M98 23 L92 23"
      /><path style="fill:none;" d="M98 437 L95 437"
      /><path style="fill:none;" d="M98 419.75 L95 419.75"
      /><path style="fill:none;" d="M98 402.5 L95 402.5"
      /><path style="fill:none;" d="M98 385.25 L95 385.25"
      /><path style="fill:none;" d="M98 368 L95 368"
      /><path style="fill:none;" d="M98 350.75 L95 350.75"
      /><path style="fill:none;" d="M98 333.5 L95 333.5"
      /><path style="fill:none;" d="M98 316.25 L95 316.25"
      /><path style="fill:none;" d="M98 299 L95 299"
      /><path style="fill:none;" d="M98 281.75 L95 281.75"
      /><path style="fill:none;" d="M98 264.5 L95 264.5"
      /><path style="fill:none;" d="M98 247.25 L95 247.25"
      /><path style="fill:none;" d="M98 230 L95 230"
      /><path style="fill:none;" d="M98 212.75 L95 212.75"
      /><path style="fill:none;" d="M98 195.5 L95 195.5"
      /><path style="fill:none;" d="M98 178.25 L95 178.25"
      /><path style="fill:none;" d="M98 161 L95 161"
      /><path style="fill:none;" d="M98 143.75 L95 143.75"
      /><path style="fill:none;" d="M98 126.5 L95 126.5"
      /><path style="fill:none;" d="M98 109.25 L95 109.25"
      /><path style="fill:none;" d="M98 92 L95 92"
      /><path style="fill:none;" d="M98 74.75 L95 74.75"
      /><path style="fill:none;" d="M98 57.5 L95 57.5"
      /><path style="fill:none;" d="M98 40.25 L95 40.25"
      /><path style="fill:none;" d="M98 23 L95 23"
      /><path style="fill:none;" d="M98 23 L98 437"
    /></g
    ><g style="stroke-linecap:butt; font-size:10px; fill:rgb(239,202,115); text-rendering:geometricPrecision; font-family:sans-serif; stroke-linejoin:bevel; shape-rendering:crispEdges; stroke:rgb(239,202,115); stroke-width:0;"
    ><path style="stroke:none;" d="M458.1348 199.5396 L461.1349 230 L491.5571 230 Z"
      /><path style="stroke:none;" d="M458.1348 199.5396 L491.5571 230 L487.9724 193.6045 Z"
    /></g
    ><g style="text-rendering:geometricPrecision; stroke-width:2; font-size:10px; shape-rendering:crispEdges; font-family:sans-serif; stroke-linecap:butt;"
    ><path style="fill:none;" d="M458.1348 199.5396 L461.1349 230 L491.5571 230 L487.9724 193.6045 L458.1348 199.5396 L458.1348 199.5396"
    /></g
    ><g style="stroke-linecap:butt; font-size:10px; fill:rgb(239,202,115); text-rendering:geometricPrecision; font-family:sans-serif; stroke-linejoin:bevel; shape-rendering:crispEdges; stroke:rgb(239,202,115); stroke-width:0;"
    ><path style="stroke:none;" d="M449.2498 170.2498 L458.1348 199.5396 L487.9724 193.6045 Z"
      /><path style="stroke:none;" d="M449.2498 170.2498 L487.9724 193.6045 L477.3563 158.6077 Z"
    /></g
    ><g style="text-rendering:geometricPrecision; stroke-width:2; font-size:10px; shape-rendering:crispEdges; font-family:sans-serif; stroke-linecap:butt;"
    ><path style="fill:none;" d="M449.2498 170.2498 L458.1348 199.5396 L487.9724 193.6045 L477.3563 158.6077 L449.2498 170.2498 L449.2498 170.2498"
    /></g
    ><g style="stroke-linecap:butt; font-size:10px; fill:rgb(239,202,115); text-rendering:geometricPrecision; font-family:sans-serif; stroke-linejoin:bevel; shape-rendering:crispEdges; stroke:rgb(239,202,115); stroke-width:0;"
    ><path style="stroke:none;" d="M434.8214 143.2561 L449.2498 170.2498 L477.3563 158.6077 Z"
      /><path style="stroke:none;" d="M434.8214 143.2561 L477.3563 158.6077 L460.1165 126.3544 Z"
    /></g
    ><g style="text-rendering:geometricPrecision; stroke-width:2; font-size:10px; shape-rendering:crispEdges; font-family:sans-serif; stroke-linecap:butt;"
    ><path style="fill:none;" d="M434.8214 143.2561 L449.2498 170.2498 L477.3563 158.6077 L460.1165 126.3544 L434.8214 143.2561 L434.8214 143.2561"
    /></g
    ><g style="stroke-linecap:butt; font-size:10px; fill:rgb(239,202,115); text-rendering:geometricPrecision; font-family:sans-serif; stroke-linejoin:bevel; shape-rendering:crispEdges; stroke:rgb(239,202,115); stroke-width:0;"
    ><path style="stroke:none;" d="M415.404 119.596 L434.8214 143.2561 L460.1165 126.3544 Z"
      /><path style="stroke:none;" d="M415.404 119.596 L460.1165 126.3544 L436.9158 98.0842 Z"
    /></g
    ><g style="text-rendering:geometricPrecision; stroke-width:2; font-size:10px; shape-rendering:crispEdges; font-family:sans-serif; stroke-linecap:butt;"
    ><path style="fill:none;" d="M415.404 119.596 L434.8214 143.2561 L460.1165 126.3544 L436.9158 98.0842 L415.404 119.596 L415.404 119.596"
    /></g
    ><g style="stroke-linecap:butt; font-size:10px; fill:rgb(239,202,115); text-rendering:geometricPrecision; font-family:sans-serif; stroke-linejoin:bevel; shape-rendering:crispEdges; stroke:rgb(239,202,115); stroke-width:0;"
    ><path style="stroke:none;" d="M391.7439 100.1786 L415.404 119.596 L436.9158 98.0842 Z"
      /><path style="stroke:none;" d="M391.7439 100.1786 L436.9158 98.0842 L408.6456 74.8835 Z"
    /></g
    ><g style="text-rendering:geometricPrecision; stroke-width:2; font-size:10px; shape-rendering:crispEdges; font-family:sans-serif; stroke-linecap:butt;"
    ><path style="fill:none;" d="M391.7439 100.1786 L415.404 119.596 L436.9158 98.0842 L408.6456 74.8835 L391.7439 100.1786 L391.7439 100.1786"
    /></g
    ><g style="stroke-linecap:butt; font-size:10px; fill:rgb(160,104,35); text-rendering:geometricPrecision; font-family:sans-serif; stroke-linejoin:bevel; shape-rendering:crispEdges; stroke:rgb(160,104,35); stroke-width:0;"
    ><path style="stroke:none;" d="M364.7502 85.7502 L391.7439 100.1786 L408.6456 74.8835 Z"
      /><path style="stroke:none;" d="M364.7502 85.7502 L408.6456 74.8835 L376.3923 57.6437 Z"
    /></g
    ><g style="text-rendering:geometricPrecision; stroke-width:2; font-size:10px; shape-rendering:crispEdges; font-family:sans-serif; stroke-linecap:butt;"
    ><path style="fill:none;" d="M364.7502 85.7502 L391.7439 100.1786 L408.6456 74.8835 L376.3923 57.6437 L364.7502 85.7502 L364.7502 85.7502"
    /></g
    ><g style="stroke-linecap:butt; font-size:10px; fill:rgb(160,104,35); text-rendering:geometricPrecision; font-family:sans-serif; stroke-linejoin:bevel; shape-rendering:crispEdges; stroke:rgb(160,104,35); stroke-width:0;"
    ><path style="stroke:none;" d="M335.4604 76.8652 L364.7502 85.7502 L376.3923 57.6437 Z"
      /><path style="stroke:none;" d="M335.4604 76.8652 L376.3923 57.6437 L341.3955 47.0276 Z"
    /></g
    ><g style="text-rendering:geometricPrecision; stroke-width:2; font-size:10px; shape-rendering:crispEdges; font-family:sans-serif; stroke-linecap:butt;"
    ><path style="fill:none;" d="M335.4604 76.8652 L364.7502 85.7502 L376.3923 57.6437 L341.3955 47.0276 L335.4604 76.8652 L335.4604 76.8652"
    /></g
    ><g style="stroke-linecap:butt; font-size:10px; fill:rgb(160,104,35); text-rendering:geometricPrecision; font-family:sans-serif; stroke-linejoin:bevel; shape-rendering:crispEdges; stroke:rgb(160,104,35); stroke-width:0;"
    ><path style="stroke:none;" d="M305 73.8652 L335.4604 76.8652 L341.3955 47.0276 Z"
      /><path style="stroke:none;" d="M305 73.8652 L341.3955 47.0276 L305 43.4429 Z"
    /></g
    ><g style="text-rendering:geometricPrecision; stroke-width:2; font-size:10px; shape-rendering:crispEdges; font-family:sans-serif; stroke-linecap:butt;"
    ><path style="fill:none;" d="M305 73.8652 L335.4604 76.8652 L341.3955 47.0276 L305 43.4429 L305 73.8652 L305 73.8652"
    /></g
    ><g style="stroke-linecap:butt; font-size:10px; fill:rgb(160,104,35); text-rendering:geometricPrecision; font-family:sans-serif; stroke-linejoin:bevel; shape-rendering:crispEdges; stroke:rgb(160,104,35); stroke-width:0;"
    ><path style="stroke:none;" d="M274.5396 76.8652 L305 73.8652 L305 43.4429 Z"
      /><path style="stroke:none;" d="M274.5396 76.8652 L305 43.4429 L268.6045 47.0276 Z"
    /></g
    ><g style="text-rendering:geometricPrecision; stroke-width:2; font-size:10px; shape-rendering:crispEdges; font-family:sans-serif; stroke-linecap:butt;"
    ><path style="fill:none;" d="M274.5396 76.8652 L305 73.8652 L305 43.4429 L268.6045 47.0276 L274.5396 76.8652 L274.5396 76.8652"
    /></g
    ><g style="stroke-linecap:butt; font-size:10px; fill:rgb(160,104,35); text-rendering:geometricPrecision; font-family:sans-serif; stroke-linejoin:bevel; shape-rendering:crispEdges; stroke:rgb(160,104,35); stroke-width:0;"
    ><path style="stroke:none;" d="M245.2498 85.7502 L274.5396 76.8652 L268.6045 47.0276 Z"
      /><path style="stroke:none;" d="M245.2498 85.7502 L268.6045 47.0276 L233.6077 57.6437 Z"
    /></g
    ><g style="text-rendering:geometricPrecision; stroke-width:2; font-size:10px; shape-rendering:crispEdges; font-family:sans-serif; stroke-linecap:butt;"
    ><path style="fill:none;" d="M245.2498 85.7502 L274.5396 76.8652 L268.6045 47.0276 L233.6077 57.6437 L245.2498 85.7502 L245.2498 85.7502"
    /></g
    ><g style="stroke-linecap:butt; font-size:10px; fill:rgb(160,104,35); text-rendering:geometricPrecision; font-family:sans-serif; stroke-linejoin:bevel; shape-rendering:crispEdges; stroke:rgb(160,104,35); stroke-width:0;"
    ><path style="stroke:none;" d="M218.2561 100.1786 L245.2498 85.7502 L233.6077 57.6437 Z"
      /><path style="stroke:none;" d="M218.2561 100.1786 L233.6077 57.6437 L201.3544 74.8835 Z"
    /></g
    ><g style="text-rendering:geometricPrecision; stroke-width:2; font-size:10px; shape-rendering:crispEdges; font-family:sans-serif; stroke-linecap:butt;"
    ><path style="fill:none;" d="M218.2561 100.1786 L245.2498 85.7502 L233.6077 57.6437 L201.3544 74.8835 L218.2561 100.1786 L218.2561 100.1786"
    /></g
    ><g style="stroke-linecap:butt; font-size:10px; fill:rgb(160,104,35); text-rendering:geometricPrecision; font-family:sans-serif; stroke-linejoin:bevel; shape-rendering:crispEdges; stroke:rgb(160,104,35); stroke-width:0;"
    ><path style="stroke:none;" d="M194.596 119.596 L218.2561 100.1786 L201.3544 74.8835 Z"
      /><path style="stroke:none;" d="M194.596 119.596 L201.3544 74.8835 L173.0842 98.0842 Z"
    /></g
    ><g style="text-rendering:geometricPrecision; stroke-width:2; font-size:10px; shape-rendering:crispEdges; font-family:sans-serif; stroke-linecap:butt;"
    ><path style="fill:none;" d="M194.596 119.596 L218.2561 100.1786 L201.3544 74.8835 L173.0842 98.0842 L194.596 119.596 L194.596 119.596"
    /></g
    ><g style="stroke-linecap:butt; font-size:10px; fill:rgb(160,104,35); text-rendering:geometricPrecision; font-family:sans-serif; stroke-linejoin:bevel; shape-rendering:crispEdges; stroke:rgb(160,104,35); stroke-width:0;"
    ><path style="stroke:none;" d="M175.1786 143.2561 L194.596 119.596 L173.0842 98.0842 Z"
      /><path style="stroke:none;" d="M175.1786 143.2561 L173.0842 98.0842 L149.8835 126.3544 Z"
    /></g
    ><g style="text-rendering:geometricPrecision; stroke-width:2; font-size:10px; shape-rendering:crispEdges; font-family:sans-serif; stroke-linecap:butt;"
    ><path style="fill:none;" d="M175.1786 143.2561 L194.596 119.596 L173.0842 98.0842 L149.8835 126.3544 L175.1786 143.2561 L175.1786 143.2561"
    /></g
    ><g style="stroke-linecap:butt; font-size:10px; fill:rgb(160,104,35); text-rendering:geometricPrecision; font-family:sans-serif; stroke-linejoin:bevel; shape-rendering:crispEdges; stroke:rgb(160,104,35); stroke-width:0;"
    ><path style="stroke:none;" d="M160.7502 170.2498 L175.1786 143.2561 L149.8835 126.3544 Z"
      /><path style="stroke:none;" d="M160.7502 170.2498 L149.8835 126.3544 L132.6437 158.6077 Z"
    /></g
    ><g style="text-rendering:geometricPrecision; stroke-width:2; font-size:10px; shape-rendering:crispEdges; font-family:sans-serif; stroke-linecap:butt;"
    ><path style="fill:none;" d="M160.7502 170.2498 L175.1786 143.2561 L149.8835 126.3544 L132.6437 158.6077 L160.7502 170.2498 L160.7502 170.2498"
    /></g
    ><g style="stroke-linecap:butt; font-size:10px; fill:rgb(160,104,35); text-rendering:geometricPrecision; font-family:sans-serif; stroke-linejoin:bevel; shape-rendering:crispEdges; stroke:rgb(160,104,35); stroke-width:0;"
    ><path style="stroke:none;" d="M151.8652 199.5396 L160.7502 170.2498 L132.6437 158.6077 Z"
      /><path style="stroke:none;" d="M151.8652 199.5396 L132.6437 158.6077 L122.0276 193.6045 Z"
    /></g
    ><g style="text-rendering:geometricPrecision; stroke-width:2; font-size:10px; shape-rendering:crispEdges; font-family:sans-serif; stroke-linecap:butt;"
    ><path style="fill:none;" d="M151.8652 199.5396 L160.7502 170.2498 L132.6437 158.6077 L122.0276 193.6045 L151.8652 199.5396 L151.8652 199.5396"
    /></g
    ><g style="stroke-linecap:butt; font-size:10px; fill:rgb(239,202,115); text-rendering:geometricPrecision; font-family:sans-serif; stroke-linejoin:bevel; shape-rendering:crispEdges; stroke:rgb(239,202,115); stroke-width:0;"
    ><path style="stroke:none;" d="M148.8652 230 L151.8652 199.5396 L122.0276 193.6045 Z"
      /><path style="stroke:none;" d="M148.8652 230 L122.0276 193.6045 L118.4429 230 Z"
    /></g
    ><g style="text-rendering:geometricPrecision; stroke-width:2; font-size:10px; shape-rendering:crispEdges; font-family:sans-serif; stroke-linecap:butt;"
    ><path style="fill:none;" d="M148.8652 230 L151.8652 199.5396 L122.0276 193.6045 L118.4429 230 L148.8652 230 L148.8652 230"
    /></g
    ><g style="stroke-linecap:butt; font-size:10px; fill:rgb(239,202,115); text-rendering:geometricPrecision; font-family:sans-serif; stroke-linejoin:bevel; shape-rendering:crispEdges; stroke:rgb(239,202,115); stroke-width:0;"
    ><path style="stroke:none;" d="M151.8652 260.4604 L148.8652 230 L118.4429 230 Z"
      /><path style="stroke:none;" d="M151.8652 260.4604 L118.4429 230 L122.0276 266.3955 Z"
    /></g
    ><g style="text-rendering:geometricPrecision; stroke-width:2; font-size:10px; shape-rendering:crispEdges; font-family:sans-serif; stroke-linecap:butt;"
    ><path style="fill:none;" d="M151.8652 260.4604 L148.8652 230 L118.4429 230 L122.0276 266.3955 L151.8652 260.4604 L151.8652 260.4604"
    /></g
    ><g style="stroke-linecap:butt; font-size:10px; fill:rgb(239,202,115); text-rendering:geometricPrecision; font-family:sans-serif; stroke-linejoin:bevel; shape-rendering:crispEdges; stroke:rgb(239,202,115); stroke-width:0;"
    ><path style="stroke:none;" d="M160.7502 289.7502 L151.8652 260.4604 L122.0276 266.3955 Z"
      /><path style="stroke:none;" d="M160.7502 289.7502 L122.0276 266.3955 L132.6437 301.3923 Z"
    /></g
    ><g style="text-rendering:geometricPrecision; stroke-width:2; font-size:10px; shape-rendering:crispEdges; font-family:sans-serif; stroke-linecap:butt;"
    ><path style="fill:none;" d="M160.7502 289.7502 L151.8652 260.4604 L122.0276 266.3955 L132.6437 301.3923 L160.7502 289.7502 L160.7502 289.7502"
    /></g
    ><g style="stroke-linecap:butt; font-size:10px; fill:rgb(239,202,115); text-rendering:geometricPrecision; font-family:sans-serif; stroke-linejoin:bevel; shape-rendering:crispEdges; stroke:rgb(239,202,115); stroke-width:0;"
    ><path style="stroke:none;" d="M175.1786 316.7439 L160.7502 289.7502 L132.6437 301.3923 Z"
      /><path style="stroke:none;" d="M175.1786 316.7439 L132.6437 301.3923 L149.8835 333.6456 Z"
    /></g
    ><g style="text-rendering:geometricPrecision; stroke-width:2; font-size:10px; shape-rendering:crispEdges; font-family:sans-serif; stroke-linecap:butt;"
    ><path style="fill:none;" d="M175.1786 316.7439 L160.7502 289.7502 L132.6437 301.3923 L149.8835 333.6456 L175.1786 316.7439 L175.1786 316.7439"
    /></g
    ><g style="stroke-linecap:butt; font-size:10px; fill:rgb(239,202,115); text-rendering:geometricPrecision; font-family:sans-serif; stroke-linejoin:bevel; shape-rendering:crispEdges; stroke:rgb(239,202,115); stroke-width:0;"
    ><path style="stroke:none;" d="M194.596 340.404 L175.1786 316.7439 L149.8835 333.6456 Z"
      /><path style="stroke:none;" d="M194.596 340.404 L149.8835 333.6456 L173.0842 361.9158 Z"
    /></g
    ><g style="text-rendering:geometricPrecision; stroke-width:2; font-size:10px; shape-rendering:crispEdges; font-family:sans-serif; stroke-linecap:butt;"
    ><path style="fill:none;" d="M194.596 340.404 L175.1786 316.7439 L149.8835 333.6456 L173.0842 361.9158 L194.596 340.404 L194.596 340.404"
    /></g
    ><g style="stroke-linecap:butt; font-size:10px; fill:rgb(160,104,35); text-rendering:geometricPrecision; font-family:sans-serif; stroke-linejoin:bevel; shape-rendering:crispEdges; stroke:rgb(160,104,35); stroke-width:0;"
    ><path style="stroke:none;" d="M218.2561 359.8214 L194.596 340.404 L173.0842 361.9158 Z"
      /><path style="stroke:none;" d="M218.2561 359.8214 L173.0842 361.9158 L201.3544 385.1165 Z"
    /></g
    ><g style="text-rendering:geometricPrecision; stroke-width:2; font-size:10px; shape-rendering:crispEdges; font-family:sans-serif; stroke-linecap:butt;"
    ><path style="fill:none;" d="M218.2561 359.8214 L194.596 340.404 L173.0842 361.9158 L201.3544 385.1165 L218.2561 359.8214 L218.2561 359.8214"
    /></g
    ><g style="stroke-linecap:butt; font-size:10px; fill:rgb(160,104,35); text-rendering:geometricPrecision; font-family:sans-serif; stroke-linejoin:bevel; shape-rendering:crispEdges; stroke:rgb(160,104,35); stroke-width:0;"
    ><path style="stroke:none;" d="M245.2498 374.2498 L218.2561 359.8214 L201.3544 385.1165 Z"
      /><path style="stroke:none;" d="M245.2498 374.2498 L201.3544 385.1165 L233.6077 402.3563 Z"
    /></g
    ><g style="text-rendering:geometricPrecision; stroke-width:2; font-size:10px; shape-rendering:crispEdges; font-family:sans-serif; stroke-linecap:butt;"
    ><path style="fill:none;" d="M245.2498 374.2498 L218.2561 359.8214 L201.3544 385.1165 L233.6077 402.3563 L245.2498 374.2498 L245.2498 374.2498"
    /></g
    ><g style="stroke-linecap:butt; font-size:10px; fill:rgb(160,104,35); text-rendering:geometricPrecision; font-family:sans-serif; stroke-linejoin:bevel; shape-rendering:crispEdges; stroke:rgb(160,104,35); stroke-width:0;"
    ><path style="stroke:none;" d="M274.5396 383.1348 L245.2498 374.2498 L233.6077 402.3563 Z"
      /><path style="stroke:none;" d="M274.5396 383.1348 L233.6077 402.3563 L268.6045 412.9724 Z"
    /></g
    ><g style="text-rendering:geometricPrecision; stroke-width:2; font-size:10px; shape-rendering:crispEdges; font-family:sans-serif; stroke-linecap:butt;"
    ><path style="fill:none;" d="M274.5396 383.1348 L245.2498 374.2498 L233.6077 402.3563 L268.6045 412.9724 L274.5396 383.1348 L274.5396 383.1348"
    /></g
    ><g style="stroke-linecap:butt; font-size:10px; fill:rgb(160,104,35); text-rendering:geometricPrecision; font-family:sans-serif; stroke-linejoin:bevel; shape-rendering:crispEdges; stroke:rgb(160,104,35); stroke-width:0;"
    ><path style="stroke:none;" d="M305 386.1349 L274.5396 383.1348 L268.6045 412.9724 Z"
      /><path style="stroke:none;" d="M305 386.1349 L268.6045 412.9724 L305 416.5571 Z"
    /></g
    ><g style="text-rendering:geometricPrecision; stroke-width:2; font-size:10px; shape-rendering:crispEdges; font-family:sans-serif; stroke-linecap:butt;"
    ><path style="fill:none;" d="M305 386.1349 L274.5396 383.1348 L268.6045 412.9724 L305 416.5571 L305 386.1349 L305 386.1349"
    /></g
    ><g style="stroke-linecap:butt; font-size:10px; fill:rgb(160,104,35); text-rendering:geometricPrecision; font-family:sans-serif; stroke-linejoin:bevel; shape-rendering:crispEdges; stroke:rgb(160,104,35); stroke-width:0;"
    ><path style="stroke:none;" d="M335.4604 383.1348 L305 386.1349 L305 416.5571 Z"
      /><path style="stroke:none;" d="M335.4604 383.1348 L305 416.5571 L341.3955 412.9724 Z"
    /></g
    ><g style="text-rendering:geometricPrecision; stroke-width:2; font-size:10px; shape-rendering:crispEdges; font-family:sans-serif; stroke-linecap:butt;"
    ><path style="fill:none;" d="M335.4604 383.1348 L305 386.1349 L305 416.5571 L341.3955 412.9724 L335.4604 383.1348 L335.4604 383.1348"
    /></g
    ><g style="stroke-linecap:butt; font-size:10px; fill:rgb(160,104,35); text-rendering:geometricPrecision; font-family:sans-serif; stroke-linejoin:bevel; shape-rendering:crispEdges; stroke:rgb(160,104,35); stroke-width:0;"
    ><path style="stroke:none;" d="M364.7502 374.2498 L335.4604 383.1348 L341.3955 412.9724 Z"
      /><path style="stroke:none;" d="M364.7502 374.2498 L341.3955 412.9724 L376.3923 402.3563 Z"
    /></g
    ><g style="text-rendering:geometricPrecision; stroke-width:2; font-size:10px; shape-rendering:crispEdges; font-family:sans-serif; stroke-linecap:butt;"
    ><path style="fill:none;" d="M364.7502 374.2498 L335.4604 383.1348 L341.3955 412.9724 L376.3923 402.3563 L364.7502 374.2498 L364.7502 374.2498"
    /></g
    ><g style="stroke-linecap:butt; font-size:10px; fill:rgb(160,104,35); text-rendering:geometricPrecision; font-family:sans-serif; stroke-linejoin:bevel; shape-rendering:crispEdges; stroke:rgb(160,104,35); stroke-width:0;"
    ><path style="stroke:none;" d="M391.7439 359.8214 L364.7502 374.2498 L376.3923 402.3563 Z"
      /><path style="stroke:none;" d="M391.7439 359.8214 L376.3923 402.3563 L408.6456 385.1165 Z"
    /></g
    ><g style="text-rendering:geometricPrecision; stroke-width:2; font-size:10px; shape-rendering:crispEdges; font-family:sans-serif; stroke-linecap:butt;"
    ><path style="fill:none;" d="M391.7439 359.8214 L364.7502 374.2498 L376.3923 402.3563 L408.6456 385.1165 L391.7439 359.8214 L391.7439 359.8214"
    /></g
    ><g style="stroke-linecap:butt; font-size:10px; fill:rgb(160,104,35); text-rendering:geometricPrecision; font-family:sans-serif; stroke-linejoin:bevel; shape-rendering:crispEdges; stroke:rgb(160,104,35); stroke-width:0;"
    ><path style="stroke:none;" d="M415.404 340.404 L391.7439 359.8214 L408.6456 385.1165 Z"
      /><path style="stroke:none;" d="M415.404 340.404 L408.6456 385.1165 L436.9158 361.9158 Z"
    /></g
    ><g style="text-rendering:geometricPrecision; stroke-width:2; font-size:10px; shape-rendering:crispEdges; font-family:sans-serif; stroke-linecap:butt;"
    ><path style="fill:none;" d="M415.404 340.404 L391.7439 359.8214 L408.6456 385.1165 L436.9158 361.9158 L415.404 340.404 L415.404 340.404"
    /></g
    ><g style="stroke-linecap:butt; font-size:10px; fill:rgb(160,104,35); text-rendering:geometricPrecision; font-family:sans-serif; stroke-linejoin:bevel; shape-rendering:crispEdges; stroke:rgb(160,104,35); stroke-width:0;"
    ><path style="stroke:none;" d="M434.8214 316.7439 L415.404 340.404 L436.9158 361.9158 Z"
      /><path style="stroke:none;" d="M434.8214 316.7439 L436.9158 361.9158 L460.1165 333.6456 Z"
    /></g
    ><g style="text-rendering:geometricPrecision; stroke-width:2; font-size:10px; shape-rendering:crispEdges; font-family:sans-serif; stroke-linecap:butt;"
    ><path style="fill:none;" d="M434.8214 316.7439 L415.404 340.404 L436.9158 361.9158 L460.1165 333.6456 L434.8214 316.7439 L434.8214 316.7439"
    /></g
    ><g style="stroke-linecap:butt; font-size:10px; fill:rgb(160,104,35); text-rendering:geometricPrecision; font-family:sans-serif; stroke-linejoin:bevel; shape-rendering:crispEdges; stroke:rgb(160,104,35); stroke-width:0;"
    ><path style="stroke:none;" d="M449.2498 289.7502 L434.8214 316.7439 L460.1165 333.6456 Z"
      /><path style="stroke:none;" d="M449.2498 289.7502 L460.1165 333.6456 L477.3563 301.3923 Z"
    /></g
    ><g style="text-rendering:geometricPrecision; stroke-width:2; font-size:10px; shape-rendering:crispEdges; font-family:sans-serif; stroke-linecap:butt;"
    ><path style="fill:none;" d="M449.2498 289.7502 L434.8214 316.7439 L460.1165 333.6456 L477.3563 301.3923 L449.2498 289.7502 L449.2498 289.7502"
    /></g
    ><g style="stroke-linecap:butt; font-size:10px; fill:rgb(160,104,35); text-rendering:geometricPrecision; font-family:sans-serif; stroke-linejoin:bevel; shape-rendering:crispEdges; stroke:rgb(160,104,35); stroke-width:0;"
    ><path style="stroke:none;" d="M458.1348 260.4604 L449.2498 289.7502 L477.3563 301.3923 Z"
      /><path style="stroke:none;" d="M458.1348 260.4604 L477.3563 301.3923 L487.9724 266.3955 Z"
    /></g
    ><g style="text-rendering:geometricPrecision; stroke-width:2; font-size:10px; shape-rendering:crispEdges; font-family:sans-serif; stroke-linecap:butt;"
    ><path style="fill:none;" d="M458.1348 260.4604 L449.2498 289.7502 L477.3563 301.3923 L487.9724 266.3955 L458.1348 260.4604 L458.1348 260.4604"
    /></g
    ><g style="stroke-linecap:butt; font-size:10px; fill:rgb(160,104,35); text-rendering:geometricPrecision; font-family:sans-serif; stroke-linejoin:bevel; shape-rendering:crispEdges; stroke:rgb(160,104,35); stroke-width:0;"
    ><path style="stroke:none;" d="M461.1349 230 L458.1348 260.4604 L487.9724 266.3955 Z"
      /><path style="stroke:none;" d="M461.1349 230 L487.9724 266.3955 L491.5571 230 Z"
    /></g
    ><g style="text-rendering:geometricPrecision; stroke-width:2; font-size:10px; shape-rendering:crispEdges; font-family:sans-serif; stroke-linecap:butt;"
    ><path style="fill:none;" d="M461.1349 230 L458.1348 260.4604 L487.9724 266.3955 L491.5571 230 L461.1349 230 L461.1349 230"
    /></g
    ><g style="stroke-linecap:butt; font-size:10px; fill:red; text-rendering:geometricPrecision; font-family:sans-serif; shape-rendering:crispEdges; stroke-dasharray:11,5; stroke:red;"
    ><path d="M461.1349 230 L459.853 210.0339 L456.0284 190.3957 L449.724 171.4077 L441.0432 153.3819 L430.1286 136.6141 L417.1594 121.3797 L402.3485 107.9289 L385.9391 96.4824 L368.2008 87.2283 L349.4247 80.3185 L329.9191 75.8665 L310.0044 73.9454 L290.0074 74.5866 L270.2567 77.7798 L251.0765 83.4724 L232.7817 91.5709 L215.6727 101.9425 L200.0304 114.4168 L186.1117 128.789 L174.1452 144.823 L164.3274 162.2556 L156.8193 180.8006 L151.7444 200.1535 L149.1859 219.9964 L149.1859 240.0036 L151.7444 259.8465 L156.8193 279.1994 L164.3274 297.7444 L174.1452 315.177 L186.1117 331.211 L200.0304 345.5832 L215.6727 358.0575 L232.7817 368.429 L251.0765 376.5276 L270.2567 382.2202 L290.0074 385.4134 L310.0044 386.0546 L329.9191 384.1335 L349.4247 379.6815 L368.2008 372.7717 L385.9391 363.5176 L402.3485 352.0711 L417.1594 338.6203 L430.1286 323.3859 L441.0432 306.6181 L449.724 288.5923 L456.0284 269.6043 L459.853 249.9661 L461.1349 230" style="fill:none; clip-path:url(#clipPath1);"
      /><path d="M490.6588 230 L489.1345 206.2585 L484.5868 182.9068 L477.0902 160.3284 L466.7679 138.894 L453.7895 118.9556 L438.3679 100.8404 L420.7563 84.8461 L401.2441 71.2353 L380.1516 60.2313 L357.825 52.0149 L334.6311 46.7211 L310.9507 44.4366 L287.1725 45.1992 L263.687 48.9961 L240.88 55.7651 L219.1257 65.3951 L198.7815 77.7278 L180.1815 92.5609 L163.6309 109.6507 L149.4016 128.7167 L137.7272 149.4457 L128.7995 171.4974 L122.7649 194.5097 L119.7227 218.1048 L119.7227 241.8952 L122.7649 265.4903 L128.7995 288.5026 L137.7272 310.5543 L149.4016 331.2833 L163.6309 350.3493 L180.1815 367.4391 L198.7815 382.2722 L219.1257 394.6049 L240.88 404.2349 L263.687 411.0039 L287.1725 414.8008 L310.9507 415.5634 L334.6311 413.279 L357.825 407.9851 L380.1516 399.7687 L401.2441 388.7647 L420.7563 375.1539 L438.3679 359.1595 L453.7895 341.0445 L466.7679 321.106 L477.0902 299.6716 L484.5868 277.0932 L489.1345 253.7415 L490.6588 230" style="fill:none; clip-path:url(#clipPath1);"
      /><path d="M305 230 L461.1349 230" style="fill:none; stroke-dasharray:none; clip-path:url(#clipPath1); stroke:black;"
    /></g
    ><g style="stroke-linecap:butt; font-size:10px; text-rendering:geometricPrecision; font-family:sans-serif; stroke-linejoin:bevel; shape-rendering:crispEdges; stroke-width:0;"
    ><path style="stroke:none;" d="M461.1349 230 L453.3542 232.8319 L453.3542 227.1681 Z"
      /><text x="1.5781" y="11.2163" transform="translate(344.0337,213)" style="shape-rendering:auto; stroke:none;" xml:space="preserve"
      >91 mm</text
    ></g
    ><g style="text-rendering:geometricPrecision; font-size:10px; shape-rendering:crispEdges; font-family:sans-serif; stroke-linecap:butt;"
    ><path d="M305 230 L467.9309 140.9904" style="fill:none; clip-path:url(#clipPath1);"
      /><path d="M467.9309 140.9904 L462.4604 147.2059 L459.745 142.2354 Z" style="stroke-width:0; stroke-linejoin:bevel; stroke:none;"
      /><text x="0.9062" y="11.2163" transform="translate(345.7327,207.7476) rotate(-28.6479) translate(0,-17)" style="stroke-linejoin:bevel; shape-rendering:auto; stroke:none; stroke-width:0;" xml:space="preserve"
      >108 mm</text
    ></g
    ><g transform="translate(470.5956,197.0823)" style="font-size:10px; stroke-linecap:butt; text-rendering:geometricPrecision; font-family:sans-serif; stroke-linejoin:bevel; stroke-width:0;"
    ><text x="0.9062" xml:space="preserve" y="11.2163" style="stroke:none;"
      >1    </text
    ></g
    ><g transform="translate(463.2749,165.8587)" style="font-size:10px; stroke-linecap:butt; text-rendering:geometricPrecision; font-family:sans-serif; stroke-linejoin:bevel; stroke-width:0;"
    ><text x="1.7031" xml:space="preserve" y="11.2163" style="stroke:none;"
      >2    </text
    ></g
    ><g transform="translate(450.867,136.4467)" style="font-size:10px; stroke-linecap:butt; text-rendering:geometricPrecision; font-family:sans-serif; stroke-linejoin:bevel; stroke-width:0;"
    ><text x="1.5781" xml:space="preserve" y="11.2163" style="stroke:none;"
      >3    </text
    ></g
    ><g transform="translate(432.8535,109.9766)" style="font-size:10px; stroke-linecap:butt; text-rendering:geometricPrecision; font-family:sans-serif; stroke-linejoin:bevel; stroke-width:0;"
    ><text x="1.875" xml:space="preserve" y="11.2163" style="stroke:none;"
      >4    </text
    ></g
    ><g transform="translate(409.9266,87.4656)" style="font-size:10px; stroke-linecap:butt; text-rendering:geometricPrecision; font-family:sans-serif; stroke-linejoin:bevel; stroke-width:0;"
    ><text x="1.5781" xml:space="preserve" y="11.2163" style="stroke:none;"
      >5    </text
    ></g
    ><g transform="translate(382.9675,69.7788)" style="font-size:10px; stroke-linecap:butt; text-rendering:geometricPrecision; font-family:sans-serif; stroke-linejoin:bevel; stroke-width:0;"
    ><text x="1.625" xml:space="preserve" y="11.2163" style="stroke:none;"
      >6    </text
    ></g
    ><g transform="translate(353.0122,57.5959)" style="font-size:10px; stroke-linecap:butt; text-rendering:geometricPrecision; font-family:sans-serif; stroke-linejoin:bevel; stroke-width:0;"
    ><text x="1.5312" xml:space="preserve" y="11.2163" style="stroke:none;"
      >7    </text
    ></g
    ><g transform="translate(321.2117,51.3852)" style="font-size:10px; stroke-linecap:butt; text-rendering:geometricPrecision; font-family:sans-serif; stroke-linejoin:bevel; stroke-width:0;"
    ><text x="1.5938" xml:space="preserve" y="11.2163" style="stroke:none;"
      >8    </text
    ></g
    ><g transform="translate(287.7101,51.3852)" style="font-size:10px; stroke-linecap:butt; text-rendering:geometricPrecision; font-family:sans-serif; stroke-linejoin:bevel; stroke-width:0;"
    ><text x="1.5781" xml:space="preserve" y="11.2163" style="stroke:none;"
      >9    </text
    ></g
    ><g transform="translate(253.069,57.5959)" style="font-size:10px; stroke-linecap:butt; text-rendering:geometricPrecision; font-family:sans-serif; stroke-linejoin:bevel; stroke-width:0;"
    ><text x="0.9062" xml:space="preserve" y="11.2163" style="stroke:none;"
      >10   </text
    ></g
    ><g transform="translate(220.9043,69.7788)" style="font-size:10px; stroke-linecap:butt; text-rendering:geometricPrecision; font-family:sans-serif; stroke-linejoin:bevel; stroke-width:0;"
    ><text x="0.9062" xml:space="preserve" y="11.2163" style="stroke:none;"
      >11   </text
    ></g
    ><g transform="translate(191.5091,87.4656)" style="font-size:10px; stroke-linecap:butt; text-rendering:geometricPrecision; font-family:sans-serif; stroke-linejoin:bevel; stroke-width:0;"
    ><text x="0.9062" xml:space="preserve" y="11.2163" style="stroke:none;"
      >12   </text
    ></g
    ><g transform="translate(166.3244,109.9766)" style="font-size:10px; stroke-linecap:butt; text-rendering:geometricPrecision; font-family:sans-serif; stroke-linejoin:bevel; stroke-width:0;"
    ><text x="0.9062" xml:space="preserve" y="11.2163" style="stroke:none;"
      >13   </text
    ></g
    ><g transform="translate(147.2271,136.4467)" style="font-size:10px; stroke-linecap:butt; text-rendering:geometricPrecision; font-family:sans-serif; stroke-linejoin:bevel; stroke-width:0;"
    ><text x="0.9062" xml:space="preserve" y="11.2163" style="stroke:none;"
      >14   </text
    ></g
    ><g transform="translate(133.328,165.8587)" style="font-size:10px; stroke-linecap:butt; text-rendering:geometricPrecision; font-family:sans-serif; stroke-linejoin:bevel; stroke-width:0;"
    ><text x="0.9062" xml:space="preserve" y="11.2163" style="stroke:none;"
      >15   </text
    ></g
    ><g transform="translate(126.467,197.0823)" style="font-size:10px; stroke-linecap:butt; text-rendering:geometricPrecision; font-family:sans-serif; stroke-linejoin:bevel; stroke-width:0;"
    ><text x="0.9062" xml:space="preserve" y="11.2163" style="stroke:none;"
      >16   </text
    ></g
    ><g transform="translate(126.467,230.584)" style="font-size:10px; stroke-linecap:butt; text-rendering:geometricPrecision; font-family:sans-serif; stroke-linejoin:bevel; stroke-width:0;"
    ><text x="0.9062" xml:space="preserve" y="11.2163" style="stroke:none;"
      >17   </text
    ></g
    ><g transform="translate(133.328,265.0761)" style="font-size:10px; stroke-linecap:butt; text-rendering:geometricPrecision; font-family:sans-serif; stroke-linejoin:bevel; stroke-width:0;"
    ><text x="0.9062" xml:space="preserve" y="11.2163" style="stroke:none;"
      >18   </text
    ></g
    ><g transform="translate(146.7861,297.5671)" style="font-size:10px; stroke-linecap:butt; text-rendering:geometricPrecision; font-family:sans-serif; stroke-linejoin:bevel; stroke-width:0;"
    ><text x="0.9062" xml:space="preserve" y="11.2163" style="stroke:none;"
      >19   </text
    ></g
    ><g transform="translate(166.3244,326.8081)" style="font-size:10px; stroke-linecap:butt; text-rendering:geometricPrecision; font-family:sans-serif; stroke-linejoin:bevel; stroke-width:0;"
    ><text x="1.7031" xml:space="preserve" y="11.2163" style="stroke:none;"
      >20   </text
    ></g
    ><g transform="translate(191.5091,351.6756)" style="font-size:10px; stroke-linecap:butt; text-rendering:geometricPrecision; font-family:sans-serif; stroke-linejoin:bevel; stroke-width:0;"
    ><text x="1.7031" xml:space="preserve" y="11.2163" style="stroke:none;"
      >21   </text
    ></g
    ><g transform="translate(220.4329,371.2139)" style="font-size:10px; stroke-linecap:butt; text-rendering:geometricPrecision; font-family:sans-serif; stroke-linejoin:bevel; stroke-width:0;"
    ><text x="1.7031" xml:space="preserve" y="11.2163" style="stroke:none;"
      >22   </text
    ></g
    ><g transform="translate(252.9239,384.672)" style="font-size:10px; stroke-linecap:butt; text-rendering:geometricPrecision; font-family:sans-serif; stroke-linejoin:bevel; stroke-width:0;"
    ><text x="1.7031" xml:space="preserve" y="11.2163" style="stroke:none;"
      >23   </text
    ></g
    ><g transform="translate(287.416,391.533)" style="font-size:10px; stroke-linecap:butt; text-rendering:geometricPrecision; font-family:sans-serif; stroke-linejoin:bevel; stroke-width:0;"
    ><text x="1.7031" xml:space="preserve" y="11.2163" style="stroke:none;"
      >24   </text
    ></g
    ><g transform="translate(320.9177,391.533)" style="font-size:10px; stroke-linecap:butt; text-rendering:geometricPrecision; font-family:sans-serif; stroke-linejoin:bevel; stroke-width:0;"
    ><text x="1.7031" xml:space="preserve" y="11.2163" style="stroke:none;"
      >25   </text
    ></g
    ><g transform="translate(352.1413,384.672)" style="font-size:10px; stroke-linecap:butt; text-rendering:geometricPrecision; font-family:sans-serif; stroke-linejoin:bevel; stroke-width:0;"
    ><text x="1.7031" xml:space="preserve" y="11.2163" style="stroke:none;"
      >26   </text
    ></g
    ><g transform="translate(381.5533,371.2139)" style="font-size:10px; stroke-linecap:butt; text-rendering:geometricPrecision; font-family:sans-serif; stroke-linejoin:bevel; stroke-width:0;"
    ><text x="1.7031" xml:space="preserve" y="11.2163" style="stroke:none;"
      >27   </text
    ></g
    ><g transform="translate(408.0234,351.6756)" style="font-size:10px; stroke-linecap:butt; text-rendering:geometricPrecision; font-family:sans-serif; stroke-linejoin:bevel; stroke-width:0;"
    ><text x="1.7031" xml:space="preserve" y="11.2163" style="stroke:none;"
      >28   </text
    ></g
    ><g transform="translate(430.5344,326.8081)" style="font-size:10px; stroke-linecap:butt; text-rendering:geometricPrecision; font-family:sans-serif; stroke-linejoin:bevel; stroke-width:0;"
    ><text x="1.7031" xml:space="preserve" y="11.2163" style="stroke:none;"
      >29   </text
    ></g
    ><g transform="translate(448.2212,297.5671)" style="font-size:10px; stroke-linecap:butt; text-rendering:geometricPrecision; font-family:sans-serif; stroke-linejoin:bevel; stroke-width:0;"
    ><text x="1.5781" xml:space="preserve" y="11.2163" style="stroke:none;"
      >30   </text
    ></g
    ><g transform="translate(460.8825,265.0761)" style="font-size:10px; stroke-linecap:butt; text-rendering:geometricPrecision; font-family:sans-serif; stroke-linejoin:bevel; stroke-width:0;"
    ><text x="1.5781" xml:space="preserve" y="11.2163" style="stroke:none;"
      >31   </text
    ></g
    ><g transform="translate(466.6148,230.584)" style="font-size:10px; stroke-linecap:butt; text-rendering:geometricPrecision; font-family:sans-serif; stroke-linejoin:bevel; stroke-width:0;"
    ><text x="1.5781" xml:space="preserve" y="11.2163" style="stroke:none;"
      >32   </text
    ></g
    ><g transform="translate(263.5,-2)" style="font-size:10px; stroke-linecap:butt; text-rendering:geometricPrecision; font-family:sans-serif; stroke-linejoin:bevel; stroke-width:0;"
    ><text x="1.2188" xml:space="preserve" y="11.2163" style="stroke:none;"
      >Ring number 32</text
    ></g
  ></g
></svg
>
