// Copyright (C) 2012 - Maria Christopoulou
// Copyright (C) 2001 - Per A. Brodtkorb
//
// This file must be used under the terms of the CeCILL.
// This source file is licensed as described in the file COPYING, which
// you should have received as part of this distribution.  The terms
// are also available at
// http://www.cecill.info/licences/Licence_CeCILL_V2-en.txt
// <-- JVM NOT MANDATORY -->
// Box, G.E.P, Hunter, W.G. and Hunter, J.S. (1978)
// Statistics for experimenters, John Wiley & Sons, pp 342
// Table 5.2 - Pilot Plant Investigation, page 177
y = [60 72 54 68 52 83 45 80]';
[ef, id] = scidoe_yates(y);
y1 = scidoe_ryates(ef);
assert_checkequal(y,y1);
