// =============================================================================
// Scilab ( http://www.scilab.org/ ) - This file is part of Scilab
// Copyright (C) 2008 - INRIA - Pierre MARECHAL <pierre.marechal@scilab.org>
//
//  This file is distributed under the same license as the Scilab package.
// =============================================================================
// <-- ENGLISH IMPOSED -->
// <-- NO CHECK ERROR OUTPUT -->
// <-- NEED JVM -->
// xmltojar
// TEST 1 (french help and english help are complete)
// =============================================================================
my_module_path = pathconvert(SCI+"/modules/helptools/examples/example_1",%f,%f);
// Build the french help
setlanguage("fr_FR");
my_french_help_dir    =  my_module_path+"/help/fr_FR";
my_french_help_title  =  "TEST 1 [fr_FR]";
xmltojar(my_french_help_dir,my_french_help_title,"fr_FR");

Construit le document maître:
	SCI/modules/helptools/examples/example_1/help/fr_FR

Construction du fichier manuel [javaHelp] dans SCI/modules/helptools/examples/example_1/help/fr_FR. (Veuillez patienter ... cela peut prendre un certain temps)
jar_info =  fileinfo(my_module_path+"/jar/scilab_fr_FR_help.jar");
if jar_info == [] then bugmes();quit;end       // file existence
if jar_info(1) < 5000 then bugmes();quit;end   // file size
clean_help(my_french_help_dir);
-- Suppression des fichiers d'aide --
...
// Build the english help
setlanguage("en_US");
my_english_help_dir    =  my_module_path+"/help/en_US";
my_english_help_title  =  "TEST 1 [en_US]";
xmltojar(my_english_help_dir,my_english_help_title,'en_US');

Building the master document:
	SCI/modules/helptools/examples/example_1/help/en_US

Building the manual file [javaHelp] in SCI/modules/helptools/examples/example_1/help/en_US. (Please wait building ... this can take a while)
jar_info =  fileinfo(my_module_path+"/jar/scilab_en_US_help.jar");
if jar_info == [] then bugmes();quit;end       // file existence
if jar_info(1) < 5000 then bugmes();quit;end   // file size
clean_help(my_english_help_dir);
-- Deleting help files --
...
// TEST 2 (example_2_function_2 and example_2_function_4 are missing in the
//         french help)
// =============================================================================
my_module_path = pathconvert(SCI+"/modules/helptools/examples/example_2",%f,%f);
// Build the french help
setlanguage("fr_FR");
my_french_help_dir    =  my_module_path+"/help/fr_FR";
my_french_help_title  =  "TEST 2 [fr_FR]";
xmltojar(my_french_help_dir,my_french_help_title,'fr_FR');

Construit le document maître:
	SCI/modules/helptools/examples/example_2/help/fr_FR

Construction du fichier manuel [javaHelp] dans SCI/modules/helptools/examples/example_2/help/fr_FR. (Veuillez patienter ... cela peut prendre un certain temps)
jar_info =  fileinfo(my_module_path+"/jar/scilab_fr_FR_help.jar");
if jar_info == [] then bugmes();quit;end       // file existence
if jar_info(1) < 5000 then bugmes();quit;end   // file size
clean_help(my_french_help_dir);
-- Suppression des fichiers d'aide --
...
// Build the english help
setlanguage("en_US");
my_english_help_dir    =  my_module_path+"/help/en_US";
my_english_help_title  =  "TEST 2 [en_US]";
xmltojar(my_english_help_dir,my_english_help_title,'en_US');

Building the master document:
	SCI/modules/helptools/examples/example_2/help/en_US

Building the manual file [javaHelp] in SCI/modules/helptools/examples/example_2/help/en_US. (Please wait building ... this can take a while)
jar_info =  fileinfo(my_module_path+"/jar/scilab_en_US_help.jar");
if jar_info == [] then bugmes();quit;end       // file existence
if jar_info(1) < 5000 then bugmes();quit;end   // file size
clean_help(my_english_help_dir);
-- Deleting help files --
...
// TEST 3 (example_3_function_3 and example_3_function_4 are missing in the
//         english help)
// =============================================================================
my_module_path = pathconvert(SCI+"/modules/helptools/examples/example_3",%f,%f);
// Build the french help
setlanguage("fr_FR");
my_french_help_dir    =  my_module_path+"/help/fr_FR";
my_french_help_title  =  "TEST 3 [fr_FR]";
xmltojar(my_french_help_dir,my_french_help_title,"fr_FR");

Construit le document maître:
	SCI/modules/helptools/examples/example_3/help/fr_FR

Construction du fichier manuel [javaHelp] dans SCI/modules/helptools/examples/example_3/help/fr_FR. (Veuillez patienter ... cela peut prendre un certain temps)
jar_info =  fileinfo(my_module_path+"/jar/scilab_fr_FR_help.jar");
if jar_info == [] then bugmes();quit;end       // file existence
if jar_info(1) < 5000 then bugmes();quit;end   // file size
clean_help(my_french_help_dir);
-- Suppression des fichiers d'aide --
...
// Build the english help
setlanguage("en_US");
my_english_help_dir    =  my_module_path+"/help/en_US";
my_english_help_title  =  "TEST 3 [en_US]";
xmltojar(my_english_help_dir,my_english_help_title,"en_US","fr_FR");

Building the master document:
	SCI/modules/helptools/examples/example_3/help/en_US

Building the manual file [javaHelp] in SCI/modules/helptools/examples/example_3/help/en_US. (Please wait building ... this can take a while)
jar_info =  fileinfo(my_module_path+"/jar/scilab_en_US_help.jar");
if jar_info == [] then bugmes();quit;end       // file existence
if jar_info(1) < 5000 then bugmes();quit;end   // file size
clean_help(my_english_help_dir);
-- Deleting help files --
...
