// <-- Non-regression test for bug 2428 -->
//
// <-- Bugzilla URL -->
// http://bugzilla.scilab.org/show_bug.cgi?id=2428
//
// <-- Short Description -->
//    I would like to convert to SciLab the package TBMLab 3.1 by Smets
//    (http://iridia.ulb.ac.be/~psmets/TBMLAB.zip). I tried both via the menu
//    Applications -> m2sci and trying to convert recursively the directory
//    of the package and via the SciPad menu File -> Import Matlab File. In
//    the first case the conversion fails without errors, in the second case
//    an error appears and a message suggests to report here the error.
// Copyright INRIA
// Scilab Project - Vincent COUVERT
MFILE         = TMPDIR+"/bug2428.m"
 MFILE  =
 
 TMPDIR/bug2428.m   
SCIFILE       = TMPDIR+"/bug2428.sci"
 SCIFILE  =
 
 TMPDIR/bug2428.sci   
MFILECONTENTS = ["function bug2428";
    "global gui_settings";
    "i = 1;";
    "a = gui_settings.pn_mem{i}"]
 MFILECONTENTS  =
 
!function bug2428            !
!                            !
!global gui_settings         !
!                            !
!i = 1;                      !
!                            !
!a = gui_settings.pn_mem{i}  !
fd=mopen(MFILE,"w");
mputl(MFILECONTENTS,fd);
mclose(fd);
ierr = execstr("mfile2sci("""+MFILE+""","""+TMPDIR+""")","errcatch");
  ****** Beginning of mfile2sci() session ******
  File to convert: TMPDIR/bug2428.m
  Result file path: TMPDIR/
  Recursive mode: OFF
  Only double values used in M-file: NO
  Verbose mode: 3
  Generate formated code: NO
  M-file reading...
  M-file reading: Done
  Syntax modification...
  Syntax modification: Done
  Macro to tree conversion...
  Conversion of M-tree...
Global variable gui_settings added to M2SCI variable list.
  Conversion of M-tree: Done
  Macro to tree conversion: Done
  ****** End of mfile2sci() session ******
if ierr<>0 then bugmes();quit;end
