// =============================================================================
// Scilab ( http://www.scilab.org/ ) - This file is part of Scilab
// Copyright (C) 2009 - DIGITEO - Scilab Consortium Operational Team
//
//  This file is distributed under the same license as the Scilab package.
// =============================================================================
// <-- JVM NOT MANDATORY -->
ilib_verbose(0);
mkdir(pathconvert(TMPDIR+"/read_write_boolean_api"));
cd(pathconvert(TMPDIR+"/read_write_boolean_api"));
copyfile(SCI+"/modules/api_scilab/tests/unit_tests/read_write_boolean_api.c",pathconvert(TMPDIR+"/read_write_boolean_api/read_write_boolean_api.c",%F));
cflags = "-I"+SCI+"/modules/localization/includes";
ilib_build("read_write_boolean",["read_write_boolean","read_write_boolean"],"read_write_boolean_api.c",[],"Makefile","",cflags);
a = [%t, %f, %t ; %f, %t, %f ; %t, %f, %t];
a_ref = [%f, %t, %f ; %t, %f, %t ; %f, %t, %f];
b = read_write_boolean(a);
if or(b <> a_ref) then bugmes();quit;end
