// =============================================================================
// Scilab ( http://www.scilab.org/ ) - This file is part of Scilab
// Copyright (C) 2008 - INRIA - Vincent COUVERT <vincent.couvert@inria.fr>
//
//  This file is distributed under the same license as the Scilab package.
// =============================================================================
// Unitary tests for Scilab Java frames
// Exec tests common to all uicontrols
clear uicontrol_generic_test
uicontrol_generic_test("frame");
// Default relief value
h = uicontrol("parent", scf(), "style", "frame");
if get(h, "relief") <> "ridge" then bugmes();quit;end
// --- Value tests ---
// Default value
if ~isempty(get(h, "value")) then bugmes();quit;end
set(h, "value", [1]);
if get(h, "value") <> 1 then bugmes();quit;end
set(h, "value", [1 2 3]);
if ~and(get(h, "value") == [1 2 3]) then bugmes();quit;end
set(h, "value", []);
if ~isempty(get(h, "value")) then bugmes();quit;end
// TODO test with wrong values
