// =============================================================================
// Scilab ( http://www.scilab.org/ ) - This file is part of Scilab
// Copyright (C) ????-2008 - INRIA
// Copyright (C) 2009 - DIGITEO
//
//  This file is distributed under the same license as the Scilab package.
// =============================================================================
// <-- ENGLISH IMPOSED -->
// <-- JVM NOT MANDATORY -->
if MSDOS then
  TMP_OS_DIR = getenv('TMP','err');
  if (TMP_OS_DIR == 'err') then bugmes();quit;end;
else
  TMP_OS_DIR = '/tmp';
  if ~isdir(TMP_OS_DIR) then bugmes();quit;end;
end
TMP_DIR = TMP_OS_DIR+filesep()+'ilib_for_link';
rmdir(TMP_DIR,'s');
mkdir(TMP_OS_DIR,'ilib_for_link');
f1=['int ext1c(int *n, double *a, double *b, double *c)'
    '{int k;'
    '  for (k = 0; k < *n; ++k) '
    '      c[k] = a[k] + b[k];'
    '  return(0);}'];
mputl(f1,TMP_DIR+filesep()+'fun1.c');
//creating the shared library (a gateway, a Makefile and a loader are 
//generated. 
cur_dir = pwd();
chdir(TMP_DIR);
ilib_for_link('ext1c','fun1.c',[],"c") 
   Generate a loader file

   Generate a Makefile

   Running the Makefile

   Compilation of fun1.c

   Building shared library (be patient)

   Generate a cleaner file

 ans  =
 
 libext1c.dll   
// load the shared library 
exec loader.sce 
 
// This file is released into the public domain
 
// Generated by builder.sce : Please, do not edit this file
 
//
 
 
ext1c_path = get_absolute_file_path('loader.sce');
 
 
// ulink previous function with same name
 
[bOK,ilib] = c_link('ext1c');if (bOK) then ulink(ilib),end
 
link(ext1c_path+'libext1c'+getdynlibext(),['ext1c'],'c');
Shared archive loaded.
Link done.
 
// remove temp. variables on stack
 
clear ext1c_path;
 
clear get_file_path;
 
// ------------------------------------------------------
 
chdir(cur_dir);
//using the new primitive
a=[1,2,3];b=[4,5,6];n=3;
c=call('ext1c',n,1,'i',a,2,'d',b,3,'d','out',[1,3],4,'d');
if norm(c-(a+b)) > %eps then bugmes();quit;end
// ulink() all libraries
ulink();
//remove TMP_DIR
//rmdir(TMP_DIR,'s');
