// =============================================================================
// Scilab ( http://www.scilab.org/ ) - This file is part of Scilab
// Copyright (C) 2009 - DIGITEO
//
//  This file is distributed under the same license as the Scilab package.
// =============================================================================
// <-- JVM NOT MANDATORY -->
filename = pathconvert(TMPDIR+"/filetodelete_1.txt",%F);
// First test-case : Regular use
fd=mopen ( filename , "w" );
mclose(fd); 
computed = deletefile ( filename );
if computed <> %t then bugmes();quit;end
// Second test-case : Wrong use then correct use
if MSDOS then
	fd=mopen ( filename , "w" );
	computed = deletefile ( filename );
	if computed <> %f then bugmes();quit;end
	mclose(fd); 
	computed = deletefile ( filename );
	if computed <> %t then bugmes();quit;end
end
// Third test-case : try to delete a non-existing file
filename = pathconvert(TMPDIR+"/filetodelete_2.txt",%F);
computed = deletefile ( filename );
if computed <> %f then bugmes();quit;end
