// =============================================================================
// Scilab ( http://www.scilab.org/ ) - This file is part of Scilab
// Copyright (C) 2007-2009 - INRIA - Serge STEER <serge.steer@inria.fr>
//
//  This file is distributed under the same license as the Scilab package.
// =============================================================================
// <-- JVM NOT MANDATORY -->
// <-- Non-regression test for bug 4066 -->
//
// <-- Bugzilla URL -->
// http://bugzilla.scilab.org/show_bug.cgi?id=4066
//
// <-- Short Description -->
//    clear may erase protected variables
mputl('clear',TMPDIR+'/foo')
 ans  =
 
  T  
 
clear
 
mdelete(TMPDIR+'/foo')
if exists('home')==0 then bugmes();quit;end
