Dataset Pontius, quadratic, solved by regress from Statistics Toolbox

            min.                   nom.                   max.                    delta
b(1)   4.548613873024724e-04  6.735657894736854e-04  8.922701916448984e-04     2.187044021712130e-04
b(2)   7.317393919746250e-07  7.320591604010026e-07  7.323789288273802e-07     3.197684263775898e-10
b(3)  -3.259423947126788e-15 -3.160818713450253e-15 -3.062213479773717e-15     9.860523367653586e-17

R2 = 0.999999900179

NIST reference solution: 
6.735658e-04
7.320592e-07
-3.160819e-15

