 
getf SCI/util/testexamples.sci
 
reinit_for_test()
 
%U=mopen('SCI/tests/graphical_tests/interp2d_data.ref','rb');
 
// see the examples of splin2d
 
 
// this example shows some different extrapolation features
 
// interpolation of cos(x)cos(y)
 
n = 7;// a n x n interpolation grid
 
x = linspace(0, 2 * %pi, n);y = x;
 
z = cos(x') * cos(y);
 
C = splin2d(x, y, z, 'periodic');
 
 
// now evaluate on a bigger domain than [0,2pi]x [0,2pi]
 
m = 80;// discretisation parameter of the evaluation grid
 
xx = linspace(-0.5 * %pi, 2.5 * %pi, m);yy = xx;
 
[XX,YY] = ndgrid(xx, yy);
 
zz1 = interp2d(XX, YY, x, y, C, 'C0');
 
zz2 = interp2d(XX, YY, x, y, C, 'by_zero');
 
zz3 = interp2d(XX, YY, x, y, C, 'periodic');
 
zz4 = interp2d(XX, YY, x, y, C, 'natural');
 
%ans = xbasc_run();
 
if load_ref('%ans') then   bugmes();quit;end,
 
 
%ans = subplot(2, 2, 1);
 
if load_ref('%ans') then   bugmes();quit;end,
 
 
%ans = plot3d(xx, yy, zz1, flag=[2,6,4]);
 
if load_ref('%ans') then   bugmes();quit;end,
 
 
%ans = xtitle('extrapolation with the C0 outmode');
 
if load_ref('%ans') then   bugmes();quit;end,
 
 
%ans = subplot(2, 2, 2);
 
if load_ref('%ans') then   bugmes();quit;end,
 
 
%ans = plot3d(xx, yy, zz2, flag=[2,6,4]);
 
if load_ref('%ans') then   bugmes();quit;end,
 
 
%ans = xtitle('extrapolation with the by_zero outmode');
 
if load_ref('%ans') then   bugmes();quit;end,
 
 
%ans = subplot(2, 2, 3);
 
if load_ref('%ans') then   bugmes();quit;end,
 
 
%ans = plot3d(xx, yy, zz3, flag=[2,6,4]);
 
if load_ref('%ans') then   bugmes();quit;end,
 
 
%ans = xtitle('extrapolation with the periodic outmode');
 
if load_ref('%ans') then   bugmes();quit;end,
 
 
%ans = subplot(2, 2, 4);
 
if load_ref('%ans') then   bugmes();quit;end,
 
 
%ans = plot3d(xx, yy, zz4, flag=[2,6,4]);
 
if load_ref('%ans') then   bugmes();quit;end,
 
 
%ans = xtitle('extrapolation with the natural outmode');
 
if load_ref('%ans') then   bugmes();quit;end,
 
 
%ans = xselect();
 
if load_ref('%ans') then   bugmes();quit;end,
 
 
xdel_run(winsid());
 
 
mclose(%U);
 
