 
getf SCI/util/testexamples.sci
 
reinit_for_test()
 
%U=mopen('SCI/tests/automatic_tests/isglobal_data.ref','rb');
 
%ans = isglobal(1);
 
if load_ref('%ans') then   bugmes();quit;end,
 
 
%ans = global('a');
 
if load_ref('%ans') then   bugmes();quit;end,
 
 
%ans = isglobal(a);
 
if load_ref('%ans') then   bugmes();quit;end,
 
 
xdel_run(winsid());
 
 
mclose(%U);
 
