 
getf SCI/util/testexamples.sci
 
reinit_for_test()
 
%U=mopen('SCI/tests/automatic_tests/varargout_data.ref','rb');
 
%ans = deff('varargout=exampl()', 'varargout=list(1,2,3,4)');
 
if load_ref('%ans') then   bugmes();quit;end,
 
 
 
x = exampl();
 
if load_ref('x') then   bugmes();quit;end,
 
 
[x,y] = exampl();
 
if load_ref('y') then   bugmes();quit;end,
 
if load_ref('x') then   bugmes();quit;end,
 
 
[x,y,z] = exampl();
 
if load_ref('z') then   bugmes();quit;end,
 
if load_ref('y') then   bugmes();quit;end,
 
if load_ref('x') then   bugmes();quit;end,
 
 
xdel_run(winsid());
 
 
mclose(%U);
 
