 
getf SCI/util/testexamples.sci
 
reinit_for_test()
 
%U=mopen('SCI/tests/graphical_tests/mprintf_data.ref','rb');
 
%ans = mprintf('At iteration %i, Result is:\nalpha=%f', 33, 0.535);
At iteration 33, Result is:
alpha=0.535000 
if load_ref('%ans') then   bugmes();quit;end,
 
 
 
%ans = msprintf('%5.3f %5.3f', 123, 0.732);
 
if load_ref('%ans') then   bugmes();quit;end,
 
 
%ans = msprintf('%5.3f\n%5.3f', 123, 0.732);
 
if load_ref('%ans') then   bugmes();quit;end,
 
 
 
A = rand(5, 2);
 
// vectorized forms: the format directive needs
 
// two operand, each column of A is used as an operand.
 
// and the mprintf function is applied on each row of A
 
%ans = mprintf('%5.3f\t%5.3f\n', A);
0.211	0.628
0.756	0.850
0.000	0.686
0.330	0.878
0.665	0.068
 
if load_ref('%ans') then   bugmes();quit;end,
 
 
 
colors = ['red';'green';'blue';'pink';'black'];
 
RGB = [1,0,0;0,1,0;0,0,1;1,0.75,0.75;0,0,0];
 
%ans = mprintf('%d\t%s\t%f\t%f\t%f\n', (1:5)', colors, RGB);
1	red	1.000000	0.000000	0.000000
2	green	0.000000	1.000000	0.000000
3	blue	0.000000	0.000000	1.000000
4	pink	1.000000	0.750000	0.750000
5	black	0.000000	0.000000	0.000000
 
if load_ref('%ans') then   bugmes();quit;end,
 
 
 
xdel_run(winsid());
 
 
mclose(%U);
 
