 
getf SCI/util/testexamples.sci
 
reinit_for_test()
 
%U=mopen('SCI/tests/automatic_tests/name2rgb_data.ref','rb');
 
rgb = name2rgb('gold');
 
if load_ref('rgb') then   bugmes();quit;end,
 
 
%ans = rgb2name(rgb);
 
if load_ref('%ans') then   bugmes();quit;end,
 
 
xdel_run(winsid());
 
 
mclose(%U);
 
