 
getf SCI/util/testexamples.sci
 
reinit_for_test()
 
%U=mopen('SCI/tests/graphical_tests/xgraduate_data.ref','rb');
 
[x1,xa,np1,np2,kMinr,kMaxr,ar] = xgraduate(-0.3, 0.2);
 
if load_ref('ar') then   bugmes();quit;end,
 
if load_ref('kMaxr') then   bugmes();quit;end,
 
if load_ref('kMinr') then   bugmes();quit;end,
 
if load_ref('np2') then   bugmes();quit;end,
 
if load_ref('np1') then   bugmes();quit;end,
 
if load_ref('xa') then   bugmes();quit;end,
 
if load_ref('x1') then   bugmes();quit;end,
 
 
xdel_run(winsid());
 
 
mclose(%U);
 
