 
getf SCI/util/testexamples.sci
 
reinit_for_test()
 
%U=mopen('SCI/tests/graphical_tests/xarc_data.ref','rb');
 
// isoview scaling
 
%ans = plot2d(0, 0, -1, '031', ' ', [-2,-2,2,2]);
 
if load_ref('%ans') then   bugmes();quit;end,
 
 
%ans = xset('color', 3);
 
if load_ref('%ans') then   bugmes();quit;end,
 
 
%ans = xarc(-1, 1, 2, 2, 0, 90 * 64);
 
if load_ref('%ans') then   bugmes();quit;end,
 
 
%ans = xarc(-1.5, 1.5, 3, 3, 0, 360 * 64);
 
if load_ref('%ans') then   bugmes();quit;end,
 
 
xdel_run(winsid());
 
 
mclose(%U);
 
