 
getf SCI/util/testexamples.sci
 
reinit_for_test()
 
%U=mopen('SCI/tests/automatic_tests/calendar_data.ref','rb');
 
%ans = calendar();
 
if load_ref_nocheck('%ans') then   bugmes();quit;end,
 
 
 
%ans = calendar(1973, 8);
 
if load_ref('%ans') then   bugmes();quit;end,
 
 
xdel_run(winsid());
 
 
mclose(%U);
 
