 
getf SCI/util/testexamples.sci
 
reinit_for_test()
 
%U=mopen('SCI/tests/automatic_tests/console_data.ref','rb');
 
%ans = console('off');
 
if load_ref('%ans') then   bugmes();quit;end,
 
 
state = console();
 
if load_ref('state') then   bugmes();quit;end,
 
 
%ans = console();
 
if load_ref('%ans') then   bugmes();quit;end,
 
 
xdel_run(winsid());
 
 
mclose(%U);
 
