 
getf SCI/util/testexamples.sci
 
reinit_for_test()
 
%U=mopen('SCI/tests/graphical_tests/toolbar_data.ref','rb');
 
%ans = toolbar(-1, 'off');
 
if load_ref('%ans') then   bugmes();quit;end,
 
 
state = toolbar(-1, 'on');
 
if load_ref('state') then   bugmes();quit;end,
 
 
 
plot3d();

Demo of plot3d()
========================================
t=-%pi:0.3:%pi;plot3d(t,t,sin(t)'*cos(t),35,45,'X@Y@Z',[2,2,4]);

 
h = gcf();
 
%ans = toolbar(h('figure_id'), 'off');
 
if load_ref('%ans') then   bugmes();quit;end,
 
 
 
xdel_run(winsid());
 
 
mclose(%U);
 
