 
getf SCI/util/testexamples.sci
 
reinit_for_test()
 
%U=mopen('SCI/tests/graphical_tests/fsfirlin_data.ref','rb');
 
//
 
//Example of how to use the fsfirlin macro for the design
 
//of an FIR filter by a frequency sampling technique.
 
//
 
//Two filters are designed : the first (response hst1) with
 
//abrupt transitions from 0 to 1 between passbands and stop
 
//bands; the second (response hst2) with one sample in each
 
//transition band (amplitude 0.5) for smoothing.
 
//
 
hd = [zeros(1, 15),ones(1, 10),zeros(1, 39)];//desired samples
 
hst1 = fsfirlin(hd, 1);//filter with no sample in the transition
 
hd(15) = 0.5;hd(26) = 0.5;//samples in the transition bands
 
hst2 = fsfirlin(hd, 1);//corresponding filter
 
pas = 1/prod(size(hst1)) * 0.5;
 
fg = 0:pas:0.5;//normalized frequencies grid
 
plot2d([1,1]0.*. fg(1:257)', [hst1',hst2']);
 
// 2nd example
 
hd = [0 * ones(1, 15),ones(1, 10),0 * ones(1, 39)];//desired samples
 
hst1 = fsfirlin(hd, 1);//filter with no sample in the transition
 
hd(15) = 0.5;hd(26) = 0.5;//samples in the transition bands
 
hst2 = fsfirlin(hd, 1);//corresponding filter
 
pas = 1/prod(size(hst1)) * 0.5;
 
fg = 0:pas:0.5;//normalized frequencies grid
 
n = prod(size(hst1));
 
if load_ref('n') then   bugmes();quit;end,
 
 
plot(fg(1:n), hst1);
 
plot2d(fg(1:n)', hst2', 3, '000');
 
xdel_run(winsid());
 
 
mclose(%U);
 
