 
getf SCI/util/testexamples.sci
 
reinit_for_test()
 
%U=mopen('SCI/tests/automatic_tests/psmall_data.ref','rb');
 
A = diag([1,2,3]);X = rand(A);A = inv(X) * A * X;
 
[Q,M] = psmall(A, 2.5, 'd');
 
%ans = spec(M * A * Q);
 
if load_ref('%ans') then   bugmes();quit;end,
 
 
[Q1,M1] = fullrf(eye() - Q * M);
 
%ans = spec(M1 * A * Q1);
 
if load_ref('%ans') then   bugmes();quit;end,
 
 
xdel_run(winsid());
 
 
mclose(%U);
 
