 
getf SCI/util/testexamples.sci
 
reinit_for_test()
 
%U=mopen('SCI/tests/graphical_tests/scf_data.ref','rb');
 
f4 = scf(4);//creates figure with id==4 and make it the current one
 
f0 = scf(0);//creates figure with id==0 and make it the current one
 
%ans = plot2d();

Demo of plot2d()
========================================
x=(0:0.1:2*%pi)';plot2d(x,[sin(x),sin(2*x),sin(3*x)],style=[-1,-2,3],rect=[0,-2,2*%pi,2]);

 
if load_ref('%ans') then   bugmes();quit;end,
 
//draw in current figure (id=0)
 
scf(f4);// set first created figure as current one
 
%ans = plot3d();

Demo of plot3d()
========================================
t=-%pi:0.3:%pi;plot3d(t,t,sin(t)'*cos(t),35,45,'X@Y@Z',[2,2,4]);

 
if load_ref('%ans') then   bugmes();quit;end,
 
//draw in current figure (id=4)
 
xdel_run(winsid());
 
 
mclose(%U);
 
