 
getf SCI/util/testexamples.sci
 
reinit_for_test()
 
%U=mopen('SCI/tests/automatic_tests/fullfile_data.ref','rb');
 
f = fullfile('/home/', '\scilab', 'macros', '\util', 'fullfile.sci');
 
if load_ref('f') then   bugmes();quit;end,
 
 
f = fullfile('C:', '\scilab', 'macros', '\util', 'fullfile.sci');
 
if load_ref('f') then   bugmes();quit;end,
 
 
xdel_run(winsid());
 
 
mclose(%U);
 
