 
getf SCI/util/testexamples.sci
 
reinit_for_test()
 
%U=mopen('SCI/tests/automatic_tests/mtlb_sparse_data.ref','rb');
 
X = sparse(rand(2, 2));Y = mtlb_sparse(X);
 
Y;
 
if load_ref('Y') then   bugmes();quit;end,
 
%ans = full(Y);
 
if load_ref('%ans') then   bugmes();quit;end,
 
[ij,v,mn] = spget(Y);
 
if load_ref('mn') then   bugmes();quit;end,
 
if load_ref('v') then   bugmes();quit;end,
 
if load_ref('ij') then   bugmes();quit;end,
 
 
xdel_run(winsid());
 
 
mclose(%U);
 
