 
getf SCI/util/testexamples.sci
 
reinit_for_test()
 
%U=mopen('SCI/tests/automatic_tests/equal_data.ref','rb');
 
a = sin(3.2);
 
if load_ref('a') then   bugmes();quit;end,
 
 
[u,s] = schur(rand(3, 3));
 
if load_ref('s') then   bugmes();quit;end,
 
if load_ref('u') then   bugmes();quit;end,
 
 
%ans = (1:10) == 4;
 
if load_ref('%ans') then   bugmes();quit;end,
 
 
%ans = 1 ~= 2;
 
if load_ref('%ans') then   bugmes();quit;end,
 
 
xdel_run(winsid());
 
 
mclose(%U);
 
