 
getf SCI/util/testexamples.sci
 
reinit_for_test()
 
%U=mopen('SCI/tests/automatic_tests/cos_data.ref','rb');
 
x = [0,1,%i];
 
if load_ref('x') then   bugmes();quit;end,
 
 
%ans = acos(cos(x));
 
if load_ref('%ans') then   bugmes();quit;end,
 
 
xdel_run(winsid());
 
 
mclose(%U);
 
