 
getf SCI/util/testexamples.sci
 
reinit_for_test()
 
%U=mopen('SCI/tests/graphical_tests/xs2fig_data.ref','rb');
 
%ans = scf(0);
 
if load_ref('%ans') then   bugmes();quit;end,
 
 
%ans = plot2d();

Demo of plot2d()
========================================
x=(0:0.1:2*%pi)';plot2d(x,[sin(x),sin(2*x),sin(3*x)],style=[-1,-2,3],rect=[0,-2,2*%pi,2]);

 
if load_ref('%ans') then   bugmes();quit;end,
 
 
%ans = xs2fig(0, 'foo.fig');
 
if load_ref('%ans') then   bugmes();quit;end,
 
 
xdel_run(winsid());
 
 
mclose(%U);
 
