 
getf SCI/util/testexamples.sci
 
reinit_for_test()
 
%U=mopen('SCI/tests/automatic_tests/double_data.ref','rb');
 
x = int8([0,12,140]);
 
if load_ref('x') then   bugmes();quit;end,
 
 
%ans = double(x);
 
if load_ref('%ans') then   bugmes();quit;end,
 
 
xdel_run(winsid());
 
 
mclose(%U);
 
