 
getf SCI/util/testexamples.sci
 
reinit_for_test()
 
%U=mopen('SCI/tests/automatic_tests/oldsave_data.ref','rb');
 
a = eye(2, 2);b = ones(a);
 
oldsave('TMPDIR/val.dat', a, b);
 
%ans = clear('a');
 
if load_ref('%ans') then   bugmes();quit;end,
 
 
%ans = clear('b');
 
if load_ref('%ans') then   bugmes();quit;end,
 
 
oldload('TMPDIR/val.dat', 'a', 'b');
 
 
xdel_run(winsid());
 
 
mclose(%U);
 
