 
getf SCI/util/testexamples.sci
 
reinit_for_test()
 
%U=mopen('SCI/tests/automatic_tests/TCL_GetVersion_data.ref','rb');
 
%ans = TCL_GetVersion();
 
if load_ref_nocheck('%ans') then   bugmes();quit;end,
 
 
xdel_run(winsid());
 
 
mclose(%U);
 
