%!PS-Adobe-2.0 EPSF-2.0
%%BoundingBox:  0 0 300 212
%%
%%Scilab Postscript File (1995-1997 J.Ph Chancelier)
%%EndComments
/saved save def 
/$pictdict 100 dict def
$pictdict begin

/dogrey
{ /Arraybox exch def
	/Arraygrey exch def
	/nargs exch def 
	/func exch cvx def
	Arraybox 0 nargs getinterval Arraygrey 0 get func 
	1 1 Arraygrey length 1 sub 
	{/i exch def
	Arraybox i nargs mul nargs getinterval 
	Arraygrey i get func
	}for
} def
%--------------------------------------------
% [x y width height] nivgris drawbox 
% si niv gris > 1.0 alors on fait un stroke 
% sans closepath 
%--------------------------------------------

/drawpoly
	{/glev exch def /Ar exch def
	newpath
	Ar 0 get Ar 1 get moveto 
	2 2 Ar length 1 sub 
	{/i exch def
	Ar i get Ar i 1 add get absolu {lineto} {rlineto} ifelse
	}for
	glev -1 le 
	{ % filling the polygon with current pattern ( gray or color)
	  closepath gsave glev neg 1 sub WhiteLev 2 add lmin 0 lmax Setgray eofill grestore }
	{ glev 1 ge 
	   { % drawing the polygon with current dash style or color 
	     % XXXXX : a voir c'est pas clair il faudrait sauver 
	     % and filling it with other color (glev) 
	     closepath gsave glev 1 sub WhiteLev 2 add lmin 0 lmax Setgray 
		 eofill grestore stroke }
	   {% drawing the polygon with current style 
	    closeflag {closepath} if stroke} 
	ifelse }
	ifelse 
} def 


/drawbox 
	{/glev exch def /Ar exch def 
	/x Ar 0 get def /y Ar 1 get def 
	/w Ar 2 get def /h Ar 3 get def 
	newpath
	x y moveto
	x w add y lineto
	x w add y h add lineto
	x y h add lineto
	glev 1 ge 
	{ % filling 
	 closepath gsave glev 1 sub WhiteLev 2 add lmin 0 lmax Setgray eofill 
		grestore}
	{ 
	  % drawing 
	  glev -1 le 
	  {
    	  closepath gsave glev neg 1 sub WhiteLev 2 add lmin 0 lmax Setgray
		 stroke grestore  }
	  { closepath stroke} ifelse 
	} ifelse
} def 

%--------------------------------------------
% [x y width height] clearzone
%--------------------------------------------
/clearzone
        {/Ar exch def
        /x Ar 0 get def /y Ar 1 get def
        /w Ar 2 get def /h Ar 3 get def
        newpath
        x y moveto
        x w add y lineto
        x w add y h add lineto
        x y h add lineto
	closepath WhiteLev 2 add Setcolor  eofill grestore
} def

%------------------------------------------------------
% polyline stroke or polygon fill or both 
%------------------------------------------------------
/absolu true def 
/closeflag false def 

/lmin { /y exch def /x exch def x y le { x  } {  y  } ifelse } def
/lmax { /y exch def /x exch def x y le { y } {  x } ifelse } def 


/drawpoly
	{/glev exch def /Ar exch def
	newpath
	Ar 0 get Ar 1 get moveto 
	2 2 Ar length 1 sub 
	{/i exch def
	Ar i get Ar i 1 add get absolu {lineto} {rlineto} ifelse
	}for
	glev -1 le 
	{ % filling the polygon with current pattern ( gray or color)
	  closepath gsave glev neg 1 sub WhiteLev 2 add lmin 0 lmax Setgray eofill grestore }
	{ glev 1 ge 
	   { % drawing the polygon with current dash style or color 
	     % XXXXX : a voir c'est pas clair il faudrait sauver 
	     % and filling it with other color (glev) 
	     closepath gsave glev 1 sub WhiteLev 2 add lmin 0 lmax Setgray 
		 eofill grestore stroke }
	   {% drawing the polygon with current style 
	    closeflag {closepath} if stroke} 
	ifelse }
	ifelse 
} def 

%------------------------------------------------------
% segments non connectes 
%------------------------------------------------------

/drawsegs
	{/glev exch def /Ar exch def
	newpath
	Ar 0 get Ar 1 get moveto Ar 2 get Ar 3 get lineto 
	gsave glev Setgray stroke grestore
	4 4 Ar length 3 sub 
	{/i exch def
	newpath 
	Ar i get Ar i 1 add get moveto
	Ar i 2 add get Ar i 3 add get lineto 
	gsave glev Setgray stroke grestore
	}for
} def 


%------------------------------------------------------
% unconected arrows
%-----------------------------------------------------

/drawarrows
	{/arsize10 exch def /Ar exch def
	Ar 0 get  Ar 1 get Ar 2 get Ar 3 get arsize10 drawarrow
	4 4 Ar length 3 sub 
	{/i exch def
	Ar i get Ar i 1 add get  Ar i 2 add get  Ar i 3 add get arsize10 
	drawarrow
	}for
} def 
		
/cos20 20 cos def
/sin20 20 sin def

/drawarrow                                
  { 
      /arsize exch 10 div def 
      /tipy exch def /tipx exch def       
      /taily exch def /tailx exch def
      /dx tipx tailx sub  def               
      /dy tipy taily sub  def               
      newpath tipx tipy moveto tailx taily lineto stroke   
      /norme dx dx mul dy dy mul add sqrt def 
      norme 1.e-8 ge 
	{
	 arsize dx mul norme div /dx1 exch def 
	 arsize dy mul norme div /dy1 exch def 
	 /depx tipx cos20 dx1 mul add def 
	/depy  tipy cos20 dy1 mul add def 
	newpath depx depy moveto 
	cos20 neg dx1 mul sin20 dy1 mul sub depx add
	sin20 dx1  mul cos20 dy1 mul sub depy add lineto 
	cos20 neg dx1 mul sin20 dy1 mul add  depx add
	sin20 neg dx1 mul cos20 dy1 mul sub depy add lineto closepath 
	fill
	} {} ifelse 
  } def


%------------------------------------------------------
% cercle ou portions de cercle 
% attention argument (x y w h angl1*64 angl2*64 )
% devrait tracer une ellipse a modifier donc 
%------------------------------------------------------

/fillarc
	{/glev exch def /Ar exch def
	/cx Ar 0 get Ar 2 get 2 div add def 
	/cy Ar 1 get Ar 3 get 2 div add def 
	/hom Ar 3 get Ar 2 get div def 
	/Cmsave1 matrix def Cmsave1 currentmatrix pop
	%-- on change de transformation pour faire homothetie en (x,y) 
	cx cy [1 0 0 hom 0 0 ] transform
	/t1 exch neg cy add def 
	/t2 exch neg cx add def 
	[1 0 0 hom t2 t1 ] concat 
	glev WhiteLev le
	{ % filling 
	newpath
	cx cy moveto 
	cx cy Ar 2 get 2 div Ar 5 get Ar 4 get add  64 div neg
	 Ar 4 get 64 div neg  arc closepath
	gsave glev Setgray eofill grestore}
	{
	%drawing with current dash or color unclosed path 
	newpath
	cx cy Ar 2 get 2 div Ar 5 get Ar 4 get add 64 div neg Ar 4 get 64 div neg arc
	  stroke} ifelse 
	Cmsave1 setmatrix } def 

/drawarc
	{/glev exch def /Ar exch def
	/cx Ar 0 get Ar 2 get 2 div add def 
	/cy Ar 1 get Ar 3 get 2 div add def 
	/hom Ar 3 get Ar 2 get div def 
	/Cmsave1 matrix def Cmsave1 currentmatrix pop
	%-- on change de transformation pour faire homothetie en (x,y) 
	cx cy [1 0 0 hom 0 0 ] transform
	/t1 exch neg cy add def 
	/t2 exch neg cx add def 
	[1 0 0 hom t2 t1 ] concat 
	newpath
	cx cy Ar 2 get 2 div Ar 5 get Ar 4 get add 64 div neg Ar 4 get 64 div neg arc
	closepath glev Setgray stroke
	Cmsave1 setmatrix } def 

%------------------------------------------------------
% centred hard mark 
%------------------------------------------------------

% x y str ShowCString 
% on fait un show mais string est centre autour du point (x,y) 

/ShowCString { /str exch def /y exch def /x exch def 
 newpath 
 x y moveto 
 str true charpath flattenpath pathbbox 
 /y2 exch def /x2 exch def /y1 exch def /x1 exch def 
 x 2 mul x2 x1 add 2 div sub 
 y 2 mul y2 y1 add 2 div sub moveto str show 
 } def 

/drawpolymark {/glev exch def /Ar exch def 
	Ar 0 get Ar 1 get HardMark ShowCString 
	2 2 Ar length 1 sub 
	{/i exch def
	Ar i get Ar i 1 add get HardMark ShowCString
	}for
} def 

%---------------------------------------------------
% chaines de caracteres 
%---------------------------------------------------
/FBox {/Ar exch def /rot exch def /str exch def /y exch def /x exch def 
 newpath Ar 0 get Ar 1 get moveto 
	/sina rot sin def /cosa rot cos def 
	/-sina sina neg def 
	[cosa -sina sina cosa 0 0 ] CtmModif
 Ar 2 get 0 rlineto 0 Ar 3 get neg rlineto Ar 2 get neg 0 rlineto 
 0 Ar 3 get  rlineto  stroke CtmRestore 
 x y str rot ShowRotate 
 } def 

% x y str ang Showrotate 
% inverse du sens trigo 

/ShowRotate { /ang exch def /str exch def 
	/y exch def /x exch def 
	x y moveto 
	/sina ang sin def /cosa ang cos def 
	/-sina 0 sina sub def 
	[cosa -sina sina cosa 0 0 ] CtmModif
	str show 
	CtmRestore 
} def 

/HardMark (0) def 

%(Chaine de caracteres) x y flag angle [arfbox] Show

/Show { /Ar exch def 
	/rot exch def /flag exch def /y exch def /x exch def /str exch def 
	flag 1 eq 
	{x y str rot Ar FBox}
	{x y str rot ShowRotate } ifelse} def 

/L {/y2 exch def /x2 exch def /y1 exch def /x1 exch def 
    newpath x1 y1 moveto x2 y2 lineto stroke } def 

%---------------------------------------------------------
% drawing an axis 
% angle [nsep1,nsep2] ,[siz1,siz2,coeff] [x0,y0] drawaxis",
%---------------------------------------------------------

/drawaxis {/XX exch def /Arsize exch def /Arsep exch def /ang exch def 
	/Cmsave1 matrix def Cmsave1 currentmatrix pop
	/sina ang sin def /cosa ang cos def /-sina sina neg def 
	/x XX 0 get def /y XX 1 get def
	%-- on change de transformation pour tourner autour de (x,y) 
	x y [cosa sina -sina cosa 0 0 ] transform
	/t1 exch neg y add def 
	/t2 exch neg x add def 
	[cosa sina -sina cosa t2 t1 ] concat 
	newpath x y moveto 0 Arsize 1 get Arsize 2 get mul rlineto
	stroke 
	0 1 Arsep 1 get 1 sub
	{
	 % i don't want the value of the for indice 
	 pop
	newpath 
	x y moveto 
	0 1 Arsep 0 get 1 sub
		{
		 % i don't want the value of the for indice 
		 pop
		 Arsize 0 get 0  rlineto
		 0 Arsize 1 get rlineto 
	 	0 Arsize 1 get  neg rlineto }
		for 
	currentpoint /y exch def /x exch def 
	stroke 
	newpath x y moveto 0 Arsize 1 get Arsize 2 get mul rlineto
	stroke }
	for 
	Cmsave1 setmatrix } def 

%---------------------------------------------------------
% change and restore CTM
%---------------------------------------------------------

/CtmModif {
	/arg exch def 
	/Cmsave matrix def 
	Cmsave currentmatrix pop
	[1 0 0 -1 0 0 ] concat 
	arg concat 
} def 

/CtmRestore { Cmsave setmatrix } def 

/Thickness { /th exch def th 0 le {/th 0.1 def} if th setlinewidth} def 

/WhiteLev 15 def

/Setgray { WhiteLev div setgray} def 

/fillsolid { 0 setgray } def 

%--------------------------------------
% clip zones ( rectangle ) 
%-------------------------------------

/setclipzone {initclip 
	/h exch def /w exch def /y exch def /x exch def 
	newpath x y moveto w 0 rlineto 0 h rlineto w neg 0 rlineto 
	0 h neg rlineto closepath clip} def 

%------------------
% to change the position of a picture 
%------------------
/cm{28.346457 mul}def

/DesPosi { /YH exch def /XW exch def /YP exch def /XP exch def 
	XP cm YP cm neg translate 
	XW cm 6000 div YH cm 4240 div  scale } def 

0 setlinecap 
2 setlinejoin 
1 setlinewidth

%-- Color database 
/ColorR [0.000000 0.000000 0.000000 0.529412 0.498039 0.133333 0.000000 0.878431 0.000000 1.000000 1.000000 1.000000 0.933333 1.000000 1.000000 0.960784 1.000000 ] def
/ColorG [0.000000 0.000000 0.000000 0.807843 1.000000 0.545098 1.000000 1.000000 1.000000 0.647059 0.000000 0.000000 0.509804 1.000000 0.843137 0.960784 1.000000 ] def
/ColorB [0.000000 0.501961 1.000000 0.921569 0.831373 0.133333 0.000000 1.000000 1.000000 0.000000 0.000000 1.000000 0.933333 0.000000 0.000000 0.862745 1.000000 ] def

/Setcolor {/i exch def ColorR i get ColorG i get ColorB i get setrgbcolor } def

% to multiply all the fontsizes by a factor  scf
/scf 1.0 def


% changing fonts encoding 

/Courier findfont
dup length dict begin
  {1 index /FID ne {def} {pop pop} ifelse} forall
  /Encoding ISOLatin1Encoding def
  currentdict
  end
/Courier exch definefont pop

/Times-Roman findfont
dup length dict begin
  {1 index /FID ne {def} {pop pop} ifelse} forall
  /Encoding ISOLatin1Encoding def
  currentdict
  end
/Times-Roman exch definefont pop

/Times-Bold findfont
dup length dict begin
  {1 index /FID ne {def} {pop pop} ifelse} forall
  /Encoding ISOLatin1Encoding def
  currentdict
  end
/Times-Bold exch definefont pop


/Times-BoldItalic findfont
dup length dict begin
  {1 index /FID ne {def} {pop pop} ifelse} forall
  /Encoding ISOLatin1Encoding def
  currentdict
  end
/Times-BoldItalic exch definefont pop


%------ End Main Program ------%
% XP YP XW YW DesPosi in the following code 
% will output the picture in the rectangle defined by 
% upper left point (XP,YP) wide :XW Height: YW
% the coordinates are given in centimeter and 
% are the (0,0) point is the down-left point of the paper 


/ColorR [0.000000 
0.000000 0.000000 0.000000 1.000000 1.000000 1.000000 1.000000 0.000000 0.000000 0.000000 
0.529412 0.000000 0.000000 0.000000 0.000000 0.000000 0.000000 0.564706 0.690196 0.815686 
0.564706 0.690196 0.815686 0.501961 0.627451 0.752941 1.000000 1.000000 1.000000 1.000000 
1.000000 0.0 1.0] def
/ColorG [0.000000 
0.000000 1.000000 1.000000 0.000000 0.000000 0.000000 1.000000 0.000000 0.000000 0.000000 
0.807843 0.564706 0.690196 0.815686 0.564706 0.690196 0.815686 0.000000 0.000000 0.000000 
0.000000 0.000000 0.000000 0.188235 0.250980 0.376471 0.501961 0.627451 0.752941 0.878431 
0.843137 0.0 1.0] def
/ColorB [0.000000 
1.000000 0.000000 1.000000 0.000000 1.000000 0.000000 1.000000 0.564706 0.690196 0.815686 
1.000000 0.000000 0.000000 0.000000 0.564706 0.690196 0.815686 0.000000 0.000000 0.000000 
0.564706 0.690196 0.815686 0.000000 0.000000 0.000000 0.501961 0.627451 0.752941 0.878431 
0.000000 0.0 1.0] def
% Dessin en bas a gauche de taille 3000,2120
[0.5 10 div 0 0 0.5 10 div neg  0 2120 10 div] concat
% Init driver 
5 Thickness
% 3 setalufunction
-1 -1 200000 200000 setclipzone
0 Setcolor
/Times-Roman findfont 100 scf mul scalefont setfont
fillsolid
[] 0 setdash
0 Setcolor
%--use color 1 
fillsolid
[] 0 setdash
0 Setcolor
/WhiteLev 31 def
/Setgray {/i exch def ColorR i get ColorG i get ColorB i get setrgbcolor } def 
/Setcolor {/i exch def ColorR i get ColorG i get ColorB i get setrgbcolor } def 
%--end use color 1 
% End init driver 
/WhiteLev 31 def
/Times-Roman findfont 100 scf mul scalefont setfont
5 Thickness
-1 -1 200000 200000 setclipzone
0 Setcolor
0 Setcolor
 (drawbox) 4 [ 0]
[750 530 4500 3180 
] dogrey 
0 Setcolor
(0) 722 3906 0  0.00 [722 3816 57 120] Show
 (drawsegs) 4 [ 0]
[750 3710 750 3773 
] dogrey 
0 Setcolor
 (drawsegs) 4 [ 0]
[1200 3710 1200 3741 
] dogrey 
0 Setcolor
(10) 1593 3906 0  0.00 [1593 3816 114 120] Show
 (drawsegs) 4 [ 0]
[1650 3710 1650 3773 
] dogrey 
0 Setcolor
 (drawsegs) 4 [ 0]
[2100 3710 2100 3741 
] dogrey 
0 Setcolor
(20) 2493 3906 0  0.00 [2493 3816 114 120] Show
 (drawsegs) 4 [ 0]
[2550 3710 2550 3773 
] dogrey 
0 Setcolor
 (drawsegs) 4 [ 0]
[3000 3710 3000 3741 
] dogrey 
0 Setcolor
(30) 3393 3906 0  0.00 [3393 3816 114 120] Show
 (drawsegs) 4 [ 0]
[3450 3710 3450 3773 
] dogrey 
0 Setcolor
 (drawsegs) 4 [ 0]
[3900 3710 3900 3741 
] dogrey 
0 Setcolor
(40) 4293 3906 0  0.00 [4293 3816 114 120] Show
 (drawsegs) 4 [ 0]
[4350 3710 4350 3773 
] dogrey 
0 Setcolor
 (drawsegs) 4 [ 0]
[4800 3710 4800 3741 
] dogrey 
0 Setcolor
(50) 5193 3906 0  0.00 [5193 3816 114 120] Show
 (drawsegs) 4 [ 0]
[5250 3710 5250 3773 
] dogrey 
0 Setcolor
(-1.5) 449 3770 0  0.00 [449 3680 229 120] Show
 (drawsegs) 4 [ 0]
[750 3710 690 3710 
] dogrey 
0 Setcolor
 (drawsegs) 4 [ 0]
[750 3511 720 3511 
] dogrey 
0 Setcolor
(-1.1) 449 3373 0  0.00 [449 3283 229 120] Show
 (drawsegs) 4 [ 0]
[750 3313 690 3313 
] dogrey 
0 Setcolor
 (drawsegs) 4 [ 0]
[750 3114 720 3114 
] dogrey 
0 Setcolor
(-0.7) 449 2975 0  0.00 [449 2885 229 120] Show
 (drawsegs) 4 [ 0]
[750 2915 690 2915 
] dogrey 
0 Setcolor
 (drawsegs) 4 [ 0]
[750 2716 720 2716 
] dogrey 
0 Setcolor
(-0.3) 449 2578 0  0.00 [449 2488 229 120] Show
 (drawsegs) 4 [ 0]
[750 2518 690 2518 
] dogrey 
0 Setcolor
 (drawsegs) 4 [ 0]
[750 2319 720 2319 
] dogrey 
0 Setcolor
(0.1) 506 2180 0  0.00 [506 2090 172 120] Show
 (drawsegs) 4 [ 0]
[750 2120 690 2120 
] dogrey 
0 Setcolor
 (drawsegs) 4 [ 0]
[750 1921 720 1921 
] dogrey 
0 Setcolor
(0.5) 506 1783 0  0.00 [506 1693 172 120] Show
 (drawsegs) 4 [ 0]
[750 1723 690 1723 
] dogrey 
0 Setcolor
 (drawsegs) 4 [ 0]
[750 1524 720 1524 
] dogrey 
0 Setcolor
(0.9) 506 1385 0  0.00 [506 1295 172 120] Show
 (drawsegs) 4 [ 0]
[750 1325 690 1325 
] dogrey 
0 Setcolor
 (drawsegs) 4 [ 0]
[750 1126 720 1126 
] dogrey 
0 Setcolor
(1.3) 506 988 0  0.00 [506 898 172 120] Show
 (drawsegs) 4 [ 0]
[750 928 690 928 
] dogrey 
0 Setcolor
 (drawsegs) 4 [ 0]
[750 729 720 729 
] dogrey 
0 Setcolor
(1.7) 506 590 0  0.00 [506 500 172 120] Show
 (drawsegs) 4 [ 0]
[750 530 690 530 
] dogrey 
0 Setcolor
0 Setcolor
750 530 4500 3180 setclipzone
0 Setcolor
/closeflag false def
 (drawpoly) 6 [ 0]
[750 729 750 3710 5070 3710 
] dogrey 
0 Setcolor
/absolu true def
0 Setcolor
-1 -1 200000 200000 setclipzone
0 Setcolor
0 Setcolor
750 530 4500 3180 setclipzone
0 Setcolor
/closeflag false def
 (drawpoly) 96 [ 0]
[840 1226 930 3201 1020 1274 1110 3105 1200 1415 1290 2922 1380 1635 1470 2671 1560 1912 1650 2375 
1740 2219 1830 2064 1920 2526 2010 1768 2100 2803 2190 1517 2280 3023 2370 1334 2460 3164 2550 1238 
2640 3213 2730 1238 2820 3164 2910 1334 3000 3023 3090 1517 3180 2803 3270 1768 3360 2526 3450 2064 
3540 2219 3630 2375 3720 1912 3810 2671 3900 1635 3990 2922 4080 1415 4170 3105 4260 1274 4350 3201 
4440 1226 4530 3201 4620 1274 4710 3105 4800 1415 4890 2922 4980 1635 5070 2671 
] dogrey 
0 Setcolor
/absolu true def
0 Setcolor
-1 -1 200000 200000 setclipzone
0 Setcolor
0 Setcolor
750 530 4500 3180 setclipzone
1 Setcolor
/closeflag false def
 (drawpoly) 96 [ 0]
[840 1226 930 1238 1020 1274 1110 1334 1200 1415 1290 1517 1380 1635 1470 1768 1560 1912 1650 2064 
1740 2219 1830 2375 1920 2526 2010 2671 2100 2803 2190 2922 2280 3023 2370 3105 2460 3164 2550 3201 
2640 3213 2730 3201 2820 3164 2910 3105 3000 3023 3090 2922 3180 2803 3270 2671 3360 2526 3450 2375 
3540 2219 3630 2064 3720 1912 3810 1768 3900 1635 3990 1517 4080 1415 4170 1334 4260 1274 4350 1238 
4440 1226 4530 1238 4620 1274 4710 1334 4800 1415 4890 1517 4980 1635 5070 1768 
] dogrey 
1 Setcolor
/absolu true def
0 Setcolor
-1 -1 200000 200000 setclipzone
0 Setcolor
0 Setcolor
750 530 4500 3180 setclipzone
1 Setcolor
/closeflag false def
 (drawpoly) 96 [ 0]
[840 3213 930 3201 1020 3164 1110 3105 1200 3023 1290 2922 1380 2803 1470 2671 1560 2526 1650 2375 
1740 2219 1830 2064 1920 1912 2010 1768 2100 1635 2190 1517 2280 1415 2370 1334 2460 1274 2550 1238 
2640 1226 2730 1238 2820 1274 2910 1334 3000 1415 3090 1517 3180 1635 3270 1768 3360 1912 3450 2064 
3540 2219 3630 2375 3720 2526 3810 2671 3900 2803 3990 2922 4080 3023 4170 3105 4260 3164 4350 3201 
4440 3213 4530 3201 4620 3164 4710 3105 4800 3023 4890 2922 4980 2803 5070 2671 
] dogrey 
1 Setcolor
/absolu true def
0 Setcolor
-1 -1 200000 200000 setclipzone
 showpage

 end saved restore 

