%!PS-Adobe-2.0 EPSF-2.0
%%BoundingBox:  0 0 300 212
%%
%%Scilab Postscript File (1995-1997 J.Ph Chancelier)
%%EndComments
/saved save def 
/$pictdict 100 dict def
$pictdict begin

/dogrey
{ /Arraybox exch def
	/Arraygrey exch def
	/nargs exch def 
	/func exch cvx def
	Arraybox 0 nargs getinterval Arraygrey 0 get func 
	1 1 Arraygrey length 1 sub 
	{/i exch def
	Arraybox i nargs mul nargs getinterval 
	Arraygrey i get func
	}for
} def
%--------------------------------------------
% [x y width height] nivgris drawbox 
% si niv gris > 1.0 alors on fait un stroke 
% sans closepath 
%--------------------------------------------

/drawpoly
	{/glev exch def /Ar exch def
	newpath
	Ar 0 get Ar 1 get moveto 
	2 2 Ar length 1 sub 
	{/i exch def
	Ar i get Ar i 1 add get absolu {lineto} {rlineto} ifelse
	}for
	glev -1 le 
	{ % filling the polygon with current pattern ( gray or color)
	  closepath gsave glev neg 1 sub WhiteLev 2 add lmin 0 lmax Setgray eofill grestore }
	{ glev 1 ge 
	   { % drawing the polygon with current dash style or color 
	     % XXXXX : a voir c'est pas clair il faudrait sauver 
	     % and filling it with other color (glev) 
	     closepath gsave glev 1 sub WhiteLev 2 add lmin 0 lmax Setgray 
		 eofill grestore stroke }
	   {% drawing the polygon with current style 
	    closeflag {closepath} if stroke} 
	ifelse }
	ifelse 
} def 


/drawbox 
	{/glev exch def /Ar exch def 
	/x Ar 0 get def /y Ar 1 get def 
	/w Ar 2 get def /h Ar 3 get def 
	newpath
	x y moveto
	x w add y lineto
	x w add y h add lineto
	x y h add lineto
	glev 1 ge 
	{ % filling 
	 closepath gsave glev 1 sub WhiteLev 2 add lmin 0 lmax Setgray eofill 
		grestore}
	{ 
	  % drawing 
	  glev -1 le 
	  {
    	  closepath gsave glev neg 1 sub WhiteLev 2 add lmin 0 lmax Setgray
		 stroke grestore  }
	  { closepath stroke} ifelse 
	} ifelse
} def 

%--------------------------------------------
% [x y width height] clearzone
%--------------------------------------------
/clearzone
        {/Ar exch def
        /x Ar 0 get def /y Ar 1 get def
        /w Ar 2 get def /h Ar 3 get def
        newpath
        x y moveto
        x w add y lineto
        x w add y h add lineto
        x y h add lineto
	closepath WhiteLev 2 add Setcolor  eofill grestore
} def

%------------------------------------------------------
% polyline stroke or polygon fill or both 
%------------------------------------------------------
/absolu true def 
/closeflag false def 

/lmin { /y exch def /x exch def x y le { x  } {  y  } ifelse } def
/lmax { /y exch def /x exch def x y le { y } {  x } ifelse } def 


/drawpoly
	{/glev exch def /Ar exch def
	newpath
	Ar 0 get Ar 1 get moveto 
	2 2 Ar length 1 sub 
	{/i exch def
	Ar i get Ar i 1 add get absolu {lineto} {rlineto} ifelse
	}for
	glev -1 le 
	{ % filling the polygon with current pattern ( gray or color)
	  closepath gsave glev neg 1 sub WhiteLev 2 add lmin 0 lmax Setgray eofill grestore }
	{ glev 1 ge 
	   { % drawing the polygon with current dash style or color 
	     % XXXXX : a voir c'est pas clair il faudrait sauver 
	     % and filling it with other color (glev) 
	     closepath gsave glev 1 sub WhiteLev 2 add lmin 0 lmax Setgray 
		 eofill grestore stroke }
	   {% drawing the polygon with current style 
	    closeflag {closepath} if stroke} 
	ifelse }
	ifelse 
} def 

%------------------------------------------------------
% segments non connectes 
%------------------------------------------------------

/drawsegs
	{/glev exch def /Ar exch def
	newpath
	Ar 0 get Ar 1 get moveto Ar 2 get Ar 3 get lineto 
	gsave glev Setgray stroke grestore
	4 4 Ar length 3 sub 
	{/i exch def
	newpath 
	Ar i get Ar i 1 add get moveto
	Ar i 2 add get Ar i 3 add get lineto 
	gsave glev Setgray stroke grestore
	}for
} def 


%------------------------------------------------------
% unconected arrows
%-----------------------------------------------------

/drawarrows
	{/arsize10 exch def /Ar exch def
	Ar 0 get  Ar 1 get Ar 2 get Ar 3 get arsize10 drawarrow
	4 4 Ar length 3 sub 
	{/i exch def
	Ar i get Ar i 1 add get  Ar i 2 add get  Ar i 3 add get arsize10 
	drawarrow
	}for
} def 
		
/cos20 20 cos def
/sin20 20 sin def

/drawarrow                                
  { 
      /arsize exch 10 div def 
      /tipy exch def /tipx exch def       
      /taily exch def /tailx exch def
      /dx tipx tailx sub  def               
      /dy tipy taily sub  def               
      newpath tipx tipy moveto tailx taily lineto stroke   
      /norme dx dx mul dy dy mul add sqrt def 
      norme 1.e-8 ge 
	{
	 arsize dx mul norme div /dx1 exch def 
	 arsize dy mul norme div /dy1 exch def 
	 /depx tipx cos20 dx1 mul add def 
	/depy  tipy cos20 dy1 mul add def 
	newpath depx depy moveto 
	cos20 neg dx1 mul sin20 dy1 mul sub depx add
	sin20 dx1  mul cos20 dy1 mul sub depy add lineto 
	cos20 neg dx1 mul sin20 dy1 mul add  depx add
	sin20 neg dx1 mul cos20 dy1 mul sub depy add lineto closepath 
	fill
	} {} ifelse 
  } def


%------------------------------------------------------
% cercle ou portions de cercle 
% attention argument (x y w h angl1*64 angl2*64 )
% devrait tracer une ellipse a modifier donc 
%------------------------------------------------------

/fillarc
	{/glev exch def /Ar exch def
	/cx Ar 0 get Ar 2 get 2 div add def 
	/cy Ar 1 get Ar 3 get 2 div add def 
	/hom Ar 3 get Ar 2 get div def 
	/Cmsave1 matrix def Cmsave1 currentmatrix pop
	%-- on change de transformation pour faire homothetie en (x,y) 
	cx cy [1 0 0 hom 0 0 ] transform
	/t1 exch neg cy add def 
	/t2 exch neg cx add def 
	[1 0 0 hom t2 t1 ] concat 
	glev WhiteLev le
	{ % filling 
	newpath
	cx cy moveto 
	cx cy Ar 2 get 2 div Ar 5 get Ar 4 get add  64 div neg
	 Ar 4 get 64 div neg  arc closepath
	gsave glev Setgray eofill grestore}
	{
	%drawing with current dash or color unclosed path 
	newpath
	cx cy Ar 2 get 2 div Ar 5 get Ar 4 get add 64 div neg Ar 4 get 64 div neg arc
	  stroke} ifelse 
	Cmsave1 setmatrix } def 

/drawarc
	{/glev exch def /Ar exch def
	/cx Ar 0 get Ar 2 get 2 div add def 
	/cy Ar 1 get Ar 3 get 2 div add def 
	/hom Ar 3 get Ar 2 get div def 
	/Cmsave1 matrix def Cmsave1 currentmatrix pop
	%-- on change de transformation pour faire homothetie en (x,y) 
	cx cy [1 0 0 hom 0 0 ] transform
	/t1 exch neg cy add def 
	/t2 exch neg cx add def 
	[1 0 0 hom t2 t1 ] concat 
	newpath
	cx cy Ar 2 get 2 div Ar 5 get Ar 4 get add 64 div neg Ar 4 get 64 div neg arc
	closepath glev Setgray stroke
	Cmsave1 setmatrix } def 

%------------------------------------------------------
% centred hard mark 
%------------------------------------------------------

% x y str ShowCString 
% on fait un show mais string est centre autour du point (x,y) 

/ShowCString { /str exch def /y exch def /x exch def 
 newpath 
 x y moveto 
 str true charpath flattenpath pathbbox 
 /y2 exch def /x2 exch def /y1 exch def /x1 exch def 
 x 2 mul x2 x1 add 2 div sub 
 y 2 mul y2 y1 add 2 div sub moveto str show 
 } def 

/drawpolymark {/glev exch def /Ar exch def 
	Ar 0 get Ar 1 get HardMark ShowCString 
	2 2 Ar length 1 sub 
	{/i exch def
	Ar i get Ar i 1 add get HardMark ShowCString
	}for
} def 

%---------------------------------------------------
% chaines de caracteres 
%---------------------------------------------------
/FBox {/Ar exch def /rot exch def /str exch def /y exch def /x exch def 
 newpath Ar 0 get Ar 1 get moveto 
	/sina rot sin def /cosa rot cos def 
	/-sina sina neg def 
	[cosa -sina sina cosa 0 0 ] CtmModif
 Ar 2 get 0 rlineto 0 Ar 3 get neg rlineto Ar 2 get neg 0 rlineto 
 0 Ar 3 get  rlineto  stroke CtmRestore 
 x y str rot ShowRotate 
 } def 

% x y str ang Showrotate 
% inverse du sens trigo 

/ShowRotate { /ang exch def /str exch def 
	/y exch def /x exch def 
	x y moveto 
	/sina ang sin def /cosa ang cos def 
	/-sina 0 sina sub def 
	[cosa -sina sina cosa 0 0 ] CtmModif
	str show 
	CtmRestore 
} def 

/HardMark (0) def 

%(Chaine de caracteres) x y flag angle [arfbox] Show

/Show { /Ar exch def 
	/rot exch def /flag exch def /y exch def /x exch def /str exch def 
	flag 1 eq 
	{x y str rot Ar FBox}
	{x y str rot ShowRotate } ifelse} def 

/L {/y2 exch def /x2 exch def /y1 exch def /x1 exch def 
    newpath x1 y1 moveto x2 y2 lineto stroke } def 

%---------------------------------------------------------
% drawing an axis 
% angle [nsep1,nsep2] ,[siz1,siz2,coeff] [x0,y0] drawaxis",
%---------------------------------------------------------

/drawaxis {/XX exch def /Arsize exch def /Arsep exch def /ang exch def 
	/Cmsave1 matrix def Cmsave1 currentmatrix pop
	/sina ang sin def /cosa ang cos def /-sina sina neg def 
	/x XX 0 get def /y XX 1 get def
	%-- on change de transformation pour tourner autour de (x,y) 
	x y [cosa sina -sina cosa 0 0 ] transform
	/t1 exch neg y add def 
	/t2 exch neg x add def 
	[cosa sina -sina cosa t2 t1 ] concat 
	newpath x y moveto 0 Arsize 1 get Arsize 2 get mul rlineto
	stroke 
	0 1 Arsep 1 get 1 sub
	{
	 % i don't want the value of the for indice 
	 pop
	newpath 
	x y moveto 
	0 1 Arsep 0 get 1 sub
		{
		 % i don't want the value of the for indice 
		 pop
		 Arsize 0 get 0  rlineto
		 0 Arsize 1 get rlineto 
	 	0 Arsize 1 get  neg rlineto }
		for 
	currentpoint /y exch def /x exch def 
	stroke 
	newpath x y moveto 0 Arsize 1 get Arsize 2 get mul rlineto
	stroke }
	for 
	Cmsave1 setmatrix } def 

%---------------------------------------------------------
% change and restore CTM
%---------------------------------------------------------

/CtmModif {
	/arg exch def 
	/Cmsave matrix def 
	Cmsave currentmatrix pop
	[1 0 0 -1 0 0 ] concat 
	arg concat 
} def 

/CtmRestore { Cmsave setmatrix } def 

/Thickness { /th exch def th 0 le {/th 0.1 def} if th setlinewidth} def 

/WhiteLev 15 def

/Setgray { WhiteLev div setgray} def 

/fillsolid { 0 setgray } def 

%--------------------------------------
% clip zones ( rectangle ) 
%-------------------------------------

/setclipzone {initclip 
	/h exch def /w exch def /y exch def /x exch def 
	newpath x y moveto w 0 rlineto 0 h rlineto w neg 0 rlineto 
	0 h neg rlineto closepath clip} def 

%------------------
% to change the position of a picture 
%------------------
/cm{28.346457 mul}def

/DesPosi { /YH exch def /XW exch def /YP exch def /XP exch def 
	XP cm YP cm neg translate 
	XW cm 6000 div YH cm 4240 div  scale } def 

0 setlinecap 
2 setlinejoin 
1 setlinewidth

%-- Color database 
/ColorR [0.000000 0.000000 0.000000 0.529412 0.498039 0.133333 0.000000 0.878431 0.000000 1.000000 1.000000 1.000000 0.933333 1.000000 1.000000 0.960784 1.000000 ] def
/ColorG [0.000000 0.000000 0.000000 0.807843 1.000000 0.545098 1.000000 1.000000 1.000000 0.647059 0.000000 0.000000 0.509804 1.000000 0.843137 0.960784 1.000000 ] def
/ColorB [0.000000 0.501961 1.000000 0.921569 0.831373 0.133333 0.000000 1.000000 1.000000 0.000000 0.000000 1.000000 0.933333 0.000000 0.000000 0.862745 1.000000 ] def

/Setcolor {/i exch def ColorR i get ColorG i get ColorB i get setrgbcolor } def

% to multiply all the fontsizes by a factor  scf
/scf 1.0 def


% changing fonts encoding 

/Courier findfont
dup length dict begin
  {1 index /FID ne {def} {pop pop} ifelse} forall
  /Encoding ISOLatin1Encoding def
  currentdict
  end
/Courier exch definefont pop

/Times-Roman findfont
dup length dict begin
  {1 index /FID ne {def} {pop pop} ifelse} forall
  /Encoding ISOLatin1Encoding def
  currentdict
  end
/Times-Roman exch definefont pop

/Times-Bold findfont
dup length dict begin
  {1 index /FID ne {def} {pop pop} ifelse} forall
  /Encoding ISOLatin1Encoding def
  currentdict
  end
/Times-Bold exch definefont pop


/Times-BoldItalic findfont
dup length dict begin
  {1 index /FID ne {def} {pop pop} ifelse} forall
  /Encoding ISOLatin1Encoding def
  currentdict
  end
/Times-BoldItalic exch definefont pop


%------ End Main Program ------%
% XP YP XW YW DesPosi in the following code 
% will output the picture in the rectangle defined by 
% upper left point (XP,YP) wide :XW Height: YW
% the coordinates are given in centimeter and 
% are the (0,0) point is the down-left point of the paper 


/ColorR [0.000000 
0.000000 0.000000 0.000000 1.000000 1.000000 1.000000 1.000000 0.000000 0.000000 0.000000 
0.529412 0.000000 0.000000 0.000000 0.000000 0.000000 0.000000 0.564706 0.690196 0.815686 
0.564706 0.690196 0.815686 0.501961 0.627451 0.752941 1.000000 1.000000 1.000000 1.000000 
1.000000 0.0 1.0] def
/ColorG [0.000000 
0.000000 1.000000 1.000000 0.000000 0.000000 0.000000 1.000000 0.000000 0.000000 0.000000 
0.807843 0.564706 0.690196 0.815686 0.564706 0.690196 0.815686 0.000000 0.000000 0.000000 
0.000000 0.000000 0.000000 0.188235 0.250980 0.376471 0.501961 0.627451 0.752941 0.878431 
0.843137 0.0 1.0] def
/ColorB [0.000000 
1.000000 0.000000 1.000000 0.000000 1.000000 0.000000 1.000000 0.564706 0.690196 0.815686 
1.000000 0.000000 0.000000 0.000000 0.564706 0.690196 0.815686 0.000000 0.000000 0.000000 
0.564706 0.690196 0.815686 0.000000 0.000000 0.000000 0.501961 0.627451 0.752941 0.878431 
0.000000 0.0 1.0] def
% Dessin en bas a gauche de taille 3000,2120
[0.5 10 div 0 0 0.5 10 div neg  0 2120 10 div] concat
% Init driver 
5 Thickness
% 3 setalufunction
-1 -1 200000 200000 setclipzone
[] 0 setdash
/Times-Roman findfont 100 scf mul scalefont setfont
fillsolid
[] 0 setdash
0 Setcolor
%--use color 1 
fillsolid
[] 0 setdash
0 Setcolor
/WhiteLev 31 def
/Setgray {/i exch def ColorR i get ColorG i get ColorB i get setrgbcolor } def 
/Setcolor {/i exch def ColorR i get ColorG i get ColorB i get setrgbcolor } def 
%--end use color 1 
% End init driver 
/WhiteLev 31 def
/Times-Roman findfont 100 scf mul scalefont setfont
5 Thickness
-1 -1 200000 200000 setclipzone
0 Setcolor
0 Setcolor
 (drawbox) 4 [ 0]
[750 530 4500 3180 
] dogrey 
0 Setcolor
(0) 722 3906 0  0.00 [722 3816 57 120] Show
 (drawsegs) 4 [ 0]
[750 3710 750 3773 
] dogrey 
0 Setcolor
 (drawsegs) 4 [ 0]
[975 3710 975 3741 
] dogrey 
0 Setcolor
(2) 1172 3906 0  0.00 [1172 3816 57 120] Show
 (drawsegs) 4 [ 0]
[1200 3710 1200 3773 
] dogrey 
0 Setcolor
 (drawsegs) 4 [ 0]
[1425 3710 1425 3741 
] dogrey 
0 Setcolor
(4) 1622 3906 0  0.00 [1622 3816 57 120] Show
 (drawsegs) 4 [ 0]
[1650 3710 1650 3773 
] dogrey 
0 Setcolor
 (drawsegs) 4 [ 0]
[1875 3710 1875 3741 
] dogrey 
0 Setcolor
(6) 2072 3906 0  0.00 [2072 3816 57 120] Show
 (drawsegs) 4 [ 0]
[2100 3710 2100 3773 
] dogrey 
0 Setcolor
 (drawsegs) 4 [ 0]
[2325 3710 2325 3741 
] dogrey 
0 Setcolor
(8) 2522 3906 0  0.00 [2522 3816 57 120] Show
 (drawsegs) 4 [ 0]
[2550 3710 2550 3773 
] dogrey 
0 Setcolor
 (drawsegs) 4 [ 0]
[2775 3710 2775 3741 
] dogrey 
0 Setcolor
(10) 2943 3906 0  0.00 [2943 3816 114 120] Show
 (drawsegs) 4 [ 0]
[3000 3710 3000 3773 
] dogrey 
0 Setcolor
 (drawsegs) 4 [ 0]
[3225 3710 3225 3741 
] dogrey 
0 Setcolor
(12) 3393 3906 0  0.00 [3393 3816 114 120] Show
 (drawsegs) 4 [ 0]
[3450 3710 3450 3773 
] dogrey 
0 Setcolor
 (drawsegs) 4 [ 0]
[3675 3710 3675 3741 
] dogrey 
0 Setcolor
(14) 3843 3906 0  0.00 [3843 3816 114 120] Show
 (drawsegs) 4 [ 0]
[3900 3710 3900 3773 
] dogrey 
0 Setcolor
 (drawsegs) 4 [ 0]
[4125 3710 4125 3741 
] dogrey 
0 Setcolor
(16) 4293 3906 0  0.00 [4293 3816 114 120] Show
 (drawsegs) 4 [ 0]
[4350 3710 4350 3773 
] dogrey 
0 Setcolor
 (drawsegs) 4 [ 0]
[4575 3710 4575 3741 
] dogrey 
0 Setcolor
(18) 4743 3906 0  0.00 [4743 3816 114 120] Show
 (drawsegs) 4 [ 0]
[4800 3710 4800 3773 
] dogrey 
0 Setcolor
 (drawsegs) 4 [ 0]
[5025 3710 5025 3741 
] dogrey 
0 Setcolor
(20) 5193 3906 0  0.00 [5193 3816 114 120] Show
 (drawsegs) 4 [ 0]
[5250 3710 5250 3773 
] dogrey 
0 Setcolor
(0) 621 3770 0  0.00 [621 3680 57 120] Show
 (drawsegs) 4 [ 0]
[750 3710 690 3710 
] dogrey 
0 Setcolor
 (drawsegs) 4 [ 0]
[750 3551 720 3551 
] dogrey 
0 Setcolor
(0.1) 506 3452 0  0.00 [506 3362 172 120] Show
 (drawsegs) 4 [ 0]
[750 3392 690 3392 
] dogrey 
0 Setcolor
 (drawsegs) 4 [ 0]
[750 3233 720 3233 
] dogrey 
0 Setcolor
(0.2) 506 3134 0  0.00 [506 3044 172 120] Show
 (drawsegs) 4 [ 0]
[750 3074 690 3074 
] dogrey 
0 Setcolor
 (drawsegs) 4 [ 0]
[750 2915 720 2915 
] dogrey 
0 Setcolor
(0.3) 506 2816 0  0.00 [506 2726 172 120] Show
 (drawsegs) 4 [ 0]
[750 2756 690 2756 
] dogrey 
0 Setcolor
 (drawsegs) 4 [ 0]
[750 2597 720 2597 
] dogrey 
0 Setcolor
(0.4) 506 2498 0  0.00 [506 2408 172 120] Show
 (drawsegs) 4 [ 0]
[750 2438 690 2438 
] dogrey 
0 Setcolor
 (drawsegs) 4 [ 0]
[750 2279 720 2279 
] dogrey 
0 Setcolor
(0.5) 506 2180 0  0.00 [506 2090 172 120] Show
 (drawsegs) 4 [ 0]
[750 2120 690 2120 
] dogrey 
0 Setcolor
 (drawsegs) 4 [ 0]
[750 1961 720 1961 
] dogrey 
0 Setcolor
(0.6) 506 1862 0  0.00 [506 1772 172 120] Show
 (drawsegs) 4 [ 0]
[750 1802 690 1802 
] dogrey 
0 Setcolor
 (drawsegs) 4 [ 0]
[750 1643 720 1643 
] dogrey 
0 Setcolor
(0.7) 506 1544 0  0.00 [506 1454 172 120] Show
 (drawsegs) 4 [ 0]
[750 1484 690 1484 
] dogrey 
0 Setcolor
 (drawsegs) 4 [ 0]
[750 1325 720 1325 
] dogrey 
0 Setcolor
(0.8) 506 1226 0  0.00 [506 1136 172 120] Show
 (drawsegs) 4 [ 0]
[750 1166 690 1166 
] dogrey 
0 Setcolor
 (drawsegs) 4 [ 0]
[750 1007 720 1007 
] dogrey 
0 Setcolor
(0.9) 506 908 0  0.00 [506 818 172 120] Show
 (drawsegs) 4 [ 0]
[750 848 690 848 
] dogrey 
0 Setcolor
 (drawsegs) 4 [ 0]
[750 689 720 689 
] dogrey 
0 Setcolor
(1.0) 506 590 0  0.00 [506 500 172 120] Show
 (drawsegs) 4 [ 0]
[750 530 690 530 
] dogrey 
0 Setcolor
0 Setcolor
750 530 4500 3180 setclipzone
0 Setcolor
/closeflag false def
 (drawpoly) 432 [ 0]
[750 530 752 530 755 530 757 530 759 530 761 530 764 530 766 530 768 530 770 530 
773 530 775 530 777 530 779 530 782 530 784 530 786 530 788 530 791 530 793 530 
795 530 797 530 800 531 802 531 804 531 806 531 809 531 811 531 813 531 815 531 
818 531 820 531 822 531 824 531 827 531 829 531 831 531 833 532 836 532 838 532 
840 532 842 532 845 532 847 532 849 532 851 532 854 532 856 532 858 533 860 533 
863 533 865 533 867 533 869 533 872 533 874 533 876 533 878 534 881 534 883 534 
885 534 887 534 890 534 892 534 894 534 896 535 899 535 901 535 903 535 905 535 
908 535 910 535 912 536 914 536 917 536 919 536 921 536 923 536 926 536 928 537 
930 537 932 537 935 537 937 537 939 537 941 538 944 538 946 538 948 538 950 538 
953 538 955 539 957 539 959 539 962 539 964 539 966 539 968 540 971 540 973 540 
975 540 977 540 980 540 982 541 984 541 986 541 989 541 991 541 993 542 995 542 
998 542 1000 542 1002 542 1004 543 1007 543 1009 543 1011 543 1013 543 1016 543 1018 544 
1020 544 1022 544 1025 544 1027 544 1029 545 1031 545 1034 545 1036 545 1038 545 1040 546 
1043 546 1045 546 1047 546 1049 546 1052 547 1054 547 1056 547 1058 547 1061 547 1063 548 
1065 548 1067 548 1070 548 1072 548 1074 549 1076 549 1079 549 1081 549 1083 549 1085 550 
1088 550 1090 550 1092 550 1094 550 1097 550 1099 551 1101 551 1103 551 1106 551 1108 551 
1110 552 1112 552 1115 552 1117 552 1119 552 1121 553 1124 553 1126 553 1128 553 1130 553 
1133 553 1135 554 1137 554 1139 554 1142 554 1144 554 1146 554 1148 555 1151 555 1153 555 
1155 555 1157 555 1160 555 1162 556 1164 556 1166 556 1169 556 1171 556 1173 556 1175 557 
1178 557 1180 557 1182 557 1184 557 1187 557 1189 557 1191 558 1193 558 1196 558 1198 558 
1200 558 1202 558 1205 558 1207 558 1209 559 1211 559 1214 559 1216 559 1218 559 1220 559 
1223 559 1225 559 1227 559 1229 560 1232 560 1234 560 
] dogrey 
 (drawpoly) 432 [0]
[1236 560 1238 560 1241 560 1243 560 1245 560 1247 560 1250 560 1252 560 1254 561 1256 561 
1259 561 1261 561 1263 561 1265 561 1268 561 1270 561 1272 561 1274 561 1277 561 1279 561 
1281 561 1283 561 1286 561 1288 561 1290 561 1292 561 1295 561 1297 561 1299 561 1301 561 
1304 561 1306 561 1308 561 1310 561 1313 561 1315 561 1317 561 1319 561 1322 561 1324 561 
1326 561 1328 561 1331 561 1333 561 1335 561 1337 561 1340 561 1342 561 1344 561 1346 561 
1349 561 1351 561 1353 561 1355 561 1358 561 1360 561 1362 561 1364 561 1367 561 1369 560 
1371 560 1373 560 1376 560 1378 560 1380 560 1382 560 1385 560 1387 560 1389 560 1391 559 
1394 559 1396 559 1398 559 1400 559 1403 559 1405 559 1407 559 1409 558 1412 558 1414 558 
1416 558 1418 558 1421 558 1423 558 1425 557 1427 557 1430 557 1432 557 1434 557 1436 557 
1439 556 1441 556 1443 556 1445 556 1448 556 1450 555 1452 555 1454 555 1457 555 1459 555 
1461 554 1463 554 1466 554 1468 554 1470 554 1472 553 1475 553 1477 553 1479 553 1481 552 
1484 552 1486 552 1488 552 1490 552 1493 551 1495 551 1497 551 1499 551 1502 550 1504 550 
1506 550 1508 550 1511 549 1513 549 1515 549 1517 549 1520 548 1522 548 1524 548 1526 548 
1529 547 1531 547 1533 547 1535 546 1538 546 1540 546 1542 546 1544 545 1547 545 1549 545 
1551 545 1553 544 1556 544 1558 544 1560 543 1562 543 1565 543 1567 543 1569 542 1571 542 
1574 542 1576 542 1578 541 1580 541 1583 541 1585 540 1587 540 1589 540 1592 540 1594 539 
1596 539 1598 539 1601 539 1603 538 1605 538 1607 538 1610 538 1612 537 1614 537 1616 537 
1619 537 1621 536 1623 536 1625 536 1628 536 1630 535 1632 535 1634 535 1637 535 1639 535 
1641 534 1643 534 1646 534 1648 534 1650 534 1652 533 1655 533 1657 533 1659 533 1661 533 
1664 532 1666 532 1668 532 1670 532 1673 532 1675 532 1677 531 1679 531 1682 531 1684 531 
1686 531 1688 531 1691 531 1693 531 1695 531 1697 530 1700 530 1702 530 1704 530 1706 530 
1709 530 1711 530 1713 530 1715 530 1718 530 1720 530 
] dogrey 
 (drawpoly) 432 [0]
[1722 530 1724 530 1727 530 1729 530 1731 530 1733 530 1736 530 1738 530 1740 530 1742 530 
1745 530 1747 530 1749 531 1751 531 1754 531 1756 531 1758 531 1760 531 1763 531 1765 531 
1767 532 1769 532 1772 532 1774 532 1776 532 1778 533 1781 533 1783 533 1785 533 1787 533 
1790 534 1792 534 1794 534 1796 535 1799 535 1801 535 1803 535 1805 536 1808 536 1810 536 
1812 537 1814 537 1817 537 1819 538 1821 538 1823 539 1826 539 1828 539 1830 540 1832 540 
1835 541 1837 541 1839 541 1841 542 1844 542 1846 543 1848 543 1850 544 1853 544 1855 545 
1857 545 1859 546 1862 546 1864 547 1866 547 1868 548 1871 548 1873 548 1875 549 1877 549 
1880 550 1882 550 1884 551 1886 551 1889 552 1891 552 1893 553 1895 553 1898 554 1900 554 
1902 555 1904 555 1907 556 1909 556 1911 556 1913 557 1916 557 1918 558 1920 558 1922 558 
1925 559 1927 559 1929 559 1931 560 1934 560 1936 560 1938 560 1940 561 1943 561 1945 561 
1947 561 1949 561 1952 561 1954 561 1956 561 1958 561 1961 561 1963 561 1965 561 1967 561 
1970 561 1972 561 1974 561 1976 561 1979 560 1981 560 1983 560 1985 559 1988 559 1990 558 
1992 558 1994 557 1997 557 1999 556 2001 555 2003 555 2006 554 2008 553 2010 552 2012 552 
2015 551 2017 550 2019 549 2021 548 2024 547 2026 546 2028 545 2030 544 2033 543 2035 542 
2037 541 2039 540 2042 538 2044 537 2046 536 2048 535 2051 534 2053 534 2055 533 2057 532 
2060 531 2062 531 2064 530 2066 530 2069 530 2071 530 2073 530 2075 531 2078 532 2080 533 
2082 534 2084 536 2087 538 2089 541 2091 544 2093 547 2096 551 2098 556 2100 561 2102 568 
2105 575 2107 583 2109 591 2111 601 2114 612 2116 624 2118 638 2120 652 2123 668 2125 686 
2127 705 2129 726 2132 749 2134 774 2136 800 2138 829 2141 860 2143 893 2145 929 2147 966 
2150 1007 2152 1049 2154 1095 2156 1142 2159 1192 2161 1245 2163 1300 2165 1357 2168 1417 2170 1479 
2172 1542 2174 1608 2177 1675 2179 1743 2181 1813 2183 1884 2186 1955 2188 2027 2190 2100 2192 2172 
2195 2244 2197 2315 2199 2386 2201 2455 2204 2523 2206 2590 
] dogrey 
 (drawpoly) 432 [0]
[2208 2655 2210 2718 2213 2780 2215 2839 2217 2896 2219 2951 2222 3003 2224 3053 2226 3101 2228 3146 
2231 3189 2233 3230 2235 3268 2237 3304 2240 3338 2242 3369 2244 3399 2246 3426 2249 3452 2251 3476 
2253 3498 2255 3519 2258 3538 2260 3555 2262 3571 2264 3586 2267 3599 2269 3612 2271 3623 2273 3633 
2276 3643 2278 3651 2280 3659 2282 3666 2285 3672 2287 3677 2289 3682 2291 3687 2294 3691 2296 3694 
2298 3697 2300 3700 2303 3702 2305 3704 2307 3705 2309 3707 2312 3708 2314 3709 2316 3709 2318 3710 
2321 3710 2323 3710 2325 3710 2327 3710 2330 3710 2332 3709 2334 3709 2336 3708 2339 3708 2341 3707 
2343 3706 2345 3706 2348 3705 2350 3704 2352 3703 2354 3702 2357 3702 2359 3701 2361 3700 2363 3699 
2366 3698 2368 3697 2370 3696 2372 3695 2375 3695 2377 3694 2379 3693 2381 3692 2384 3691 2386 3691 
2388 3690 2390 3689 2393 3689 2395 3688 2397 3687 2399 3687 2402 3686 2404 3685 2406 3685 2408 3684 
2411 3684 2413 3683 2415 3683 2417 3682 2420 3682 2422 3682 2424 3681 2426 3681 2429 3681 2431 3680 
2433 3680 2435 3680 2438 3680 2440 3679 2442 3679 2444 3679 2447 3679 2449 3679 2451 3679 2453 3678 
2456 3678 2458 3678 2460 3678 2462 3678 2465 3678 2467 3678 2469 3678 2471 3678 2474 3678 2476 3678 
2478 3678 2480 3678 2483 3679 2485 3679 2487 3679 2489 3679 2492 3679 2494 3679 2496 3679 2498 3679 
2501 3680 2503 3680 2505 3680 2507 3680 2510 3680 2512 3681 2514 3681 2516 3681 2519 3681 2521 3681 
2523 3682 2525 3682 2528 3682 2530 3682 2532 3683 2534 3683 2537 3683 2539 3684 2541 3684 2543 3684 
2546 3684 2548 3685 2550 3685 2552 3685 2555 3686 2557 3686 2559 3686 2561 3686 2564 3687 2566 3687 
2568 3687 2570 3688 2573 3688 2575 3688 2577 3689 2579 3689 2582 3689 2584 3689 2586 3690 2588 3690 
2591 3690 2593 3691 2595 3691 2597 3691 2600 3692 2602 3692 2604 3692 2606 3692 2609 3693 2611 3693 
2613 3693 2615 3694 2618 3694 2620 3694 2622 3694 2624 3695 2627 3695 2629 3695 2631 3696 2633 3696 
2636 3696 2638 3696 2640 3697 2642 3697 2645 3697 2647 3697 2649 3698 2651 3698 2654 3698 2656 3698 
2658 3699 2660 3699 2663 3699 2665 3699 2667 3700 2669 3700 2672 3700 2674 3700 2676 3701 2678 3701 
2681 3701 2683 3701 2685 3701 2687 3702 2690 3702 2692 3702 
] dogrey 
 (drawpoly) 432 [0]
[2694 3702 2696 3703 2699 3703 2701 3703 2703 3703 2705 3703 2708 3703 2710 3704 2712 3704 2714 3704 
2717 3704 2719 3704 2721 3705 2723 3705 2726 3705 2728 3705 2730 3705 2732 3705 2735 3705 2737 3706 
2739 3706 2741 3706 2744 3706 2746 3706 2748 3706 2750 3706 2753 3707 2755 3707 2757 3707 2759 3707 
2762 3707 2764 3707 2766 3707 2768 3707 2771 3708 2773 3708 2775 3708 2777 3708 2780 3708 2782 3708 
2784 3708 2786 3708 2789 3708 2791 3708 2793 3708 2795 3709 2798 3709 2800 3709 2802 3709 2804 3709 
2807 3709 2809 3709 2811 3709 2813 3709 2816 3709 2818 3709 2820 3709 2822 3709 2825 3709 2827 3709 
2829 3709 2831 3710 2834 3710 2836 3710 2838 3710 2840 3710 2843 3710 2845 3710 2847 3710 2849 3710 
2852 3710 2854 3710 2856 3710 2858 3710 2861 3710 2863 3710 2865 3710 2867 3710 2870 3710 2872 3710 
2874 3710 2876 3710 2879 3710 2881 3710 2883 3710 2885 3710 2888 3710 2890 3710 2892 3710 2894 3710 
2897 3710 2899 3710 2901 3710 2903 3710 2906 3710 2908 3710 2910 3710 2912 3710 2915 3710 2917 3710 
2919 3710 2921 3710 2924 3710 2926 3710 2928 3710 2930 3710 2933 3710 2935 3710 2937 3710 2939 3710 
2942 3709 2944 3709 2946 3709 2948 3709 2951 3709 2953 3709 2955 3709 2957 3709 2960 3709 2962 3709 
2964 3709 2966 3709 2969 3709 2971 3709 2973 3709 2975 3709 2978 3709 2980 3709 2982 3709 2984 3709 
2987 3709 2989 3708 2991 3708 2993 3708 2996 3708 2998 3708 3000 3708 3002 3708 3005 3708 3007 3708 
3009 3708 3011 3708 3014 3708 3016 3708 3018 3708 3020 3708 3023 3708 3025 3707 3027 3707 3029 3707 
3032 3707 3034 3707 3036 3707 3038 3707 3041 3707 3043 3707 3045 3707 3047 3707 3050 3707 3052 3707 
3054 3707 3056 3706 3059 3706 3061 3706 3063 3706 3065 3706 3068 3706 3070 3706 3072 3706 3074 3706 
3077 3706 3079 3706 3081 3706 3083 3705 3086 3705 3088 3705 3090 3705 3092 3705 3095 3705 3097 3705 
3099 3705 3101 3705 3104 3705 3106 3705 3108 3705 3110 3704 3113 3704 3115 3704 3117 3704 3119 3704 
3122 3704 3124 3704 3126 3704 3128 3704 3131 3704 3133 3704 3135 3703 3137 3703 3140 3703 3142 3703 
3144 3703 3146 3703 3149 3703 3151 3703 3153 3703 3155 3703 3158 3703 3160 3702 3162 3702 3164 3702 
3167 3702 3169 3702 3171 3702 3173 3702 3176 3702 3178 3702 
] dogrey 
 (drawpoly) 432 [0]
[3180 3702 3182 3702 3185 3701 3187 3701 3189 3701 3191 3701 3194 3701 3196 3701 3198 3701 3200 3701 
3203 3701 3205 3701 3207 3701 3209 3700 3212 3700 3214 3700 3216 3700 3218 3700 3221 3700 3223 3700 
3225 3700 3227 3700 3230 3700 3232 3700 3234 3699 3236 3699 3239 3699 3241 3699 3243 3699 3245 3699 
3248 3699 3250 3699 3252 3699 3254 3699 3257 3699 3259 3698 3261 3698 3263 3698 3266 3698 3268 3698 
3270 3698 3272 3698 3275 3698 3277 3698 3279 3698 3281 3698 3284 3697 3286 3697 3288 3697 3290 3697 
3293 3697 3295 3697 3297 3697 3299 3697 3302 3697 3304 3697 3306 3697 3308 3697 3311 3696 3313 3696 
3315 3696 3317 3696 3320 3696 3322 3696 3324 3696 3326 3696 3329 3696 3331 3696 3333 3696 3335 3695 
3338 3695 3340 3695 3342 3695 3344 3695 3347 3695 3349 3695 3351 3695 3353 3695 3356 3695 3358 3695 
3360 3695 3362 3694 3365 3694 3367 3694 3369 3694 3371 3694 3374 3694 3376 3694 3378 3694 3380 3694 
3383 3694 3385 3694 3387 3694 3389 3693 3392 3693 3394 3693 3396 3693 3398 3693 3401 3693 3403 3693 
3405 3693 3407 3693 3410 3693 3412 3693 3414 3693 3416 3693 3419 3692 3421 3692 3423 3692 3425 3692 
3428 3692 3430 3692 3432 3692 3434 3692 3437 3692 3439 3692 3441 3692 3443 3692 3446 3692 3448 3691 
3450 3691 3452 3691 3455 3691 3457 3691 3459 3691 3461 3691 3464 3691 3466 3691 3468 3691 3470 3691 
3473 3691 3475 3691 3477 3691 3479 3690 3482 3690 3484 3690 3486 3690 3488 3690 3491 3690 3493 3690 
3495 3690 3497 3690 3500 3690 3502 3690 3504 3690 3506 3690 3509 3690 3511 3689 3513 3689 3515 3689 
3518 3689 3520 3689 3522 3689 3524 3689 3527 3689 3529 3689 3531 3689 3533 3689 3536 3689 3538 3689 
3540 3689 3542 3689 3545 3688 3547 3688 3549 3688 3551 3688 3554 3688 3556 3688 3558 3688 3560 3688 
3563 3688 3565 3688 3567 3688 3569 3688 3572 3688 3574 3688 3576 3688 3578 3688 3581 3687 3583 3687 
3585 3687 3587 3687 3590 3687 3592 3687 3594 3687 3596 3687 3599 3687 3601 3687 3603 3687 3605 3687 
3608 3687 3610 3687 3612 3687 3614 3687 3617 3687 3619 3686 3621 3686 3623 3686 3626 3686 3628 3686 
3630 3686 3632 3686 3635 3686 3637 3686 3639 3686 3641 3686 3644 3686 3646 3686 3648 3686 3650 3686 
3653 3686 3655 3686 3657 3686 3659 3686 3662 3685 3664 3685 
] dogrey 
 (drawpoly) 432 [0]
[3666 3685 3668 3685 3671 3685 3673 3685 3675 3685 3677 3685 3680 3685 3682 3685 3684 3685 3686 3685 
3689 3685 3691 3685 3693 3685 3695 3685 3698 3685 3700 3685 3702 3685 3704 3685 3707 3684 3709 3684 
3711 3684 3713 3684 3716 3684 3718 3684 3720 3684 3722 3684 3725 3684 3727 3684 3729 3684 3731 3684 
3734 3684 3736 3684 3738 3684 3740 3684 3743 3684 3745 3684 3747 3684 3749 3684 3752 3684 3754 3684 
3756 3684 3758 3683 3761 3683 3763 3683 3765 3683 3767 3683 3770 3683 3772 3683 3774 3683 3776 3683 
3779 3683 3781 3683 3783 3683 3785 3683 3788 3683 3790 3683 3792 3683 3794 3683 3797 3683 3799 3683 
3801 3683 3803 3683 3806 3683 3808 3683 3810 3683 3812 3683 3815 3682 3817 3682 3819 3682 3821 3682 
3824 3682 3826 3682 3828 3682 3830 3682 3833 3682 3835 3682 3837 3682 3839 3682 3842 3682 3844 3682 
3846 3682 3848 3682 3851 3682 3853 3682 3855 3682 3857 3682 3860 3682 3862 3682 3864 3682 3866 3682 
3869 3682 3871 3682 3873 3682 3875 3682 3878 3682 3880 3681 3882 3681 3884 3681 3887 3681 3889 3681 
3891 3681 3893 3681 3896 3681 3898 3681 3900 3681 3902 3681 3905 3681 3907 3681 3909 3681 3911 3681 
3914 3681 3916 3681 3918 3681 3920 3681 3923 3681 3925 3681 3927 3681 3929 3681 3932 3681 3934 3681 
3936 3681 3938 3681 3941 3681 3943 3681 3945 3681 3947 3681 3950 3681 3952 3681 3954 3681 3956 3681 
3959 3681 3961 3680 3963 3680 3965 3680 3968 3680 3970 3680 3972 3680 3974 3680 3977 3680 3979 3680 
3981 3680 3983 3680 3986 3680 3988 3680 3990 3680 3992 3680 3995 3680 3997 3680 3999 3680 4001 3680 
4004 3680 4006 3680 4008 3680 4010 3680 4013 3680 4015 3680 4017 3680 4019 3680 4022 3680 4024 3680 
4026 3680 4028 3680 4031 3680 4033 3680 4035 3680 4037 3680 4040 3680 4042 3680 4044 3680 4046 3680 
4049 3680 4051 3680 4053 3680 4055 3680 4058 3680 4060 3680 4062 3680 4064 3680 4067 3680 4069 3679 
4071 3679 4073 3679 4076 3679 4078 3679 4080 3679 4082 3679 4085 3679 4087 3679 4089 3679 4091 3679 
4094 3679 4096 3679 4098 3679 4100 3679 4103 3679 4105 3679 4107 3679 4109 3679 4112 3679 4114 3679 
4116 3679 4118 3679 4121 3679 4123 3679 4125 3679 4127 3679 4130 3679 4132 3679 4134 3679 4136 3679 
4139 3679 4141 3679 4143 3679 4145 3679 4148 3679 4150 3679 
] dogrey 
 (drawpoly) 432 [0]
[4152 3679 4154 3679 4157 3679 4159 3679 4161 3679 4163 3679 4166 3679 4168 3679 4170 3679 4172 3679 
4175 3679 4177 3679 4179 3679 4181 3679 4184 3679 4186 3679 4188 3679 4190 3679 4193 3679 4195 3679 
4197 3679 4199 3679 4202 3679 4204 3679 4206 3679 4208 3679 4211 3679 4213 3679 4215 3679 4217 3679 
4220 3679 4222 3679 4224 3679 4226 3679 4229 3679 4231 3679 4233 3679 4235 3679 4238 3679 4240 3679 
4242 3679 4244 3679 4247 3679 4249 3679 4251 3679 4253 3678 4256 3678 4258 3678 4260 3678 4262 3678 
4265 3678 4267 3678 4269 3678 4271 3678 4274 3678 4276 3678 4278 3678 4280 3678 4283 3678 4285 3678 
4287 3678 4289 3678 4292 3678 4294 3678 4296 3678 4298 3678 4301 3678 4303 3678 4305 3678 4307 3678 
4310 3678 4312 3678 4314 3678 4316 3678 4319 3678 4321 3678 4323 3678 4325 3678 4328 3678 4330 3678 
4332 3678 4334 3678 4337 3678 4339 3678 4341 3678 4343 3678 4346 3678 4348 3678 4350 3678 4352 3678 
4355 3678 4357 3678 4359 3678 4361 3678 4364 3678 4366 3678 4368 3678 4370 3678 4373 3678 4375 3678 
4377 3678 4379 3678 4382 3678 4384 3678 4386 3678 4388 3678 4391 3678 4393 3678 4395 3678 4397 3678 
4400 3678 4402 3678 4404 3678 4406 3678 4409 3678 4411 3678 4413 3678 4415 3678 4418 3678 4420 3678 
4422 3678 4424 3678 4427 3678 4429 3678 4431 3678 4433 3678 4436 3678 4438 3678 4440 3678 4442 3678 
4445 3678 4447 3678 4449 3678 4451 3678 4454 3678 4456 3678 4458 3678 4460 3678 4463 3678 4465 3678 
4467 3678 4469 3678 4472 3678 4474 3678 4476 3678 4478 3678 4481 3678 4483 3678 4485 3678 4487 3678 
4490 3678 4492 3678 4494 3678 4496 3678 4499 3678 4501 3678 4503 3678 4505 3678 4508 3678 4510 3678 
4512 3678 4514 3678 4517 3678 4519 3678 4521 3678 4523 3678 4526 3678 4528 3678 4530 3678 4532 3678 
4535 3678 4537 3678 4539 3678 4541 3678 4544 3678 4546 3678 4548 3678 4550 3678 4553 3678 4555 3678 
4557 3678 4559 3678 4562 3678 4564 3678 4566 3678 4568 3678 4571 3678 4573 3678 4575 3678 4577 3678 
4580 3678 4582 3678 4584 3678 4586 3678 4589 3678 4591 3678 4593 3678 4595 3678 4598 3678 4600 3678 
4602 3678 4604 3678 4607 3678 4609 3678 4611 3678 4613 3678 4616 3678 4618 3678 4620 3678 4622 3678 
4625 3678 4627 3678 4629 3678 4631 3678 4634 3678 4636 3678 
] dogrey 
 (drawpoly) 432 [0]
[4638 3678 4640 3678 4643 3678 4645 3678 4647 3678 4649 3678 4652 3678 4654 3678 4656 3678 4658 3678 
4661 3678 4663 3678 4665 3678 4667 3679 4670 3679 4672 3679 4674 3679 4676 3679 4679 3679 4681 3679 
4683 3679 4685 3679 4688 3679 4690 3679 4692 3679 4694 3679 4697 3679 4699 3679 4701 3679 4703 3679 
4706 3679 4708 3679 4710 3679 4712 3679 4715 3679 4717 3679 4719 3679 4721 3679 4724 3679 4726 3679 
4728 3679 4730 3679 4733 3679 4735 3679 4737 3679 4739 3679 4742 3679 4744 3679 4746 3679 4748 3679 
4751 3679 4753 3679 4755 3679 4757 3679 4760 3679 4762 3679 4764 3679 4766 3679 4769 3679 4771 3679 
4773 3679 4775 3679 4778 3679 4780 3679 4782 3679 4784 3679 4787 3679 4789 3679 4791 3679 4793 3679 
4796 3679 4798 3679 4800 3679 4802 3679 4805 3679 4807 3679 4809 3679 4811 3679 4814 3679 4816 3679 
4818 3679 4820 3679 4823 3679 4825 3679 4827 3679 4829 3679 4832 3679 4834 3679 4836 3679 4838 3679 
4841 3679 4843 3679 4845 3679 4847 3679 4850 3679 4852 3679 4854 3679 4856 3679 4859 3679 4861 3679 
4863 3679 4865 3679 4868 3679 4870 3679 4872 3679 4874 3679 4877 3679 4879 3679 4881 3679 4883 3679 
4886 3679 4888 3679 4890 3679 4892 3679 4895 3679 4897 3679 4899 3679 4901 3679 4904 3679 4906 3679 
4908 3679 4910 3679 4913 3679 4915 3679 4917 3679 4919 3679 4922 3679 4924 3679 4926 3679 4928 3679 
4931 3679 4933 3679 4935 3679 4937 3679 4940 3679 4942 3679 4944 3679 4946 3680 4949 3680 4951 3680 
4953 3680 4955 3680 4958 3680 4960 3680 4962 3680 4964 3680 4967 3680 4969 3680 4971 3680 4973 3680 
4976 3680 4978 3680 4980 3680 4982 3680 4985 3680 4987 3680 4989 3680 4991 3680 4994 3680 4996 3680 
4998 3680 5000 3680 5003 3680 5005 3680 5007 3680 5009 3680 5012 3680 5014 3680 5016 3680 5018 3680 
5021 3680 5023 3680 5025 3680 5027 3680 5030 3680 5032 3680 5034 3680 5036 3680 5039 3680 5041 3680 
5043 3680 5045 3680 5048 3680 5050 3680 5052 3680 5054 3680 5057 3680 5059 3680 5061 3680 5063 3680 
5066 3680 5068 3680 5070 3680 5072 3680 5075 3680 5077 3680 5079 3680 5081 3680 5084 3680 5086 3680 
5088 3680 5090 3680 5093 3680 5095 3680 5097 3680 5099 3680 5102 3680 5104 3680 5106 3680 5108 3680 
5111 3680 5113 3680 5115 3680 5117 3680 5120 3680 5122 3680 
] dogrey 
 (drawpoly) 114 [0]
[5124 3680 5126 3680 5129 3680 5131 3680 5133 3680 5135 3680 5138 3680 5140 3680 5142 3680 5144 3680 
5147 3680 5149 3680 5151 3681 5153 3681 5156 3681 5158 3681 5160 3681 5162 3681 5165 3681 5167 3681 
5169 3681 5171 3681 5174 3681 5176 3681 5178 3681 5180 3681 5183 3681 5185 3681 5187 3681 5189 3681 
5192 3681 5194 3681 5196 3681 5198 3681 5201 3681 5203 3681 5205 3681 5207 3681 5210 3681 5212 3681 
5214 3681 5216 3681 5219 3681 5221 3681 5223 3681 5225 3681 5228 3681 5230 3681 5232 3681 5234 3681 
5237 3681 5239 3681 5241 3681 5243 3681 5246 3681 5248 3681 5250 3681 
] dogrey 
0 Setcolor
/absolu true def
0 Setcolor
-1 -1 200000 200000 setclipzone
 showpage

 end saved restore 

