// -------------------------------------------------------------------------
// moc - Matlab/Octave Compatibility toolbox
// Copyright (C) 2010-2014  Holger Nahrstaedt
//
// This program is free software; you can redistribute it and/or modify
// it under the terms of the GNU General Public License as published by
// the Free Software Foundation; either version 3 of the License, or
// (at your option) any later version.
//
// This program is distributed in the hope that it will be useful,
// but WITHOUT ANY WARRANTY; without even the implied warranty of
// MERCHANTABILITY or FITNESS FOR A PARTICULAR PURPOSE.  See the
// GNU General Public License for more details.
//
// You should have received a copy of the GNU General Public License
// along with this program; if not, write to the Free Software
// Foundation, Inc., 59 Temple Place, Suite 330, Boston, MA  02111-1307  USA
//-------------------------------------------------------------------------
//
//  <-- NO CHECK ERROR OUTPUT -->
x = rand (10,10);
cc1 = moc_corr (x);
cc2 = moc_corr (x, x);
assert_checktrue(size (cc1) == [10, 10] & size (cc2) == [10, 10]);
assert_checkalmostequal (cc1, cc2, sqrt (%eps));
//test
x = [1:3]';
y = [3:-1:1]';
assert_checkalmostequal (moc_corr (x, y), -1, 5*%eps);
assert_checkalmostequal (moc_corr (x, moc_flipud (y)), 1, 5*%eps);
assert_checkalmostequal (moc_corr ([x, y]), [1 -1; -1 1], 5*%eps);
//test
// x = single ([1:3]');
// y = single ([3:-1:1]');
// assert_checkalmostequal (corr (x, y), single (-1), 5*eps);
// assert_checkalmostequal (corr (x, flipud (y)), single (1), 5*eps);
// assert_checkalmostequal (corr ([x, y]), single ([1 -1; -1 1]), 5*eps);
assert_checkequal (moc_corr (5), 1)
 ans  =
 
  T  
//assert (corr (single (5)), single (1))
