// -------------------------------------------------------------------------
// moc - Matlab/Octave Compatibility toolbox
// Copyright (C) 2010-2014  Holger Nahrstaedt
//
// This program is free software; you can redistribute it and/or modify
// it under the terms of the GNU General Public License as published by
// the Free Software Foundation; either version 3 of the License, or
// (at your option) any later version.
//
// This program is distributed in the hope that it will be useful,
// but WITHOUT ANY WARRANTY; without even the implied warranty of
// MERCHANTABILITY or FITNESS FOR A PARTICULAR PURPOSE.  See the
// GNU General Public License for more details.
//
// You should have received a copy of the GNU General Public License
// along with this program; if not, write to the Free Software
// Foundation, Inc., 59 Temple Place, Suite 330, Boston, MA  02111-1307  USA
//-------------------------------------------------------------------------
//
//  <-- NO CHECK ERROR OUTPUT -->
//
assert_checkequal (moc_prepad ([1,2], 4), [0,0,1,2]);
assert_checkequal (moc_prepad ([1;2], 4), [0;0;1;2]);
//
assert_checkequal (moc_prepad ([1,2], 4, 2), [2,2,1,2]);
assert_checkequal (moc_prepad ([1;2], 4, 2), [2;2;1;2]);
//
assert_checkequal (moc_prepad ([1,2], 2, 2, 1), [2,2;1,2]);
