// =============================================================================
// Scilab ( http://www.scilab.org/ ) - This file is part of Scilab
// Copyright (C) 2013 - Scilab Enterprises - Simon MARCHETTO
//
//  This file is distributed under the same license as the Scilab package.
// =============================================================================
// <-- CLI SHELL MODE -->
// <-- ENGLISH IMPOSED -->
exec(fullfile(MEDGetRootPath(), "tests/unit_tests/testUtils.sci"));
Warning :
The identifier : UMesh_finishInsertingCells
 has been truncated to: UMesh_finishInsertingCel.

Warning :
The identifier : UMesh_finishInsertingCells
 has been truncated to: UMesh_finishInsertingCel.

Warning :
The identifier : createQuad4MeshWithCoords
 has been truncated to: createQuad4MeshWithCoord.

function testCMesh_create()
    mesh = CMesh_New();
    assert_checkequal(CARTESIAN, CMesh_getType(mesh));
endfunction
function testCMesh_name()
    mesh = CMesh_New();
    Mesh_setName(mesh, "mesh1");
    assert_checkequal(Mesh_getName(mesh), "mesh1");
endfunction
function testCMesh_getSpaceDimension()
    mesh = createCMesh3D();
    assert_checkequal(CMesh_getSpaceDimension(mesh), 3);
endfunction
Warning :
The identifier : testCMesh_getSpaceDimension
 has been truncated to: testCMesh_getSpaceDimens.

function testCMesh_getMeshDimension()
    mesh = createCMesh3D();
    assert_checkequal(CMesh_getMeshDimension(mesh), 3);
endfunction
Warning :
The identifier : testCMesh_getMeshDimension
 has been truncated to: testCMesh_getMeshDimensi.

function testCMesh_getNumberOfCells()
    mesh = createCMesh3D();
    assert_checkequal(CMesh_getNumberOfCells(mesh), 27);
endfunction
Warning :
The identifier : testCMesh_getNumberOfCells
 has been truncated to: testCMesh_getNumberOfCel.

function testCMesh_getNumberOfNodes()
    mesh = createCMesh3D();
    assert_checkequal(CMesh_getNumberOfNodes(mesh), 64);
endfunction
Warning :
The identifier : testCMesh_getNumberOfNodes
 has been truncated to: testCMesh_getNumberOfNod.

function testCMesh_getNodeIdsOfCell()
    mesh = createCMesh2D();
    nodeIds = Mesh_getNodeIdsOfCell(mesh, 1);
    assert_checkequal(nodeIds, [1, 2, 6, 5]);
endfunction
Warning :
The identifier : testCMesh_getNodeIdsOfCell
 has been truncated to: testCMesh_getNodeIdsOfCe.

function testCMesh_fillFromAnalyticOnNodes()
    mesh = createCMesh3D();
    fieldOnNodes = Mesh_fillFromAnalytic(mesh, ON_NODES, 1, "x+y/2.0+z/3.0");
    assert_checkequal(DField_getNumberOfComponents(fieldOnNodes), 1);
    assert_checkequal(DField_getNumberOfTuples(fieldOnNodes), 64);
    expectedValues = [-3.; -1.; 0.; 2.; -1.; 1.; 2.; 4.; 0.; 2.; 3.; 5.; 2.; 4.; 5.; 7.; -1.; 1.; 2.; ..
                4.; 1.; 3.; 4.; 6.; 2.; 4.; 5.; 7.; 4.; 6.; 7.; 9.; 0.; 2.; 3.; 5.; 2.; 4.; 5.; ..
                7.; 3.; 5.; 6.; 8.; 5.; 7.; 8.; 10.; 2.; 4.; 5.; ..
                7.; 4.; 6.; 7.; 9.; 5.; 7.; 8.; 10.; 7.; 9.; 10.; 12.];
    darray = DField_getArray(fieldOnNodes);
    checkDArrayValues(darray, expectedValues);
endfunction
Warning :
The identifier : testCMesh_fillFromAnalyticOnNodes
 has been truncated to: testCMesh_fillFromAnalyt.

Warning :
The identifier : DField_getNumberOfComponents
 has been truncated to: DField_getNumberOfCompon.

function testCMesh_fillFromAnalyticOnCells()
    mesh = createCMesh3D();
    fieldOnCells = Mesh_fillFromAnalytic(mesh, ON_CELLS, 1, "x+y/2.0+z/3.0");
    assert_checkequal(DField_getNumberOfComponents(fieldOnCells), 1);
    assert_checkequal(DField_getNumberOfTuples(fieldOnCells), 27);
    expectedValues = [0; 1.5; 3; 1.5; 3; 4.5; 3; 4.5; 6; 1.5; 3; 4.5; 3; 4.5; ..
                6; 4.5; 6; 7.5; 3; 4.5; 6; 4.5; 6; 7.5; 6; 7.5; 9];
    darray = DField_getArray(fieldOnCells);
    checkDArrayValues(darray, expectedValues);
endfunction
Warning :
The identifier : testCMesh_fillFromAnalyticOnCells
 has been truncated to: testCMesh_fillFromAnalyt.

Warning :
The identifier : DField_getNumberOfComponents
 has been truncated to: DField_getNumberOfCompon.

Warning : redefining function: testCMesh_fillFromAnalyt. Use funcprot(0) to avoid this message

testCMesh_create();
testCMesh_name();
testCMesh_getSpaceDimension();
Warning :
The identifier : testCMesh_getSpaceDimension
 has been truncated to: testCMesh_getSpaceDimens.

Warning :
The identifier : testCMesh_getSpaceDimension
 has been truncated to: testCMesh_getSpaceDimens.

testCMesh_getMeshDimension();
Warning :
The identifier : testCMesh_getMeshDimension
 has been truncated to: testCMesh_getMeshDimensi.

Warning :
The identifier : testCMesh_getMeshDimension
 has been truncated to: testCMesh_getMeshDimensi.

testCMesh_getNumberOfCells();
Warning :
The identifier : testCMesh_getNumberOfCells
 has been truncated to: testCMesh_getNumberOfCel.

Warning :
The identifier : testCMesh_getNumberOfCells
 has been truncated to: testCMesh_getNumberOfCel.

testCMesh_getNumberOfNodes();
Warning :
The identifier : testCMesh_getNumberOfNodes
 has been truncated to: testCMesh_getNumberOfNod.

Warning :
The identifier : testCMesh_getNumberOfNodes
 has been truncated to: testCMesh_getNumberOfNod.

testCMesh_fillFromAnalyticOnNodes();
Warning :
The identifier : testCMesh_fillFromAnalyticOnNodes
 has been truncated to: testCMesh_fillFromAnalyt.

Warning :
The identifier : testCMesh_fillFromAnalyticOnNodes
 has been truncated to: testCMesh_fillFromAnalyt.

testCMesh_fillFromAnalyticOnCells();
Warning :
The identifier : testCMesh_fillFromAnalyticOnCells
 has been truncated to: testCMesh_fillFromAnalyt.

Warning :
The identifier : testCMesh_fillFromAnalyticOnCells
 has been truncated to: testCMesh_fillFromAnalyt.

testCMesh_getNodeIdsOfCell();
Warning :
The identifier : testCMesh_getNodeIdsOfCell
 has been truncated to: testCMesh_getNodeIdsOfCe.

Warning :
The identifier : testCMesh_getNodeIdsOfCell
 has been truncated to: testCMesh_getNodeIdsOfCe.

