// Copyright (C) 2008-2009 - INRIA - Michael Baudin
// Copyright (C) 2009-2011 - DIGITEO - Michael Baudin
//
// This file must be used under the terms of the GNU LGPL license.
// 
// <-- JVM NOT MANDATORY -->
// <-- ENGLISH IMPOSED -->
//
// Check the Fast Faure sequence in dimension 3
//
lds = lowdisc_new("faure");
lds = lowdisc_configure(lds,"-dimension",3);
// Term #1
[lds,computed] = lowdisc_next (lds);
expected = [1/3 1/3 1/3];
assert_checkalmostequal ( computed, expected, %eps );
// Terms #2 to #6
[lds,computed]=lowdisc_next(lds,7);
expected= [
    2/3 2/3 2/3 
    1/9 4/9 7/9 
    4/9 7/9 1/9 
    7/9 1/9 4/9 
    2/9 8/9 5/9 
    5/9 2/9 8/9 
    8/9 5/9 2/9
];
assert_checkalmostequal ( computed, expected, %eps );
lds = lowdisc_destroy(lds);
//
// Compare the results against the data extracted from the TOMS 647 program.
//
lds = lowdisc_new("faure");
lds = lowdisc_configure(lds,"-dimension",3);
// Skip qs^4 - 1 terms, as in TOMS implementation
qs = lowdisc_get ( lds , "-faureprime" );
lds = lowdisc_configure(lds,"-skip", qs^4 - 2);
[lds,computed]=lowdisc_next(lds,100);
expected = [
0.987654      0.765432      0.209877
0.004115      0.460905      0.584362
0.337449      0.794239      0.917696
0.670782      0.127572      0.251029
0.115226      0.905350      0.028807
0.448560      0.238683      0.362140
0.781893      0.572016      0.695473
0.226337      0.016461      0.806584
0.559671      0.349794      0.139918
0.893004      0.683128      0.473251
0.041152      0.720165      0.732510
0.374486      0.053498      0.065844
0.707819      0.386831      0.399177
0.152263      0.164609      0.510288
0.485597      0.497942      0.843621
0.818930      0.831276      0.176955
0.263375      0.609053      0.288066
0.596708      0.942387      0.621399
0.930041      0.275720      0.954733
0.078189      0.312757      0.213992
0.411523      0.646091      0.547325
0.744856      0.979424      0.880658
0.189300      0.423868      0.991770
0.522634      0.757202      0.325103
0.855967      0.090535      0.658436
0.300412      0.868313      0.436214
0.633745      0.201646      0.769547
0.967078      0.534979      0.102881
0.016461      0.806584      0.226337
0.349794      0.139918      0.559671
0.683128      0.473251      0.893004
0.127572      0.251029      0.670782
0.460905      0.584362      0.004115
0.794239      0.917696      0.337449
0.238683      0.362140      0.448560
0.572016      0.695473      0.781893
0.905350      0.028807      0.115226
0.053498      0.065844      0.374486
0.386831      0.399177      0.707819
0.720165      0.732510      0.041152
0.164609      0.510288      0.152263
0.497942      0.843621      0.485597
0.831276      0.176955      0.818930
0.275720      0.954733      0.930041
0.609054      0.288066      0.263375
0.942387      0.621399      0.596708
0.090535      0.658436      0.855967
0.423868      0.991770      0.189300
0.757202      0.325103      0.522634
0.201646      0.769547      0.633745
0.534979      0.102881      0.967078
0.868313      0.436214      0.300412
0.312757      0.213992      0.078189
0.646091      0.547325      0.411523
0.979424      0.880658      0.744856
0.028807      0.115226      0.905350
0.362140      0.448560      0.238683
0.695473      0.781893      0.572016
0.139918      0.559671      0.349794
0.473251      0.893004      0.683128
0.806584      0.226337      0.016461
0.251029      0.670782      0.127572
0.584362      0.004115      0.460905
0.917695      0.337449      0.794239
0.065844      0.374486      0.053498
0.399177      0.707819      0.386831
0.732510      0.041152      0.720165
0.176955      0.818930      0.831276
0.510288      0.152263      0.164609
0.843621      0.485597      0.497942
0.288066      0.263375      0.609053
0.621399      0.596708      0.942387
0.954733      0.930041      0.275720
0.102881      0.967078      0.534979
0.436214      0.300412      0.868313
0.769547      0.633745      0.201646
0.213992      0.078189      0.312757
0.547325      0.411523      0.646091
0.880659      0.744856      0.979424
0.325103      0.522634      0.757202
0.658436      0.855967      0.090535
0.991770      0.189300      0.423868
0.008230      0.921811      0.798354
0.341564      0.255144      0.131687
0.674897      0.588477      0.465021
0.119342      0.032922      0.576132
0.452675      0.366255      0.909465
0.786008      0.699588      0.242798
0.230453      0.477366      0.020576
0.563786      0.810700      0.353909
0.897119      0.144033      0.687243
0.045267      0.181070      0.279835
0.378601      0.514403      0.613169
0.711934      0.847737      0.946502
0.156379      0.625514      0.724280
0.489712      0.958848      0.057613
0.823045      0.292181      0.390947
0.267490      0.736625      0.502058
0.600823      0.069959      0.835391
0.934156      0.403292      0.168724
];
assert_checkalmostequal ( computed , expected , [], 1.e-5 );
lds = lowdisc_destroy(lds);
//
// Compare the results against the data extracted from the TOMS 647 program.
//
lds = lowdisc_new("faure");
lds = lowdisc_configure(lds,"-dimension",4);
// Skip qs^4 - 1 terms, as in TOMS implementation
qs = lowdisc_get ( lds , "-faureprime" );
lds = lowdisc_configure(lds,"-skip", qs^4 - 2);
[lds,computed]=lowdisc_next(lds,100);
expected = [
0.998400      0.374400      0.150400      0.046400
0.000320      0.374720      0.317120      0.355520
0.200320      0.574720      0.517120      0.555520
0.400320      0.774720      0.717120      0.755520
0.600320      0.974720      0.917120      0.955520
0.800320      0.174720      0.117120      0.155520
0.040320      0.414720      0.757120      0.995520
0.240320      0.614720      0.957120      0.195520
0.440320      0.814720      0.157120      0.395520
0.640320      0.014720      0.357120      0.595520
0.840320      0.214720      0.557120      0.795520
0.080320      0.654720      0.197120      0.435520
0.280320      0.854720      0.397120      0.635520
0.480320      0.054720      0.597120      0.835520
0.680320      0.254720      0.797120      0.035520
0.880320      0.454720      0.997120      0.235520
0.120320      0.894720      0.437120      0.075520
0.320320      0.094720      0.637120      0.275520
0.520320      0.294720      0.837120      0.475520
0.720320      0.494720      0.037120      0.675520
0.920320      0.694720      0.237120      0.875520
0.160320      0.134720      0.877120      0.715520
0.360320      0.334720      0.077120      0.915520
0.560320      0.534720      0.277120      0.115520
0.760320      0.734720      0.477120      0.315520
0.960320      0.934720      0.677120      0.515520
0.008320      0.462720      0.045120      0.163520
0.208320      0.662720      0.245120      0.363520
0.408320      0.862720      0.445120      0.563520
0.608320      0.062720      0.645120      0.763520
0.808320      0.262720      0.845120      0.963520
0.048320      0.702720      0.485120      0.603520
0.248320      0.902720      0.685120      0.803520
0.448320      0.102720      0.885120      0.003520
0.648320      0.302720      0.085120      0.203520
0.848320      0.502720      0.285120      0.403520
0.088320      0.942720      0.925120      0.243520
0.288320      0.142720      0.125120      0.443520
0.488320      0.342720      0.325120      0.643520
0.688320      0.542720      0.525120      0.843520
0.888320      0.742720      0.725120      0.043520
0.128320      0.182720      0.365120      0.883520
0.328320      0.382720      0.565120      0.083520
0.528320      0.582720      0.765120      0.283520
0.728320      0.782720      0.965120      0.483520
0.928320      0.982720      0.165120      0.683520
0.168320      0.222720      0.605120      0.523520
0.368320      0.422720      0.805120      0.723520
0.568320      0.622720      0.005120      0.923520
0.768320      0.822720      0.205120      0.123520
0.968320      0.022720      0.405120      0.323520
0.016320      0.750720      0.813120      0.811520
0.216320      0.950720      0.013120      0.011520
0.416320      0.150720      0.213120      0.211520
0.616320      0.350720      0.413120      0.411520
0.816320      0.550720      0.613120      0.611520
0.056320      0.990720      0.253120      0.451520
0.256320      0.190720      0.453120      0.651520
0.456320      0.390720      0.653120      0.851520
0.656320      0.590720      0.853120      0.051520
0.856320      0.790720      0.053120      0.251520
0.096320      0.030720      0.693120      0.091520
0.296320      0.230720      0.893120      0.291520
0.496320      0.430720      0.093120      0.491520
0.696320      0.630720      0.293120      0.691520
0.896320      0.830720      0.493120      0.891520
0.136320      0.270720      0.133120      0.731520
0.336320      0.470720      0.333120      0.931520
0.536320      0.670720      0.533120      0.131520
0.736320      0.870720      0.733120      0.331520
0.936320      0.070720      0.933120      0.531520
0.176320      0.510720      0.573120      0.371520
0.376320      0.710720      0.773120      0.571520
0.576320      0.910720      0.973120      0.771520
0.776320      0.110720      0.173120      0.971520
0.976320      0.310720      0.373120      0.171520
0.024320      0.838720      0.781120      0.659520
0.224320      0.038720      0.981120      0.859520
0.424320      0.238720      0.181120      0.059520
0.624320      0.438720      0.381120      0.259520
0.824320      0.638720      0.581120      0.459520
0.064320      0.078720      0.021120      0.299520
0.264320      0.278720      0.221120      0.499520
0.464320      0.478720      0.421120      0.699520
0.664320      0.678720      0.621120      0.899520
0.864320      0.878720      0.821120      0.099520
0.104320      0.318720      0.461120      0.939520
0.304320      0.518720      0.661120      0.139520
0.504320      0.718720      0.861120      0.339520
0.704320      0.918720      0.061120      0.539520
0.904320      0.118720      0.261120      0.739520
0.144320      0.558720      0.901120      0.579520
0.344320      0.758720      0.101120      0.779520
0.544320      0.958720      0.301120      0.979520
0.744320      0.158720      0.501120      0.179520
0.944320      0.358720      0.701120      0.379520
0.184320      0.798720      0.341120      0.019520
0.384320      0.998720      0.541120      0.219520
0.584320      0.198720      0.741120      0.419520
0.784320      0.398720      0.941120      0.619520
];
assert_checkalmostequal ( computed , expected , [], 1.e-5 );
lds = lowdisc_destroy(lds);
// Configure a list of primes and use it
lds = lowdisc_new("faure");
prarray = number_primes1000 ( );
primtable = prarray';
primtable = primtable(:);
lds = lowdisc_configure(lds,"-primeslist",primtable);
lds = lowdisc_configure(lds,"-dimension",150);
[lds,next] = lowdisc_next ( lds , 10 );
assert_checkequal ( size(next) , [10 150] );
lds = lowdisc_destroy(lds);
// Testing skip
lds = lowdisc_new("faure");
lds = lowdisc_configure(lds,"-dimension",3);
lds = lowdisc_configure(lds,"-skip",10);
[lds,computed] = lowdisc_next ( lds , 10 );
expected = [
    0.7037037    0.2592593    0.1481481  
    0.1481481    0.7037037    0.2592593  
    0.4814815    0.0370370    0.5925926  
    0.8148148    0.3703704    0.9259259  
    0.2592593    0.1481481    0.7037037  
    0.5925926    0.4814815    0.0370370  
    0.9259259    0.8148148    0.3703704  
    0.0740741    0.8518519    0.9629630  
    0.4074074    0.1851852    0.2962963  
    0.7407407    0.5185185    0.6296296  
];
assert_checkalmostequal ( computed , expected , [], 1.e-5 );
index = lowdisc_get ( lds , "-index" );
assert_checkequal ( index , 20 );
lds = lowdisc_destroy(lds);
// Testing leap
lds = lowdisc_new("faure");
lds = lowdisc_configure(lds,"-dimension",3);
lds = lowdisc_configure(lds,"-leap",1);
index = lowdisc_get ( lds , "-index" );
assert_checkequal ( index , 0 );
[lds,computed] = lowdisc_next ( lds , 10 );
expected = [
    0.3333333    0.3333333    0.3333333  
    0.1111111    0.4444444    0.7777778  
    0.7777778    0.1111111    0.4444444  
    0.5555556    0.2222222    0.8888889  
    0.0370370    0.5925926    0.4814815  
    0.7037037    0.2592593    0.1481481  
    0.4814815    0.0370370    0.5925926  
    0.2592593    0.1481481    0.7037037  
    0.9259259    0.8148148    0.3703704  
    0.4074074    0.1851852    0.2962963  
];
assert_checkalmostequal ( computed , expected , [], 1.e-5 );
index = lowdisc_get ( lds , "-index" );
assert_checkequal ( index , 20 );
lds = lowdisc_destroy(lds);
// Check performance for large values of skip
t1 = timer();
lds = lowdisc_new("faure");
lds = lowdisc_configure(lds,"-dimension",4);
lds = lowdisc_configure(lds,"-skip", 1.e7);
[lds,computed]=lowdisc_next(lds,10);
lds = lowdisc_destroy(lds);
t2 = timer();
assert_checkequal ( (t2-t1)<1. , %t );
// Check performance for large values of leap
t1 = timer();
lds = lowdisc_new("faure");
lds = lowdisc_configure(lds,"-dimension",4);
lds = lowdisc_configure(lds,"-leap", 1.e7);
[lds,computed]=lowdisc_next(lds,10);
lds = lowdisc_destroy(lds);
t2 = timer();
assert_checkequal ( (t2-t1)<1. , %t );
