iflag=2
atmost=1073741823
dimen=3
maxd=30
quasi(1)= 0.220440 0.007543 0.880090
quasi(2)= 0.720440 0.507543 0.380090
quasi(3)= 0.970440 0.257543 0.130090
quasi(4)= 0.470440 0.757543 0.630090
quasi(5)= 0.595440 0.132543 0.505090
quasi(6)= 0.095440 0.632543 0.005090
quasi(7)= 0.345440 0.382543 0.255090
quasi(8)= 0.845440 0.882543 0.755090
quasi(9)= 0.407940 0.195043 0.067590
quasi(10)= 0.907940 0.695043 0.567590
quasi(11)= 0.657940 0.445043 0.817590
quasi(12)= 0.157940 0.945043 0.317590
quasi(13)= 0.782940 0.070043 0.442590
quasi(14)= 0.282940 0.570043 0.942590
quasi(15)= 0.032940 0.320043 0.692590
quasi(16)= 0.532940 0.820043 0.192590
quasi(17)= 0.689190 0.038793 0.036340
quasi(18)= 0.189190 0.538793 0.536340
quasi(19)= 0.439190 0.288793 0.786340
quasi(20)= 0.939190 0.788793 0.286340
quasi(21)= 0.064190 0.163793 0.411340
quasi(22)= 0.564190 0.663793 0.911340
quasi(23)= 0.814190 0.413793 0.661340
quasi(24)= 0.314190 0.913793 0.161340
quasi(25)= 0.876690 0.226293 0.973840
quasi(26)= 0.376690 0.726293 0.473840
quasi(27)= 0.126690 0.476293 0.223840
quasi(28)= 0.626690 0.976293 0.723840
quasi(29)= 0.251690 0.101293 0.598840
quasi(30)= 0.751690 0.601293 0.098840
quasi(31)= 0.501690 0.351293 0.348840
quasi(32)= 0.001690 0.851293 0.848840
quasi(33)= 0.454815 0.523168 0.239465
quasi(34)= 0.954815 0.023168 0.739465
quasi(35)= 0.704815 0.773168 0.989465
quasi(36)= 0.204815 0.273168 0.489465
quasi(37)= 0.829815 0.648168 0.364465
quasi(38)= 0.329815 0.148168 0.864465
quasi(39)= 0.079815 0.898168 0.614465
quasi(40)= 0.579815 0.398168 0.114465
quasi(41)= 0.142315 0.710668 0.801965
quasi(42)= 0.642315 0.210668 0.301965
quasi(43)= 0.892315 0.960668 0.051965
quasi(44)= 0.392315 0.460668 0.551965
quasi(45)= 0.517315 0.585668 0.676965
quasi(46)= 0.017315 0.085668 0.176965
quasi(47)= 0.267315 0.835668 0.426965
quasi(48)= 0.767315 0.335668 0.926965
quasi(49)= 0.986065 0.554418 0.833215
quasi(50)= 0.486065 0.054418 0.333215
