// Copyright (C) 2011 - Michael Baudin
// Copyright (C) 2010 - DIGITEO - Michael Baudin
//
// This file must be used under the terms of the GNU LGPL license.
// <-- JVM NOT MANDATORY -->
// <-- ENGLISH IMPOSED -->
// Get expectation for Sum test case
nprob = 1;
[n,p]=intprb_getsetup(nprob);
e = intprb_getexpect(n,p,nprob);
assert_checkequal ( e , 0 );
