// Copyright (C) 2005 - INRIA - Sage Group (IRISA)
// Copyright (C) 2011 - DIGITEO - Michael Baudin
//
// This file must be used under the terms of the CeCILL.
// This source file is licensed as described in the file COPYING, which
// you should have received as part of this distribution.  The terms
// are also available at
// http://www.cecill.info/licences/Licence_CeCILL_V2-en.txt
// <-- CLI SHELL MODE -->
// <-- ENGLISH IMPOSED -->
n=110 ;
A=imsls_nonsym(-10,-1,n);
assert_checkequal(size(A),[110 110]);
assert_checkfalse(and(A==A'));
