// This file is released under the 3-clause BSD license. See COPYING-BSD.
//=================================
//=================================
if scilab_prod(3,5) <> 15 then bugmes();quit;end
//=================================
