<?xml version="1.0" encoding="UTF-8" standalone="no"?>
<!-- Created with Inkscape (http://www.inkscape.org/) -->

<svg
   xmlns:dc="http://purl.org/dc/elements/1.1/"
   xmlns:cc="http://creativecommons.org/ns#"
   xmlns:rdf="http://www.w3.org/1999/02/22-rdf-syntax-ns#"
   xmlns:svg="http://www.w3.org/2000/svg"
   xmlns="http://www.w3.org/2000/svg"
   xmlns:sodipodi="http://sodipodi.sourceforge.net/DTD/sodipodi-0.dtd"
   xmlns:inkscape="http://www.inkscape.org/namespaces/inkscape"
   id="svg11300"
   height="48px"
   width="48px"
   version="1.1"
   inkscape:version="0.47 r22583"
   sodipodi:docname="DSB_f.svg">
  <defs
     id="defs3032">
    <inkscape:perspective
       sodipodi:type="inkscape:persp3d"
       inkscape:vp_x="-40.917834 : 25.653756 : 1"
       inkscape:vp_y="226.84197 : -3254.1166 : 0"
       inkscape:vp_z="-11.181294 : 24.073017 : 1"
       inkscape:persp3d-origin="5.1848819 : 73.322549 : 1"
       id="perspective2828" />
    <inkscape:perspective
       id="perspective3424"
       inkscape:persp3d-origin="0.5 : 0.33333333 : 1"
       inkscape:vp_z="1 : 0.5 : 1"
       inkscape:vp_y="0 : 1000 : 0"
       inkscape:vp_x="0 : 0.5 : 1"
       sodipodi:type="inkscape:persp3d" />
    <inkscape:perspective
       id="perspective4649"
       inkscape:persp3d-origin="0.5 : 0.33333333 : 1"
       inkscape:vp_z="1 : 0.5 : 1"
       inkscape:vp_y="0 : 1000 : 0"
       inkscape:vp_x="0 : 0.5 : 1"
       sodipodi:type="inkscape:persp3d" />
  </defs>
  <sodipodi:namedview
     pagecolor="#ffffff"
     bordercolor="#666666"
     borderopacity="1"
     objecttolerance="10"
     gridtolerance="10"
     guidetolerance="10"
     inkscape:pageopacity="0"
     inkscape:pageshadow="2"
     inkscape:window-width="1024"
     inkscape:window-height="710"
     id="namedview3030"
     showgrid="false"
     inkscape:zoom="5.0833333"
     inkscape:cx="24"
     inkscape:cy="37.521787"
     inkscape:window-x="-4"
     inkscape:window-y="-4"
     inkscape:window-maximized="1"
     inkscape:current-layer="layer1" />
  <title
     id="title3289">base scilan</title>
  <metadata
     id="metadata4">
    <rdf:RDF>
      <cc:Work
         rdf:about="">
        <dc:format>image/svg+xml</dc:format>
        <dc:type
           rdf:resource="http://purl.org/dc/dcmitype/StillImage" />
        <dc:creator>
          <cc:Agent>
            <dc:title>Mathieu Drouet / Take a sip</dc:title>
          </cc:Agent>
        </dc:creator>
        <dc:source>http://www.takeasip.net/</dc:source>
        <cc:license
           rdf:resource="http://creativecommons.org/licenses/publicdomain/" />
        <dc:title>base scilan</dc:title>
      </cc:Work>
      <cc:License
         rdf:about="http://creativecommons.org/licenses/publicdomain/">
        <cc:permits
           rdf:resource="http://creativecommons.org/ns#Reproduction" />
        <cc:permits
           rdf:resource="http://creativecommons.org/ns#Distribution" />
        <cc:permits
           rdf:resource="http://creativecommons.org/ns#DerivativeWorks" />
      </cc:License>
    </rdf:RDF>
  </metadata>
  <g
     id="layer1">
    <text
       xml:space="preserve"
       style="font-size:20;font-style:normal;font-weight:normal;fill:#000000;fill-opacity:1;stroke:none;font-family:Bitstream Vera Sans"
       x="7.6721311"
       y="30.295082"
       id="text2830"><tspan
         sodipodi:role="line"
         id="tspan2832"
         x="7.6721311"
         y="30.295082" /></text>
    <text
       xml:space="preserve"
       style="font-size:16px;font-style:normal;font-weight:normal;fill:#000000;fill-opacity:1;stroke:none;font-family:Bitstream Vera Sans"
       x="0.32786816"
       y="16.459019"
       id="text2834"><tspan
         sodipodi:role="line"
         id="tspan2836"
         x="0.32786816"
         y="16.459019">DSB_f</tspan></text>
    <rect
       style="fill:#e6e6e6"
       id="rect4624"
       width="30.295082"
       height="22.819672"
       x="8.2622948"
       y="22.426229" />
    <g
       transform="matrix(0.780135,0,0,0.72761664,7.807136,18.949559)"
       id="layer1-7">
      <path
         style="fill:none;stroke:#000000;stroke-width:2px;stroke-linecap:round;stroke-linejoin:round"
         d="m 4,33 h 8 v -8 h 8 v -8 h 8 V 9 h 8"
         id="path3406" />
    </g>
    <path
       style="fill:#008000"
       d="m 10.632787,43.502502 c -0.352614,-0.142282 -0.303781,-0.985739 0.06527,-1.127357 0.171145,-0.06567 1.543276,-0.119407 3.049181,-0.119407 l 2.738009,0 0,-2.616394 c 0,-1.772677 0.07613,-2.692518 0.236065,-2.852459 0.16234,-0.162339 1.145356,-0.236065 3.147541,-0.236065 l 2.911476,0 0,-2.714754 c 0,-1.849181 0.07527,-2.790022 0.236065,-2.95082 0.16234,-0.162339 1.145356,-0.236066 3.147541,-0.236066 l 2.911476,0 0,-2.747177 c 0,-2.514717 0.0322,-2.764408 0.38051,-2.950819 0.215331,-0.115242 1.703664,-0.203643 3.428571,-0.203643 2.508671,0 3.102767,0.05471 3.357195,0.309133 0.371022,0.371023 0.384175,0.520744 0.07307,0.831851 -0.16234,0.162339 -1.145355,0.236065 -3.147541,0.236065 l -2.911475,0 0,2.747177 c 0,2.514718 -0.0322,2.764409 -0.38051,2.95082 -0.20928,0.112003 -1.581412,0.203643 -3.049181,0.203643 l -2.66867,0 0,2.471949 c 0,1.359572 -0.09164,2.643178 -0.203643,2.852459 -0.187408,0.350175 -0.43833,0.38051 -3.147541,0.38051 l -2.943898,0 0,2.641686 c 0,2.139238 -0.0588,2.700483 -0.309134,2.950819 -0.256951,0.256952 -0.846374,0.306513 -3.491803,0.293603 -1.750468,-0.0085 -3.293325,-0.06018 -3.428571,-0.114754 z"
       id="path4670" />
  </g>
</svg>
