<GASystemModel xmlns="http://www.geneauto.org/GASystemModel" 
        xmlns:gadt="http://www.geneauto.org/GADataType" 
        xmlns:gaxml="http://www.geneauto.org/GAXML" 
        lastSavedBy="Xcos - " 
        lastSavedOn="2012-1-16 7:23:36.999995" 
        modelName="ABS" modelType="GASystemModel" 
        modelVersion="6.3" 
        type="gaxml:model"> 
  <TransformationHistory type="gaxml:history"> 
    <Transformation readTime="2012-1-16 7:23:36.999995" toolName="Scicos" writeTime="2012-1-16 7:23:36.999995"/> 
  </TransformationHistory> 
  
  <SystemBlock directFeedThrough="true" id="1" isVirtual="false" name="ABS" type="SubSystem"> 
    <blocks type="gaxml:collection">
       <SourceBlock directFeedThrough="true" id="2" isVirtual="false" name="B1" sampletime ="-1" type="Constant">
            
            <outDataPorts type="gaxml:collection">
                <OutDataPort id="11" portNumber="1"/>
            </outDataPorts>
            
            <parameters type="gaxml:collection">
                <BlockParameter id="3" name="Value">
                    <value type="gaxml:object">
                        <ExpressionValue id="4">
                            <value type="gaxml:object">
                                <RealExpression   exponent="0" fractionalPart="0" id="5" integerPart="-1" litValue="-1" scientificValue="false" >
                                    <dataType type="gaxml:object">
                                        <TRealDouble id="6" />
                                    </dataType>
                                </RealExpression>
                            </value>
                        </ExpressionValue>
                    </value>
                </BlockParameter>
                <BlockParameter id="7" name="OutDataTypeMode">
                    <value type="gaxml:object">
                        <StringValue id="8" value="Inherit from &apos;Constant value&apos;"/>
                    </value>
                </BlockParameter>
                <BlockParameter id="9" name="VectorParams1D">
                    <value type="gaxml:object">
                        <StringValue id="10" value="off"/>
                    </value>
                </BlockParameter>
            </parameters> 
            <diagramInfo type="gaxml:object">
                <DiagramInfo positionX="205" positionY="360" sizeX="-115" sizeY="40"/>
            </diagramInfo>
       </SourceBlock>
       <CombinatorialBlock directFeedThrough="true" id="12" isVirtual="false" name="B2" sampletime ="-1" type="Abs">
            <inDataPorts type="gaxml:collection">
                <InDataPort id="17" portNumber="1" relatedToInportBlock="true"/>
            </inDataPorts>
            <outDataPorts type="gaxml:collection">
                <OutDataPort id="18" portNumber="1"/>
            </outDataPorts>
            
            <parameters type="gaxml:collection">
                <BlockParameter id="13" name="Value">
                    <value type="gaxml:object">
                        <ExpressionValue id="14">
                            <value type="gaxml:object">
                                <RealExpression   exponent="0" fractionalPart="0" id="15" integerPart="1" litValue="1" scientificValue="false" >
                                    <dataType type="gaxml:object">
                                        <TRealDouble id="16" />
                                    </dataType>
                                </RealExpression>
                            </value>
                        </ExpressionValue>
                    </value>
                </BlockParameter>
            </parameters> 
            <diagramInfo type="gaxml:object">
                <DiagramInfo positionX="306" positionY="360" sizeX="-14" sizeY="40"/>
            </diagramInfo>
       </CombinatorialBlock>
       <SinkBlock directFeedThrough="true" id="19" isVirtual="false" name="B3" sampletime ="-1" type="Outport">
            <inDataPorts type="gaxml:collection">
                <InDataPort id="32" portNumber="1" relatedToInportBlock="true"/>
            </inDataPorts>
            
            
            <parameters type="gaxml:collection">
                <BlockParameter id="20" name="DataType">
                    <value type="gaxml:object">
                        <StringValue id="21" value="auto"/>
                    </value>
                </BlockParameter>
                <BlockParameter id="22" name="InitialOutput">
                    <value type="gaxml:object">
                        <ExpressionValue id="23"/>
                    </value>
                </BlockParameter>
                <BlockParameter id="24" name="PortDimensions">
                    <value type="gaxml:object">
                        <ExpressionValue id="25">
                            <value type="gaxml:object">
                                <IntegerExpression hexValue="false" id="26" integerPart="1" isNegative="true"  litValue="-1">
                                    <dataType type="gaxml:object">
                                        <TRealInteger id="27" nBits="8" signed="true"/>
                                    </dataType>
                                </IntegerExpression>
                            </value>
                        </ExpressionValue>
                    </value>
                </BlockParameter>
                <BlockParameter id="28" name="OutputWhenDisabled">
                    <value type="gaxml:object">
                        <StringValue id="29" value="held"/>
                    </value>
                </BlockParameter>
                <BlockParameter id="30" name="Port">
                    <value type="gaxml:object">
                        <StringValue id="31" value="1"/>
                    </value>
                </BlockParameter>
            </parameters> 
            <diagramInfo type="gaxml:object">
                <DiagramInfo positionX="374" positionY="380" sizeX="14" sizeY="20"/>
            </diagramInfo>
       </SinkBlock>
    </blocks>
    <signals type="gaxml:collection">
       <Signal id="33">
            <srcPort type="gaxml:pointer">11</srcPort>
            <dstPort type="gaxml:pointer">17</dstPort>
       </Signal>
       <Signal id="34">
            <srcPort type="gaxml:pointer">18</srcPort>
            <dstPort type="gaxml:pointer">32</dstPort>
       </Signal>
    </signals>
    <diagramInfo type="gaxml:object">
      <DiagramInfo positionX="0" positionY="0"/>
    </diagramInfo>
    
  </SystemBlock>
</GASystemModel>
