<?xml version="1.0" encoding="utf-8"?>
<!-- Generator: Adobe Illustrator 14.0.0, SVG Export Plug-In . SVG Version: 6.00 Build 43363)  -->
<!DOCTYPE svg PUBLIC "-//W3C//DTD SVG 1.1//EN" "http://www.w3.org/Graphics/SVG/1.1/DTD/svg11.dtd">
<svg version="1.1" id="Calque_1" xmlns="http://www.w3.org/2000/svg" xmlns:xlink="http://www.w3.org/1999/xlink" x="0px" y="0px"
	 width="40px" height="40px" viewBox="0 0 40 40" enable-background="new 0 0 40 40" xml:space="preserve">
<path fill="none" stroke="#005192" stroke-width="2" stroke-linecap="round" d="M15,36.438h10 M10,26.438h20 M2.5,16.438h35"/>
<path fill="none" stroke="#005192" stroke-width="2" stroke-linecap="round" d="M20,7.185v8.504"/>
<path fill="none" stroke="#005192" stroke-width="2" stroke-linecap="round" d="M40.129,6.969H20"/>
</svg>
