# Copyright (C) 2008 - 2010 - Michael Baudin
#
# This file must be used under the terms of the CeCILL.
# This source file is licensed as described in the file COPYING, which
# you should have received as part of this distribution.  The terms
# are also available at
# http:#www.cecill.info/licences/Licence_CeCILL_V2-en.txt
#
# A dataset containing the floating point representation of IEEE singles
#
# [x M e m s hex]
#
+1                         , +8388608  ,    0  , 1                        ,  0 , 3F800000
-1                         , -8388608  ,    0  , 1                        ,  1 , BF800000
+2                         , +8388608  ,    1  , 1                        ,  0 , 40000000
-2                         , -8388608  ,    1  , 1                        ,  1 , C0000000
3.333333432674407959D-01   ,  11184811 ,   -2  , 1.3333333730697631835938 ,  0 , 3EAAAAAB
8.816207631167156310D-39   ,  6291456  , -126  , 0.75                     ,  0 , 00600000
 2047.9998779296875        ,  16777215 ,   10  , 1.999999880790710449     ,  0 , 44FFFFFF
-2047.9998779296875        , -16777215 ,   10  , 1.999999880790710449     ,  1 , C4FFFFFF
 1024                      ,  8388608  ,   10  , 1                        ,  0 , 44800000
-1024                      , -8388608  ,   10  , 1                        ,  1 , C4800000
+0                         , +0        , -126  , 0                        ,  0 , 00000000
-0                         , -0        , -126  , 0                        ,  1 , 80000000
%nan                       ,  16777215 ,  128  , 1.999999880790710449     ,  0 , 7FFFFFFF
+%inf                      , +0        ,  128  , 0                        ,  0 , 7F800000
-%inf                      , -0        ,  128  , 0                        ,  1 , FF800000
 3.402823466385288598D+38  ,  16777215 ,  127  , 1.999999880790710449     ,  0 , 7F7FFFFF
-3.402823466385288598D+38  , -16777215 ,  127  , 1.999999880790710449     ,  1 , FF7FFFFF
 1.175494350822287508D-38  ,  8388608  , -126  , 1                        ,  0 , 00800000
-1.175494350822287508D-38  , -8388608  , -126  , 1                        ,  1 , 80800000
 1.175494210692441075D-38  ,  8388607  , -126  , 9.999998807907104492D-01 ,  0 , 007FFFFF
-1.175494210692441075D-38  , -8388607  , -126  , 9.999998807907104492D-01 ,  1 , 807FFFFF
 1.401298464324817071D-45  ,  1        , -126  , 1.192092895507812500D-07 ,  0 , 00000001
-1.401298464324817071D-45  , -1        , -126  , 1.192092895507812500D-07 ,  1 , 80000001

