//   This file is part of Epfs.
//    Epfs is free software: you can redistribute it and/or modify
//    it under the terms of the GNU General Public License as published by
//    the Free Software Foundation, either version 3 of the License, or
//    (at your option) any later version.
//    Epfs is distributed in the hope that it will be useful,
//    but WITHOUT ANY WARRANTY; without even the implied warranty of
//    MERCHANTABILITY or FITNESS FOR A PARTICULAR PURPOSE.  See the
//    GNU General Public License for more details.
//    You should have received a copy of the GNU General Public License
//    along with Epfs. If not, see <http://www.gnu.org/licenses/>.
//    Copyright (c) 2010, Baozeng Ding.
// import a module named 'py_dict'
import py_dict;
// test single double matrix
x = 3;
m = tlist(['test', 'a'], x);
n = py_dict.F(m);
if unwrap(n) <> m then bugmes();quit;end;
remove(n);
// test one row matrix
x = [3,4,5,6,7,8];
m = tlist(['test', 'a'], x);
n = py_dict.F(m);
if unwrap(n) <> m then bugmes();quit;end;
remove(n);
// test matrix
x = rand(100,100);
m = tlist(['test', 'a'], x);
n = py_dict.F(m);
if unwrap(n) <> m then bugmes();quit;end;
remove(n);
// test single complex matrix
x = 3+4*%i;
m = tlist(['test', 'a'], x);
n = py_dict.F(m);
if unwrap(n) <> m then bugmes();quit;end;
remove(n);
// test one row complex matrix
x = [1+2*%i, 3+4*%i];
m = tlist(['test', 'a'], x);
n = py_dict.F(m);
if unwrap(n) <> m then bugmes();quit;end;
remove(n);
// test complex matrix
x = [1+11*%i, 2+222*%i, 3+333*%i ; 4+444*%i , 5+55*%i, 6+66*%i];
m = tlist(['test', 'a'], x);
n = py_dict.F(m);
if unwrap(n) <> m then bugmes();quit;end;
remove(n);
