//   This file is part of Epfs.
//    Epfs is free software: you can redistribute it and/or modify
//    it under the terms of the GNU General Public License as published by
//    the Free Software Foundation, either version 3 of the License, or
//    (at your option) any later version.
//    Epfs is distributed in the hope that it will be useful,
//    but WITHOUT ANY WARRANTY; without even the implied warranty of
//    MERCHANTABILITY or FITNESS FOR A PARTICULAR PURPOSE.  See the
//    GNU General Public License for more details.
//    You should have received a copy of the GNU General Public License
//    along with Epfs. If not, see <http://www.gnu.org/licenses/>.
//    Copyright (c) 2010, Baozeng Ding.
// import a module named 'py_numpy'
import py_numpy;
// test single double matrix
x = 3;
y = py_numpy.F(x);
if unwrap(y) <> x then bugmes();quit;end;
remove(y);
// test one row matrix
x = [3,4,5,6,7,8];
y = py_numpy.F(x);
if unwrap(y) <> x then bugmes();quit;end;
remove(y);
// test matrix
x = rand(1000,1000);
y = py_numpy.F(x);
if unwrap(y) <> x then bugmes();quit;end;
remove(y);
// test the performance
//x = rand(100,100);tic();for i=1:100,unwrap(py_numpy.F(x));end;toc()
//x = rand(1000,1000);tic();for i=1:100,unwrap(py_numpy.F(x));end;toc()
// test single complex matrix
x = 3+4*%i;
y = py_numpy.F(x);
if unwrap(y) <> x then bugmes();quit;end;
remove(y);
// test one row complex matrix
x = [1+2*%i, 3+4*%i];
y = py_numpy.F(x);
if unwrap(y) <> x then bugmes();quit;end;
remove(y);
// test complex matrix
x = [1+11*%i, 2+222*%i, 3+333*%i ; 4+444*%i , 5+55*%i, 6+66*%i];
y = py_numpy.F(x);
if unwrap(y) <> x then bugmes();quit;end;
remove(y);
// test numpy funtion "dot"
x = [1,2; 3,4; 5,6];
y = [1,2,3; 4,5,6];
z = x * y;
r = py_numpy.multiply(x, y);
if unwrap(r) <> z then bugmes();quit;end;
remove(r);
// test numpy function "reshape"
x = [1,2; 3,4; 5,6];
y = py_numpy.reshape(x, 2, 3);
if unwrap(y) <> [1,2,3; 4,5,6] then bugmes();quit;end;
remove(y);
