<?xml version="1.0" encoding="UTF-8" standalone="no"?>
<svg
   xmlns:dc="http://purl.org/dc/elements/1.1/"
   xmlns:cc="http://creativecommons.org/ns#"
   xmlns:rdf="http://www.w3.org/1999/02/22-rdf-syntax-ns#"
   xmlns:svg="http://www.w3.org/2000/svg"
   xmlns="http://www.w3.org/2000/svg"
   xmlns:sodipodi="http://sodipodi.sourceforge.net/DTD/sodipodi-0.dtd"
   xmlns:inkscape="http://www.inkscape.org/namespaces/inkscape"
   width="436.5"
   height="126"
   viewBox="0 0 582 168"
   id="svg2"
   sodipodi:version="0.32"
   inkscape:version="0.46"
   sodipodi:docname="toysystem_positive.svg"
   inkscape:output_extension="org.inkscape.output.svg.inkscape"
   version="1.0">
  <metadata
     id="metadata145">
    <rdf:RDF>
      <cc:Work
         rdf:about="">
        <dc:format>image/svg+xml</dc:format>
        <dc:type
           rdf:resource="http://purl.org/dc/dcmitype/StillImage" />
      </cc:Work>
    </rdf:RDF>
  </metadata>
  <sodipodi:namedview
     inkscape:window-height="1030"
     inkscape:window-width="1680"
     inkscape:pageshadow="2"
     inkscape:pageopacity="0.0"
     guidetolerance="10.0"
     gridtolerance="10.0"
     objecttolerance="10.0"
     borderopacity="1.0"
     bordercolor="#666666"
     pagecolor="#ffffff"
     id="base"
     showgrid="false"
     inkscape:zoom="3.7388316"
     inkscape:cx="175.78443"
     inkscape:cy="80.494965"
     inkscape:window-x="1672"
     inkscape:window-y="-8"
     inkscape:current-layer="svg2" />
  <title
     id="title4">Graphic window number 0</title>
  <desc
     id="desc6">
Creator: GL2PS 1.3.2, (C) 1999-2006 Christophe Geuzaine (geuz@geuz.org)
For: Scilab
CreationDate: Wed Feb 17 16:05:59 2010
</desc>
  <defs
     id="defs8">
    <marker
       inkscape:stockid="Arrow1Lend"
       orient="auto"
       refY="0.0"
       refX="0.0"
       id="Arrow1Lend"
       style="overflow:visible;">
      <path
         id="path3308"
         d="M 0.0,0.0 L 5.0,-5.0 L -12.5,0.0 L 5.0,5.0 L 0.0,0.0 z "
         style="fill-rule:evenodd;stroke:#000000;stroke-width:1.0pt;marker-start:none;"
         transform="scale(0.8) rotate(180) translate(12.5,0)" />
    </marker>
    <inkscape:perspective
       sodipodi:type="inkscape:persp3d"
       inkscape:vp_x="0 : 84 : 1"
       inkscape:vp_y="0 : 1000 : 0"
       inkscape:vp_z="582 : 84 : 1"
       inkscape:persp3d-origin="291 : 56 : 1"
       id="perspective147" />
  </defs>
  <polygon
     points="0,0 582,0 582,168 0,168 0,0 "
     id="polygon10"
     style="fill:#ffffff" />
  <g
     id="g12">
    <polyline
       points="72.75,147 72.75,21 72.75,21 509.25,21 509.25,147 509.25,147 72.75,147"
       id="polyline14"
       style="fill:none;stroke:#000000;stroke-width:0.5" />
    <polyline
       points="509.25,21 72.75,21"
       id="polyline16"
       style="fill:none;stroke:#000000;stroke-width:0.5" />
    <polyline
       points="509.25,21 509.25,147"
       id="polyline18"
       style="fill:none;stroke:#000000;stroke-width:0.5" />
    <polyline
       points="509.25,21 509.25,21"
       id="polyline20"
       style="fill:none;stroke:#000000;stroke-width:0.5" />
    <polygon
       points="72.75,147 72.75,21 72.75,21 72.75,147 "
       id="polygon22"
       style="fill:#ffffff" />
    <polygon
       points="72.75,147 72.75,21 72.75,147 "
       id="polygon24"
       style="fill:#ffffff" />
    <polygon
       points="72.75,147 509.25,147 509.25,147 72.75,147 "
       id="polygon26"
       style="fill:#ffffff" />
    <polygon
       points="72.75,147 509.25,147 72.75,147 "
       id="polygon28"
       style="fill:#ffffff" />
    <polygon
       points="72.75,147 509.25,147 509.25,21 72.75,147 "
       id="polygon30"
       style="fill:#ffffff" />
    <polygon
       points="72.75,147 509.25,21 72.75,21 72.75,147 "
       id="polygon32"
       style="fill:#ffffff" />
    <polyline
       points="72.75,105 72.75,63"
       id="polyline34"
       style="fill:none;stroke:#0000ff;stroke-width:0.5" />
    <polyline
       points="74.4551,105 74.4551,63"
       id="polyline36"
       style="fill:none;stroke:#0000ff;stroke-width:0.5" />
    <polyline
       points="76.1602,105 76.1602,63"
       id="polyline38"
       style="fill:none;stroke:#0000ff;stroke-width:0.5" />
    <polyline
       points="77.8652,105 77.8652,63"
       id="polyline40"
       style="fill:none;stroke:#0000ff;stroke-width:0.5" />
    <polyline
       points="79.5703,105 79.5703,63"
       id="polyline42"
       style="fill:none;stroke:#0000ff;stroke-width:0.5" />
    <polyline
       points="81.2754,105 81.2754,63"
       id="polyline44"
       style="fill:none;stroke:#0000ff;stroke-width:0.5" />
    <polyline
       points="82.9805,105 82.9805,63"
       id="polyline46"
       style="fill:none;stroke:#0000ff;stroke-width:0.5" />
    <polyline
       points="84.6855,105 84.6855,63"
       id="polyline48"
       style="fill:none;stroke:#0000ff;stroke-width:0.5" />
    <polyline
       points="86.3906,105 86.3906,63"
       id="polyline50"
       style="fill:none;stroke:#0000ff;stroke-width:0.5" />
    <polyline
       points="89.8008,105 89.8008,63"
       id="polyline52"
       style="fill:none;stroke:#0000ff;stroke-width:0.5" />
    <polyline
       points="93.2109,105 93.2109,63"
       id="polyline54"
       style="fill:none;stroke:#0000ff;stroke-width:0.5" />
    <polyline
       points="96.6211,105 96.6211,63"
       id="polyline56"
       style="fill:none;stroke:#0000ff;stroke-width:0.5" />
    <polyline
       points="100.031,105 100.031,63"
       id="polyline58"
       style="fill:none;stroke:#0000ff;stroke-width:0.5" />
    <polyline
       points="106.852,105 106.852,63"
       id="polyline60"
       style="fill:none;stroke:#0000ff;stroke-width:0.5" />
    <polyline
       points="113.672,105 113.672,63"
       id="polyline62"
       style="fill:none;stroke:#0000ff;stroke-width:0.5" />
    <polyline
       points="120.492,105 120.492,63"
       id="polyline64"
       style="fill:none;stroke:#0000ff;stroke-width:0.5" />
    <polyline
       points="127.313,105 127.313,63"
       id="polyline66"
       style="fill:none;stroke:#0000ff;stroke-width:0.5" />
    <polyline
       points="140.953,105 140.953,63"
       id="polyline68"
       style="fill:none;stroke:#0000ff;stroke-width:0.5" />
    <polyline
       points="154.594,105 154.594,63"
       id="polyline70"
       style="fill:none;stroke:#0000ff;stroke-width:0.5" />
    <polyline
       points="168.234,105 168.234,63"
       id="polyline72"
       style="fill:none;stroke:#0000ff;stroke-width:0.5" />
    <polyline
       points="181.875,105 181.875,63"
       id="polyline74"
       style="fill:none;stroke:#0000ff;stroke-width:0.5" />
    <polyline
       points="209.156,105 209.156,63"
       id="polyline76"
       style="fill:none;stroke:#0000ff;stroke-width:0.5" />
    <polyline
       points="236.438,105 236.438,63"
       id="polyline78"
       style="fill:none;stroke:#0000ff;stroke-width:0.5" />
    <polyline
       points="263.719,105 263.719,63"
       id="polyline80"
       style="fill:none;stroke:#0000ff;stroke-width:0.5" />
    <polyline
       points="291,105 291,63"
       id="polyline82"
       style="fill:none;stroke:#0000ff;stroke-width:0.5" />
    <polyline
       points="345.563,105 345.563,63"
       id="polyline84"
       style="fill:none;stroke:#0000ff;stroke-width:0.5" />
    <polyline
       points="400.125,105 400.125,63"
       id="polyline86"
       style="fill:none;stroke:#0000ff;stroke-width:0.5" />
    <polyline
       points="454.688,105 454.688,63"
       id="polyline88"
       style="fill:none;stroke:#0000ff;stroke-width:0.5" />
    <polyline
       points="72.75,147 509.25,147"
       id="polyline90"
       style="fill:none;stroke:#000000;stroke-width:0.5" />
    <polyline
       points="72.75,147 72.75,150"
       id="polyline92"
       style="fill:none;stroke:#000000;stroke-width:0.5" />
    <polyline
       points="127.313,147 127.313,150"
       id="polyline94"
       style="fill:none;stroke:#000000;stroke-width:0.5" />
    <polyline
       points="181.875,147 181.875,150"
       id="polyline96"
       style="fill:none;stroke:#000000;stroke-width:0.5" />
    <polyline
       points="236.438,147 236.438,150"
       id="polyline98"
       style="fill:none;stroke:#000000;stroke-width:0.5" />
    <polyline
       points="291,147 291,150"
       id="polyline100"
       style="fill:none;stroke:#000000;stroke-width:0.5" />
    <polyline
       points="345.563,147 345.563,150"
       id="polyline102"
       style="fill:none;stroke:#000000;stroke-width:0.5" />
    <polyline
       points="400.125,147 400.125,150"
       id="polyline104"
       style="fill:none;stroke:#000000;stroke-width:0.5" />
    <polyline
       points="454.688,147 454.688,150"
       id="polyline106"
       style="fill:none;stroke:#000000;stroke-width:0.5" />
    <polyline
       points="509.25,147 509.25,150"
       id="polyline108"
       style="fill:none;stroke:#000000;stroke-width:0.5" />
    <polyline
       points="100.031,147 100.031,148.8"
       id="polyline110"
       style="fill:none;stroke:#000000;stroke-width:0.5" />
    <polyline
       points="154.594,147 154.594,148.8"
       id="polyline112"
       style="fill:none;stroke:#000000;stroke-width:0.5" />
    <polyline
       points="209.156,147 209.156,148.8"
       id="polyline114"
       style="fill:none;stroke:#000000;stroke-width:0.5" />
    <polyline
       points="263.719,147 263.719,148.8"
       id="polyline116"
       style="fill:none;stroke:#000000;stroke-width:0.5" />
    <polyline
       points="318.281,147 318.281,148.8"
       id="polyline118"
       style="fill:none;stroke:#000000;stroke-width:0.5" />
    <polyline
       points="372.844,147 372.844,148.8"
       id="polyline120"
       style="fill:none;stroke:#000000;stroke-width:0.5" />
    <polyline
       points="427.406,147 427.406,148.8"
       id="polyline122"
       style="fill:none;stroke:#000000;stroke-width:0.5" />
    <polyline
       points="481.969,147 481.969,148.8"
       id="polyline124"
       style="fill:none;stroke:#000000;stroke-width:0.5" />
    <text
       x="69"
       y="161"
       font-size="10"
       font-style="normal"
       font-weight="normal"
       id="text126"
       style="font-size:10px;font-style:normal;font-weight:normal;fill:#000000;font-family:SansSerif">0</text>
    <text
       x="124"
       y="161"
       font-size="10"
       font-style="normal"
       font-weight="normal"
       id="text128"
       style="font-size:10px;font-style:normal;font-weight:normal;fill:#000000;font-family:SansSerif">2</text>
    <text
       x="178"
       y="161"
       font-size="10"
       font-style="normal"
       font-weight="normal"
       id="text130"
       style="font-size:10px;font-style:normal;font-weight:normal;fill:#000000;font-family:SansSerif">4</text>
    <text
       x="233"
       y="161"
       font-size="10"
       font-style="normal"
       font-weight="normal"
       id="text132"
       style="font-size:10px;font-style:normal;font-weight:normal;fill:#000000;font-family:SansSerif">6</text>
    <text
       x="288"
       y="161"
       font-size="10"
       font-style="normal"
       font-weight="normal"
       id="text134"
       style="font-size:10px;font-style:normal;font-weight:normal;fill:#000000;font-family:SansSerif">8</text>
    <text
       x="340"
       y="161"
       font-size="10"
       font-style="normal"
       font-weight="normal"
       id="text136"
       style="font-size:10px;font-style:normal;font-weight:normal;fill:#000000;font-family:SansSerif">10</text>
    <text
       x="394"
       y="161"
       font-size="10"
       font-style="normal"
       font-weight="normal"
       id="text138"
       style="font-size:10px;font-style:normal;font-weight:normal;fill:#000000;font-family:SansSerif">12</text>
    <text
       x="449"
       y="161"
       font-size="10"
       font-style="normal"
       font-weight="normal"
       id="text140"
       style="font-size:10px;font-style:normal;font-weight:normal;fill:#000000;font-family:SansSerif">14</text>
    <text
       x="503"
       y="161"
       font-size="10"
       font-style="normal"
       font-weight="normal"
       id="text142"
       style="font-size:10px;font-style:normal;font-weight:normal;fill:#000000;font-family:SansSerif">16</text>
  </g>
  <text
     xml:space="preserve"
     style="font-size:14.86926842px;font-style:normal;font-weight:normal;fill:#000000;fill-opacity:1;stroke:none;stroke-width:1px;stroke-linecap:butt;stroke-linejoin:miter;stroke-opacity:1;font-family:Bitstream Vera Sans"
     x="143.14569"
     y="39.775547"
     id="text2520"><tspan
       sodipodi:role="line"
       x="143.14569"
       y="39.775547"
       id="tspan2524">Subnormal Numbers</tspan></text>
  <path
     style="fill:none;fill-rule:evenodd;stroke:#000000;stroke-width:0.66666667;stroke-linecap:butt;stroke-linejoin:miter;stroke-opacity:1;marker-end:url(#Arrow1Lend);stroke-miterlimit:4;stroke-dasharray:none"
     d="M 140.68566,35.338236 L 81.866038,50.995978"
     id="path2526"
     sodipodi:nodetypes="cc" />
  <path
     style="fill:none;fill-rule:evenodd;stroke:#000000;stroke-width:1px;stroke-linecap:butt;stroke-linejoin:miter;stroke-opacity:1"
     d="M 73.819853,59.409926 L 73.819853,53.525735 L 78.634189,53.525735 L 78.634189,59.476793"
     id="path2528"
     sodipodi:nodetypes="cccc" />
</svg>
