<?xml version="1.0" encoding="UTF-8" standalone="no"?>
<!-- Created with Inkscape (http://www.inkscape.org/) -->
<svg
   xmlns:dc="http://purl.org/dc/elements/1.1/"
   xmlns:cc="http://creativecommons.org/ns#"
   xmlns:rdf="http://www.w3.org/1999/02/22-rdf-syntax-ns#"
   xmlns:svg="http://www.w3.org/2000/svg"
   xmlns="http://www.w3.org/2000/svg"
   xmlns:sodipodi="http://sodipodi.sourceforge.net/DTD/sodipodi-0.dtd"
   xmlns:inkscape="http://www.inkscape.org/namespaces/inkscape"
   width="904.90924"
   height="581.72485"
   id="svg2"
   sodipodi:version="0.32"
   inkscape:version="0.46"
   sodipodi:docname="solution2.svg"
   inkscape:output_extension="org.inkscape.output.svg.inkscape"
   version="1.0">
  <defs
     id="defs4">
    <marker
       inkscape:stockid="Arrow1Lend"
       orient="auto"
       refY="0"
       refX="0"
       id="Arrow1Lend"
       style="overflow:visible">
      <path
         id="path3244"
         d="M 0,0 L 5,-5 L -12.5,0 L 5,5 L 0,0 z"
         style="fill-rule:evenodd;stroke:#000000;stroke-width:1pt;marker-start:none"
         transform="matrix(-0.8,0,0,-0.8,-10,0)" />
    </marker>
    <inkscape:perspective
       sodipodi:type="inkscape:persp3d"
       inkscape:vp_x="0 : 526.18109 : 1"
       inkscape:vp_y="0 : 1000 : 0"
       inkscape:vp_z="744.09448 : 526.18109 : 1"
       inkscape:persp3d-origin="372.04724 : 350.78739 : 1"
       id="perspective10" />
  </defs>
  <sodipodi:namedview
     id="base"
     pagecolor="#ffffff"
     bordercolor="#666666"
     borderopacity="1.0"
     inkscape:pageopacity="0.0"
     inkscape:pageshadow="2"
     inkscape:zoom="0.9899495"
     inkscape:cx="348.58832"
     inkscape:cy="275.43899"
     inkscape:document-units="px"
     inkscape:current-layer="layer1"
     showgrid="false"
     inkscape:window-width="1230"
     inkscape:window-height="1005"
     inkscape:window-x="1819"
     inkscape:window-y="9" />
  <metadata
     id="metadata7">
    <rdf:RDF>
      <cc:Work
         rdf:about="">
        <dc:format>image/svg+xml</dc:format>
        <dc:type
           rdf:resource="http://purl.org/dc/dcmitype/StillImage" />
      </cc:Work>
    </rdf:RDF>
  </metadata>
  <g
     inkscape:label="Calque 1"
     inkscape:groupmode="layer"
     id="layer1"
     transform="translate(58.687951,169.80962)">
    <g
       id="g3214"
       transform="translate(-25.459488,0.739018)">
      <rect
         y="169.13379"
         x="110.20305"
         height="82.606895"
         width="192.79767"
         id="rect2419"
         style="fill:none;fill-opacity:1;stroke:#000000;stroke-width:2;stroke-miterlimit:4;stroke-dasharray:none;stroke-dashoffset:0;stroke-opacity:1" />
      <text
         id="text3191"
         y="205.10408"
         x="136.82103"
         style="font-size:22px;font-style:normal;font-weight:normal;line-height:125%;fill:#000000;fill-opacity:1;stroke:none;stroke-width:1px;stroke-linecap:butt;stroke-linejoin:miter;stroke-opacity:1;font-family:Bitstream Vera Sans"
         xml:space="preserve"
         sodipodi:linespacing="125%"><tspan
           y="205.10408"
           x="136.82103"
           id="tspan3193"
           sodipodi:role="line"
           style="font-size:24px;font-style:normal;font-variant:normal;font-weight:bold;font-stretch:normal;text-align:start;line-height:125%;writing-mode:lr-tb;text-anchor:start;font-family:Arial;-inkscape-font-specification:Arial Bold"> * name</tspan><tspan
           y="233.43294"
           x="136.82103"
           sodipodi:role="line"
           id="tspan2450">S = init(name)</tspan></text>
    </g>
    <g
       id="g3219"
       transform="translate(77.576073,-2.0203051)">
      <rect
         y="171.89311"
         x="295.03528"
         height="56.34293"
         width="216.03117"
         id="rect3202"
         style="fill:none;fill-opacity:1;stroke:#000000;stroke-width:2;stroke-miterlimit:4;stroke-dasharray:none;stroke-dashoffset:0;stroke-opacity:1" />
      <text
         id="text3204"
         y="207.63245"
         x="314.93402"
         style="font-size:22px;font-style:normal;font-weight:normal;fill:#000000;fill-opacity:1;stroke:none;stroke-width:1px;stroke-linecap:butt;stroke-linejoin:miter;stroke-opacity:1;font-family:Bitstream Vera Sans"
         xml:space="preserve"><tspan
           y="207.63245"
           x="314.93402"
           id="tspan3206"
           sodipodi:role="line">[this,v] = next(this)</tspan></text>
    </g>
    <g
       id="g2457"
       transform="translate(15.152287,0)">
      <rect
         y="305.85944"
         x="211.12189"
         height="105.05583"
         width="184.85791"
         id="rect3224"
         style="opacity:1;fill:none;fill-opacity:1;stroke:#000000;stroke-width:2;stroke-miterlimit:4;stroke-dasharray:none;stroke-dashoffset:0;stroke-opacity:1" />
      <text
         id="text3226"
         y="351.31631"
         x="234.35539"
         style="font-size:22px;font-style:normal;font-weight:normal;fill:#000000;fill-opacity:1;stroke:none;stroke-width:1px;stroke-linecap:butt;stroke-linejoin:miter;stroke-opacity:1;font-family:Bitstream Vera Sans"
         xml:space="preserve"><tspan
           y="351.31631"
           x="234.35539"
           id="tspan3228"
           sodipodi:role="line">S = init(&quot;A&quot;);</tspan><tspan
           id="tspan3232"
           y="378.81631"
           x="234.35539"
           sodipodi:role="line">[S,v] = next(S)</tspan></text>
    </g>
    <path
       style="fill:none;fill-rule:evenodd;stroke:#000000;stroke-width:2;stroke-linecap:butt;stroke-linejoin:miter;marker-end:url(#Arrow1Lend);stroke-miterlimit:4;stroke-dasharray:none;stroke-opacity:1"
       d="M 299.00515,302.32393 L 219.2031,259.89752"
       id="path3236"
       sodipodi:nodetypes="cc" />
    <path
       style="fill:none;fill-rule:evenodd;stroke:#000000;stroke-width:2;stroke-linecap:butt;stroke-linejoin:miter;marker-end:url(#Arrow1Lend);stroke-miterlimit:4;stroke-dasharray:none;stroke-opacity:1"
       d="M 347.49247,302.32392 L 457.59909,233.63354"
       id="path4016"
       sodipodi:nodetypes="cc" />
    <g
       id="g2395"
       transform="translate(-167.891,-143.99411)">
      <rect
         y="169.13379"
         x="110.20305"
         height="81.596748"
         width="156.43217"
         id="rect2397"
         style="fill:none;fill-opacity:1;stroke:#000000;stroke-width:2;stroke-miterlimit:4;stroke-dasharray:none;stroke-dashoffset:0;stroke-opacity:1" />
      <text
         id="text2399"
         y="205.10408"
         x="136.82103"
         style="font-size:22px;font-style:normal;font-weight:normal;line-height:125%;fill:#000000;fill-opacity:1;stroke:none;stroke-width:1px;stroke-linecap:butt;stroke-linejoin:miter;stroke-opacity:1;font-family:Bitstream Vera Sans"
         xml:space="preserve"
         sodipodi:linespacing="125%"><tspan
           y="205.10408"
           x="136.82103"
           id="tspan2401"
           sodipodi:role="line"
           style="font-size:24px;font-style:normal;font-variant:normal;font-weight:bold;font-stretch:normal;text-align:start;line-height:125%;writing-mode:lr-tb;text-anchor:start;font-family:Arial;-inkscape-font-specification:Arial Bold"> * a, u, n</tspan><tspan
           y="233.43294"
           x="136.82103"
           sodipodi:role="line"
           id="tspan2448">S = A_init()</tspan></text>
    </g>
    <g
       id="g2403"
       transform="translate(91.718209,-321.50983)">
      <rect
         y="171.89311"
         x="295.03528"
         height="56.34293"
         width="253.40681"
         id="rect2405"
         style="fill:none;fill-opacity:1;stroke:#000000;stroke-width:2;stroke-miterlimit:4;stroke-dasharray:none;stroke-dashoffset:0;stroke-opacity:1" />
      <text
         id="text2407"
         y="207.63245"
         x="314.93402"
         style="font-size:22px;font-style:normal;font-weight:normal;fill:#000000;fill-opacity:1;stroke:none;stroke-width:1px;stroke-linecap:butt;stroke-linejoin:miter;stroke-opacity:1;font-family:Bitstream Vera Sans"
         xml:space="preserve"><tspan
           y="207.63245"
           x="314.93402"
           id="tspan2409"
           sodipodi:role="line">[this,v] = A_next(this)</tspan></text>
    </g>
    <g
       id="g2429"
       transform="translate(46.467017,0)">
      <rect
         y="-168.80962"
         x="124.13951"
         height="75.535873"
         width="158.45248"
         id="rect2413"
         style="fill:none;fill-opacity:1;stroke:#000000;stroke-width:2;stroke-miterlimit:4;stroke-dasharray:none;stroke-dashoffset:0;stroke-opacity:1" />
      <text
         sodipodi:linespacing="125%"
         id="text2415"
         y="-139.9104"
         x="150.75749"
         style="font-size:22px;font-style:normal;font-weight:normal;line-height:125%;fill:#000000;fill-opacity:1;stroke:none;stroke-width:1px;stroke-linecap:butt;stroke-linejoin:miter;stroke-opacity:1;font-family:Bitstream Vera Sans"
         xml:space="preserve"><tspan
           style="font-size:24px;font-style:normal;font-variant:normal;font-weight:bold;font-stretch:normal;text-align:start;line-height:125%;writing-mode:lr-tb;text-anchor:start;font-family:Arial;-inkscape-font-specification:Arial Bold"
           y="-139.9104"
           x="150.75749"
           sodipodi:role="line"
           id="tspan2426"> * c, u, n</tspan><tspan
           y="-111.58155"
           x="150.75749"
           sodipodi:role="line"
           id="tspan2428">S = C_init()</tspan></text>
    </g>
    <g
       id="g2419"
       transform="translate(296.77918,-160.89558)">
      <rect
         y="171.89311"
         x="295.03528"
         height="56.34293"
         width="253.40681"
         id="rect2421"
         style="fill:none;fill-opacity:1;stroke:#000000;stroke-width:2;stroke-miterlimit:4;stroke-dasharray:none;stroke-dashoffset:0;stroke-opacity:1" />
      <text
         id="text2423"
         y="207.63245"
         x="314.93402"
         style="font-size:22px;font-style:normal;font-weight:normal;fill:#000000;fill-opacity:1;stroke:none;stroke-width:1px;stroke-linecap:butt;stroke-linejoin:miter;stroke-opacity:1;font-family:Bitstream Vera Sans"
         xml:space="preserve"><tspan
           y="207.63245"
           x="314.93402"
           id="tspan2425"
           sodipodi:role="line">[this,v] = C_next(this)</tspan></text>
    </g>
    <g
       id="g2436"
       transform="translate(46.467017,0)">
      <g
         transform="translate(-117.38336,-237.18069)"
         id="g2427">
        <rect
           style="fill:none;fill-opacity:1;stroke:#000000;stroke-width:2;stroke-miterlimit:4;stroke-dasharray:none;stroke-dashoffset:0;stroke-opacity:1"
           id="rect2429"
           width="154.41188"
           height="76.545982"
           x="110.20305"
           y="169.13379" />
        <text
           sodipodi:linespacing="125%"
           xml:space="preserve"
           style="font-size:22px;font-style:normal;font-weight:normal;line-height:125%;fill:#000000;fill-opacity:1;stroke:none;stroke-width:1px;stroke-linecap:butt;stroke-linejoin:miter;stroke-opacity:1;font-family:Bitstream Vera Sans"
           x="136.82103"
           y="205.10408"
           id="text2431"><tspan
             style="font-size:24px;font-style:normal;font-variant:normal;font-weight:bold;font-stretch:normal;text-align:start;line-height:125%;writing-mode:lr-tb;text-anchor:start;font-family:Arial;-inkscape-font-specification:Arial Bold"
             sodipodi:role="line"
             id="tspan2433"
             x="136.82103"
             y="205.10408"> * b, u, n</tspan><tspan
             id="tspan2446"
             sodipodi:role="line"
             x="136.82103"
             y="233.43294">S = B_init()</tspan></text>
      </g>
    </g>
    <g
       id="g2435"
       transform="translate(205.86545,-239.94002)">
      <rect
         y="171.89311"
         x="295.03528"
         height="56.34293"
         width="247.3459"
         id="rect2437"
         style="fill:none;fill-opacity:1;stroke:#000000;stroke-width:2;stroke-miterlimit:4;stroke-dasharray:none;stroke-dashoffset:0;stroke-opacity:1" />
      <text
         id="text2439"
         y="207.63245"
         x="314.93402"
         style="font-size:22px;font-style:normal;font-weight:normal;fill:#000000;fill-opacity:1;stroke:none;stroke-width:1px;stroke-linecap:butt;stroke-linejoin:miter;stroke-opacity:1;font-family:Bitstream Vera Sans"
         xml:space="preserve"><tspan
           y="207.63245"
           x="314.93402"
           id="tspan2441"
           sodipodi:role="line">[this,v] = B_next(this)</tspan></text>
    </g>
    <path
       style="fill:none;fill-rule:evenodd;stroke:#000000;stroke-width:2;stroke-linecap:butt;stroke-linejoin:miter;marker-end:url(#Arrow1Lend);stroke-miterlimit:4;stroke-dasharray:none;stroke-opacity:1"
       d="M 157.29554,157.35684 L 64.251262,118.97104"
       id="path2443"
       sodipodi:nodetypes="cc" />
    <path
       style="fill:none;fill-rule:evenodd;stroke:#000000;stroke-width:2;stroke-linecap:butt;stroke-linejoin:miter;marker-end:url(#Arrow1Lend);stroke-miterlimit:4;stroke-dasharray:none;stroke-opacity:1"
       d="M 179.27378,157.35684 L 142.03301,18.96593"
       id="path2445"
       sodipodi:nodetypes="cc" />
    <path
       style="fill:none;fill-rule:evenodd;stroke:#000000;stroke-width:2;stroke-linecap:butt;stroke-linejoin:miter;marker-end:url(#Arrow1Lend);stroke-miterlimit:4;stroke-dasharray:none;stroke-opacity:1"
       d="M 203.11781,157.35684 L 279.85096,-79.018861"
       id="path2447"
       sodipodi:nodetypes="cc" />
    <path
       style="fill:none;fill-rule:evenodd;stroke:#000000;stroke-width:2;stroke-linecap:butt;stroke-linejoin:miter;marker-end:url(#Arrow1Lend);stroke-miterlimit:4;stroke-dasharray:none;stroke-opacity:1"
       d="M 489.00118,157.35684 L 412.26803,-79.01886"
       id="path2451"
       sodipodi:nodetypes="cc" />
    <path
       style="fill:none;fill-rule:evenodd;stroke:#000000;stroke-width:2;stroke-linecap:butt;stroke-linejoin:miter;marker-end:url(#Arrow1Lend);stroke-miterlimit:4;stroke-dasharray:none;stroke-opacity:1"
       d="M 509.18681,157.35684 L 546.42758,2.8034824"
       id="path2453"
       sodipodi:nodetypes="cc" />
    <path
       style="fill:none;fill-rule:evenodd;stroke:#000000;stroke-width:2;stroke-linecap:butt;stroke-linejoin:miter;marker-end:url(#Arrow1Lend);stroke-miterlimit:4;stroke-dasharray:none;stroke-opacity:1"
       d="M 533.412,157.35684 L 626.45627,86.646147"
       id="path2455"
       sodipodi:nodetypes="cc" />
  </g>
</svg>
