<?xml version="1.0" encoding="UTF-8" standalone="no"?>
<svg xmlns="http://www.w3.org/2000/svg"
     xmlns:xlink="http://www.w3.org/1999/xlink"
     width="801px" height="460px" viewBox="0 0 801 460"
     style="stroke:none">
<title>Graphic window number 0</title>
<desc>
Creator: GL2PS 1.3.2, (C) 1999-2006 Christophe Geuzaine (geuz@geuz.org)
For: Scilab
CreationDate: Mon Feb 14 15:51:21 2011
</desc>
<defs>
</defs>
<polygon fill="#ffffff" points="0,0 801,0 801,460 0,460"/>
<g>
<polyline fill="none" stroke="#000000" stroke-width="0.5" points="50.0625,201.25 50.0625,28.75 50.0625,28.75 350.438,28.75 350.438,201.25 350.438,201.25 50.0625,201.25"/>
<polyline fill="none" stroke="#000000" stroke-width="0.5" points="350.438,28.75 50.0625,28.75"/>
<polyline fill="none" stroke="#000000" stroke-width="0.5" points="350.438,28.75 350.438,201.25"/>
<polyline fill="none" stroke="#000000" stroke-width="0.5" points="350.438,28.75 350.438,28.75"/>
<polygon fill="#ffffff" points="50.0625,201.25 50.0625,28.75 50.0625,28.75"/>
<polygon fill="#ffffff" points="50.0625,201.25 50.0625,28.75 50.0625,201.25"/>
<polygon fill="#ffffff" points="50.0625,201.25 350.438,201.25 350.438,201.25"/>
<polygon fill="#ffffff" points="50.0625,201.25 350.438,201.25 50.0625,201.25"/>
<polygon fill="#ffffff" points="50.0625,201.25 350.438,201.25 350.438,28.75"/>
<polygon fill="#ffffff" points="50.0625,201.25 350.438,28.75 50.0625,28.75"/>
<polyline fill="none" stroke="#ff0000" stroke-width="0.5" points="50.0596,173 54,173"/>
<polyline fill="none" stroke="#ff0000" stroke-width="0.5" points="50.0596,173.06 52.8286,175.829"/>
<polyline fill="none" stroke="#ff0000" stroke-width="0.5" points="50.0596,172.94 52.8286,170.171"/>
<polyline fill="none" stroke="#ff0000" stroke-width="0.5" points="96,172 104,172"/>
<polyline fill="none" stroke="#ff0000" stroke-width="0.5" points="100,176 100,168"/>
<polyline fill="none" stroke="#ff0000" stroke-width="0.5" points="97.1714,169.171 102.829,174.829"/>
<polyline fill="none" stroke="#ff0000" stroke-width="0.5" points="97.1714,174.829 102.829,169.171"/>
<polyline fill="none" stroke="#ff0000" stroke-width="0.5" points="146,171 154,171"/>
<polyline fill="none" stroke="#ff0000" stroke-width="0.5" points="150,175 150,167"/>
<polyline fill="none" stroke="#ff0000" stroke-width="0.5" points="147.171,168.171 152.829,173.829"/>
<polyline fill="none" stroke="#ff0000" stroke-width="0.5" points="147.171,173.829 152.829,168.171"/>
<polyline fill="none" stroke="#ff0000" stroke-width="0.5" points="196,167 204,167"/>
<polyline fill="none" stroke="#ff0000" stroke-width="0.5" points="200,171 200,163"/>
<polyline fill="none" stroke="#ff0000" stroke-width="0.5" points="197.171,164.171 202.829,169.829"/>
<polyline fill="none" stroke="#ff0000" stroke-width="0.5" points="197.171,169.829 202.829,164.171"/>
<polyline fill="none" stroke="#ff0000" stroke-width="0.5" points="246,154 254,154"/>
<polyline fill="none" stroke="#ff0000" stroke-width="0.5" points="250,158 250,150"/>
<polyline fill="none" stroke="#ff0000" stroke-width="0.5" points="247.171,151.171 252.829,156.829"/>
<polyline fill="none" stroke="#ff0000" stroke-width="0.5" points="247.171,156.829 252.829,151.171"/>
<polyline fill="none" stroke="#ff0000" stroke-width="0.5" points="296,121 304,121"/>
<polyline fill="none" stroke="#ff0000" stroke-width="0.5" points="300,125 300,117"/>
<polyline fill="none" stroke="#ff0000" stroke-width="0.5" points="297.171,118.171 302.829,123.829"/>
<polyline fill="none" stroke="#ff0000" stroke-width="0.5" points="297.171,123.829 302.829,118.171"/>
<polyline fill="none" stroke="#ff0000" stroke-width="0.5" points="346,31 350.44,31"/>
<polyline fill="none" stroke="#ff0000" stroke-width="0.5" points="350,35 350,28.748"/>
<polyline fill="none" stroke="#ff0000" stroke-width="0.5" points="347.748,28.748 350.44,31.4404"/>
<polyline fill="none" stroke="#ff0000" stroke-width="0.5" points="347.171,33.8286 350.44,30.5596"/>
<polyline fill="none" stroke="#0000ff" stroke-width="0.5" points="50.0625,172.558 100.125,172.385 150.188,171.868 200.25,171.005 250.313,169.797 300.375,168.245 350.438,166.348"/>
<polyline fill="none" stroke="#0000ff" stroke-width="0.5" points="54,173 53.981,172.608 53.9233,172.22 53.8276,171.839 53.6953,171.469 53.5278,171.114 53.3257,170.778 53.0918,170.462 52.8286,170.171 52.5376,169.908 52.2222,169.674 51.8857,169.472 51.5308,169.305 51.1611,169.172 50.7803,169.077 50.3921,169.019 50.0596,169.003"/>
<polyline fill="none" stroke="#0000ff" stroke-width="0.5" points="50.0596,176.997 50.3921,176.981 50.7803,176.923 51.1611,176.828 51.5308,176.695 51.8857,176.528 52.2222,176.326 52.5376,176.092 52.8286,175.829 53.0918,175.538 53.3257,175.222 53.5278,174.886 53.6953,174.531 53.8276,174.161 53.9233,173.78 53.981,173.392 54,173"/>
<polyline fill="none" stroke="#0000ff" stroke-width="0.5" points="104,172 103.981,171.608 103.923,171.22 103.828,170.839 103.695,170.469 103.528,170.114 103.326,169.778 103.092,169.462 102.829,169.171 102.538,168.908 102.222,168.674 101.886,168.472 101.531,168.305 101.161,168.172 100.78,168.077 100.392,168.019 100,168 99.6079,168.019 99.2197,168.077 98.8389,168.172 98.4692,168.305 98.1143,168.472 97.7778,168.674 97.4624,168.908 97.1714,169.171 96.9082,169.462 96.6743,169.778 96.4722,170.114 96.3047,170.469 96.1724,170.839 96.0767,171.22 96.019,171.608 96,172 96.019,172.392 96.0767,172.78 96.1724,173.161 96.3047,173.531 96.4722,173.886 96.6743,174.222 96.9082,174.538 97.1714,174.829 97.4624,175.092 97.7778,175.326 98.1143,175.528 98.4692,175.695 98.8389,175.828 99.2197,175.923 99.6079,175.981 100,176 100.392,175.981 100.78,175.923 101.161,175.828 101.531,175.695 101.886,175.528 102.222,175.326 102.538,175.092 102.829,174.829 103.092,174.538 103.326,174.222 103.528,173.886 103.695,173.531 103.828,173.161 103.923,172.78 103.981,172.392 104,172"/>
<polyline fill="none" stroke="#0000ff" stroke-width="0.5" points="154,172 153.981,171.608 153.923,171.22 153.828,170.839 153.695,170.469 153.528,170.114 153.326,169.778 153.092,169.462 152.829,169.171 152.538,168.908 152.222,168.674 151.886,168.472 151.531,168.305 151.161,168.172 150.78,168.077 150.392,168.019 150,168 149.608,168.019 149.22,168.077 148.839,168.172 148.469,168.305 148.114,168.472 147.778,168.674 147.462,168.908 147.171,169.171 146.908,169.462 146.674,169.778 146.472,170.114 146.305,170.469 146.172,170.839 146.077,171.22 146.019,171.608 146,172 146.019,172.392 146.077,172.78 146.172,173.161 146.305,173.531 146.472,173.886 146.674,174.222 146.908,174.538 147.171,174.829 147.462,175.092 147.778,175.326 148.114,175.528 148.469,175.695 148.839,175.828 149.22,175.923 149.608,175.981 150,176 150.392,175.981 150.78,175.923 151.161,175.828 151.531,175.695 151.886,175.528 152.222,175.326 152.538,175.092 152.829,174.829 153.092,174.538 153.326,174.222 153.528,173.886 153.695,173.531 153.828,173.161 153.923,172.78 153.981,172.392 154,172"/>
<polyline fill="none" stroke="#0000ff" stroke-width="0.5" points="204,171 203.981,170.608 203.923,170.22 203.828,169.839 203.695,169.469 203.528,169.114 203.326,168.778 203.092,168.462 202.829,168.171 202.538,167.908 202.222,167.674 201.886,167.472 201.531,167.305 201.161,167.172 200.78,167.077 200.392,167.019 200,167 199.608,167.019 199.22,167.077 198.839,167.172 198.469,167.305 198.114,167.472 197.778,167.674 197.462,167.908 197.171,168.171 196.908,168.462 196.674,168.778 196.472,169.114 196.305,169.469 196.172,169.839 196.077,170.22 196.019,170.608 196,171 196.019,171.392 196.077,171.78 196.172,172.161 196.305,172.531 196.472,172.886 196.674,173.222 196.908,173.538 197.171,173.829 197.462,174.092 197.778,174.326 198.114,174.528 198.469,174.695 198.839,174.828 199.22,174.923 199.608,174.981 200,175 200.392,174.981 200.78,174.923 201.161,174.828 201.531,174.695 201.886,174.528 202.222,174.326 202.538,174.092 202.829,173.829 203.092,173.538 203.326,173.222 203.528,172.886 203.695,172.531 203.828,172.161 203.923,171.78 203.981,171.392 204,171"/>
<polyline fill="none" stroke="#0000ff" stroke-width="0.5" points="254,170 253.981,169.608 253.923,169.22 253.828,168.839 253.695,168.469 253.528,168.114 253.326,167.778 253.092,167.462 252.829,167.171 252.538,166.908 252.222,166.674 251.886,166.472 251.531,166.305 251.161,166.172 250.78,166.077 250.392,166.019 250,166 249.608,166.019 249.22,166.077 248.839,166.172 248.469,166.305 248.114,166.472 247.778,166.674 247.462,166.908 247.171,167.171 246.908,167.462 246.674,167.778 246.472,168.114 246.305,168.469 246.172,168.839 246.077,169.22 246.019,169.608 246,170 246.019,170.392 246.077,170.78 246.172,171.161 246.305,171.531 246.472,171.886 246.674,172.222 246.908,172.538 247.171,172.829 247.462,173.092 247.778,173.326 248.114,173.528 248.469,173.695 248.839,173.828 249.22,173.923 249.608,173.981 250,174 250.392,173.981 250.78,173.923 251.161,173.828 251.531,173.695 251.886,173.528 252.222,173.326 252.538,173.092 252.829,172.829 253.092,172.538 253.326,172.222 253.528,171.886 253.695,171.531 253.828,171.161 253.923,170.78 253.981,170.392 254,170"/>
<polyline fill="none" stroke="#0000ff" stroke-width="0.5" points="304,168 303.981,167.608 303.923,167.22 303.828,166.839 303.695,166.469 303.528,166.114 303.326,165.778 303.092,165.462 302.829,165.171 302.538,164.908 302.222,164.674 301.886,164.472 301.531,164.305 301.161,164.172 300.78,164.077 300.392,164.019 300,164 299.608,164.019 299.22,164.077 298.839,164.172 298.469,164.305 298.114,164.472 297.778,164.674 297.462,164.908 297.171,165.171 296.908,165.462 296.674,165.778 296.472,166.114 296.305,166.469 296.172,166.839 296.077,167.22 296.019,167.608 296,168 296.019,168.392 296.077,168.78 296.172,169.161 296.305,169.531 296.472,169.886 296.674,170.222 296.908,170.538 297.171,170.829 297.462,171.092 297.778,171.326 298.114,171.528 298.469,171.695 298.839,171.828 299.22,171.923 299.608,171.981 300,172 300.392,171.981 300.78,171.923 301.161,171.828 301.531,171.695 301.886,171.528 302.222,171.326 302.538,171.092 302.829,170.829 303.092,170.538 303.326,170.222 303.528,169.886 303.695,169.531 303.828,169.161 303.923,168.78 303.981,168.392 304,168"/>
<polyline fill="none" stroke="#0000ff" stroke-width="0.5" points="350.44,162.026 350.392,162.019 350,162 349.608,162.019 349.22,162.077 348.839,162.172 348.469,162.305 348.114,162.472 347.778,162.674 347.462,162.908 347.171,163.171 346.908,163.462 346.674,163.778 346.472,164.114 346.305,164.469 346.172,164.839 346.077,165.22 346.019,165.608 346,166 346.019,166.392 346.077,166.78 346.172,167.161 346.305,167.531 346.472,167.886 346.674,168.222 346.908,168.538 347.171,168.829 347.462,169.092 347.778,169.326 348.114,169.528 348.469,169.695 348.839,169.828 349.22,169.923 349.608,169.981 350,170 350.392,169.981 350.44,169.974"/>
<polygon fill="#ffffff" points="346.25,30.7202 279.7,58.1602 279.7,30.7202"/>
<polygon fill="#ffffff" points="346.25,58.1602 279.7,58.1602 346.25,30.7202"/>
<polyline fill="none" stroke="#000000" stroke-width="0.5" points="279.7,58.1602 279.7,30.7202 346.25,30.7202 346.25,58.1602 279.7,58.1602"/>
<text fill="#000000" style="stroke:none" x="320" y="42" transform="rotate(0, 320, 42)" font-size="10" font-family="SansSerif" font-style="normal" font-weight="normal">Data</text>
<text fill="#000000" style="stroke:none" x="320" y="54" transform="rotate(0, 320, 54)" font-size="10" font-family="SansSerif" font-style="normal" font-weight="normal">ODE</text>
<polyline fill="none" stroke="#0000ff" stroke-width="0.5" points="283.45,50.4399 298.45,50.4399 313.45,50.4399"/>
<polyline fill="none" stroke="#0000ff" stroke-width="0.5" points="287,50 286.981,49.6079 286.923,49.2197 286.828,48.8389 286.695,48.4692 286.528,48.1143 286.326,47.7778 286.092,47.4624 285.829,47.1714 285.538,46.9082 285.222,46.6743 284.886,46.4722 284.531,46.3047 284.161,46.1724 283.78,46.0767 283.392,46.019 283,46 282.608,46.019 282.22,46.0767 281.839,46.1724 281.469,46.3047 281.114,46.4722 280.778,46.6743 280.462,46.9082 280.171,47.1714 279.908,47.4624 279.674,47.7778 279.472,48.1143 279.305,48.4692 279.172,48.8389 279.077,49.2197 279.019,49.6079 279,50 279.019,50.3921 279.077,50.7803 279.172,51.1611 279.305,51.5308 279.472,51.8857 279.674,52.2222 279.908,52.5376 280.171,52.8286 280.462,53.0923 280.778,53.3257 281.114,53.5278 281.469,53.6953 281.839,53.8276 282.22,53.9233 282.608,53.981 283,54 283.392,53.981 283.78,53.9233 284.161,53.8276 284.531,53.6953 284.886,53.5278 285.222,53.3257 285.538,53.0923 285.829,52.8286 286.092,52.5376 286.326,52.2222 286.528,51.8857 286.695,51.5308 286.828,51.1611 286.923,50.7803 286.981,50.3921 287,50"/>
<polyline fill="none" stroke="#0000ff" stroke-width="0.5" points="302,50 301.981,49.6079 301.923,49.2197 301.828,48.8389 301.695,48.4692 301.528,48.1143 301.326,47.7778 301.092,47.4624 300.829,47.1714 300.538,46.9082 300.222,46.6743 299.886,46.4722 299.531,46.3047 299.161,46.1724 298.78,46.0767 298.392,46.019 298,46 297.608,46.019 297.22,46.0767 296.839,46.1724 296.469,46.3047 296.114,46.4722 295.778,46.6743 295.462,46.9082 295.171,47.1714 294.908,47.4624 294.674,47.7778 294.472,48.1143 294.305,48.4692 294.172,48.8389 294.077,49.2197 294.019,49.6079 294,50 294.019,50.3921 294.077,50.7803 294.172,51.1611 294.305,51.5308 294.472,51.8857 294.674,52.2222 294.908,52.5376 295.171,52.8286 295.462,53.0923 295.778,53.3257 296.114,53.5278 296.469,53.6953 296.839,53.8276 297.22,53.9233 297.608,53.981 298,54 298.392,53.981 298.78,53.9233 299.161,53.8276 299.531,53.6953 299.886,53.5278 300.222,53.3257 300.538,53.0923 300.829,52.8286 301.092,52.5376 301.326,52.2222 301.528,51.8857 301.695,51.5308 301.828,51.1611 301.923,50.7803 301.981,50.3921 302,50"/>
<polyline fill="none" stroke="#0000ff" stroke-width="0.5" points="317,50 316.981,49.6079 316.923,49.2197 316.828,48.8389 316.695,48.4692 316.528,48.1143 316.326,47.7778 316.092,47.4624 315.829,47.1714 315.538,46.9082 315.222,46.6743 314.886,46.4722 314.531,46.3047 314.161,46.1724 313.78,46.0767 313.392,46.019 313,46 312.608,46.019 312.22,46.0767 311.839,46.1724 311.469,46.3047 311.114,46.4722 310.778,46.6743 310.462,46.9082 310.171,47.1714 309.908,47.4624 309.674,47.7778 309.472,48.1143 309.305,48.4692 309.172,48.8389 309.077,49.2197 309.019,49.6079 309,50 309.019,50.3921 309.077,50.7803 309.172,51.1611 309.305,51.5308 309.472,51.8857 309.674,52.2222 309.908,52.5376 310.171,52.8286 310.462,53.0923 310.778,53.3257 311.114,53.5278 311.469,53.6953 311.839,53.8276 312.22,53.9233 312.608,53.981 313,54 313.392,53.981 313.78,53.9233 314.161,53.8276 314.531,53.6953 314.886,53.5278 315.222,53.3257 315.538,53.0923 315.829,52.8286 316.092,52.5376 316.326,52.2222 316.528,51.8857 316.695,51.5308 316.828,51.1611 316.923,50.7803 316.981,50.3921 317,50"/>
<polyline fill="none" stroke="#ff0000" stroke-width="0.5" points="279,38 287,38"/>
<polyline fill="none" stroke="#ff0000" stroke-width="0.5" points="283,42 283,34"/>
<polyline fill="none" stroke="#ff0000" stroke-width="0.5" points="280.171,35.1714 285.829,40.8286"/>
<polyline fill="none" stroke="#ff0000" stroke-width="0.5" points="280.171,40.8286 285.829,35.1714"/>
<polyline fill="none" stroke="#ff0000" stroke-width="0.5" points="294,38 302,38"/>
<polyline fill="none" stroke="#ff0000" stroke-width="0.5" points="298,42 298,34"/>
<polyline fill="none" stroke="#ff0000" stroke-width="0.5" points="295.171,35.1714 300.829,40.8286"/>
<polyline fill="none" stroke="#ff0000" stroke-width="0.5" points="295.171,40.8286 300.829,35.1714"/>
<polyline fill="none" stroke="#ff0000" stroke-width="0.5" points="309,38 317,38"/>
<polyline fill="none" stroke="#ff0000" stroke-width="0.5" points="313,42 313,34"/>
<polyline fill="none" stroke="#ff0000" stroke-width="0.5" points="310.171,35.1714 315.829,40.8286"/>
<polyline fill="none" stroke="#ff0000" stroke-width="0.5" points="310.171,40.8286 315.829,35.1714"/>
<polyline fill="none" stroke="#000000" stroke-width="0.5" points="50.0625,201.25 50.0625,28.75"/>
<polyline fill="none" stroke="#000000" stroke-width="0.5" points="50.0625,201.25 45.5625,201.25"/>
<polyline fill="none" stroke="#000000" stroke-width="0.5" points="50.0625,172.5 45.5625,172.5"/>
<polyline fill="none" stroke="#000000" stroke-width="0.5" points="50.0625,143.75 45.5625,143.75"/>
<polyline fill="none" stroke="#000000" stroke-width="0.5" points="50.0625,115 45.5625,115"/>
<polyline fill="none" stroke="#000000" stroke-width="0.5" points="50.0625,86.25 45.5625,86.25"/>
<polyline fill="none" stroke="#000000" stroke-width="0.5" points="50.0625,57.5 45.5625,57.5"/>
<polyline fill="none" stroke="#000000" stroke-width="0.5" points="50.0625,28.75 45.5625,28.75"/>
<text fill="#000000" style="stroke:none" x="22" y="206" transform="rotate(0, 22, 206)" font-size="10" font-family="SansSerif" font-style="normal" font-weight="normal">-500</text>
<text fill="#000000" style="stroke:none" x="37" y="177" transform="rotate(0, 37, 177)" font-size="10" font-family="SansSerif" font-style="normal" font-weight="normal">0</text>
<text fill="#000000" style="stroke:none" x="25" y="149" transform="rotate(0, 25, 149)" font-size="10" font-family="SansSerif" font-style="normal" font-weight="normal">500</text>
<text fill="#000000" style="stroke:none" x="20" y="120" transform="rotate(0, 20, 120)" font-size="10" font-family="SansSerif" font-style="normal" font-weight="normal">1000</text>
<text fill="#000000" style="stroke:none" x="20" y="91" transform="rotate(0, 20, 91)" font-size="10" font-family="SansSerif" font-style="normal" font-weight="normal">1500</text>
<text fill="#000000" style="stroke:none" x="19" y="62" transform="rotate(0, 19, 62)" font-size="10" font-family="SansSerif" font-style="normal" font-weight="normal">2000</text>
<text fill="#000000" style="stroke:none" x="19" y="34" transform="rotate(0, 19, 34)" font-size="10" font-family="SansSerif" font-style="normal" font-weight="normal">2500</text>
<polyline fill="none" stroke="#000000" stroke-width="0.5" points="50.0625,201.25 350.438,201.25"/>
<polyline fill="none" stroke="#000000" stroke-width="0.5" points="50.0625,201.25 50.0625,204.25"/>
<polyline fill="none" stroke="#000000" stroke-width="0.5" points="100.125,201.25 100.125,204.25"/>
<polyline fill="none" stroke="#000000" stroke-width="0.5" points="150.188,201.25 150.188,204.25"/>
<polyline fill="none" stroke="#000000" stroke-width="0.5" points="200.25,201.25 200.25,204.25"/>
<polyline fill="none" stroke="#000000" stroke-width="0.5" points="250.313,201.25 250.313,204.25"/>
<polyline fill="none" stroke="#000000" stroke-width="0.5" points="300.375,201.25 300.375,204.25"/>
<polyline fill="none" stroke="#000000" stroke-width="0.5" points="350.438,201.25 350.438,204.25"/>
<polyline fill="none" stroke="#000000" stroke-width="0.5" points="60.0752,201.25 60.0752,203.05"/>
<polyline fill="none" stroke="#000000" stroke-width="0.5" points="70.0874,201.25 70.0874,203.05"/>
<polyline fill="none" stroke="#000000" stroke-width="0.5" points="80.1001,201.25 80.1001,203.05"/>
<polyline fill="none" stroke="#000000" stroke-width="0.5" points="90.1123,201.25 90.1123,203.05"/>
<polyline fill="none" stroke="#000000" stroke-width="0.5" points="110.138,201.25 110.138,203.05"/>
<polyline fill="none" stroke="#000000" stroke-width="0.5" points="120.15,201.25 120.15,203.05"/>
<polyline fill="none" stroke="#000000" stroke-width="0.5" points="130.163,201.25 130.163,203.05"/>
<polyline fill="none" stroke="#000000" stroke-width="0.5" points="140.175,201.25 140.175,203.05"/>
<polyline fill="none" stroke="#000000" stroke-width="0.5" points="160.2,201.25 160.2,203.05"/>
<polyline fill="none" stroke="#000000" stroke-width="0.5" points="170.212,201.25 170.212,203.05"/>
<polyline fill="none" stroke="#000000" stroke-width="0.5" points="180.225,201.25 180.225,203.05"/>
<polyline fill="none" stroke="#000000" stroke-width="0.5" points="190.237,201.25 190.237,203.05"/>
<polyline fill="none" stroke="#000000" stroke-width="0.5" points="210.263,201.25 210.263,203.05"/>
<polyline fill="none" stroke="#000000" stroke-width="0.5" points="220.275,201.25 220.275,203.05"/>
<polyline fill="none" stroke="#000000" stroke-width="0.5" points="230.288,201.25 230.288,203.05"/>
<polyline fill="none" stroke="#000000" stroke-width="0.5" points="240.3,201.25 240.3,203.05"/>
<polyline fill="none" stroke="#000000" stroke-width="0.5" points="260.325,201.25 260.325,203.05"/>
<polyline fill="none" stroke="#000000" stroke-width="0.5" points="270.337,201.25 270.337,203.05"/>
<polyline fill="none" stroke="#000000" stroke-width="0.5" points="280.35,201.25 280.35,203.05"/>
<polyline fill="none" stroke="#000000" stroke-width="0.5" points="290.362,201.25 290.362,203.05"/>
<polyline fill="none" stroke="#000000" stroke-width="0.5" points="310.388,201.25 310.388,203.05"/>
<polyline fill="none" stroke="#000000" stroke-width="0.5" points="320.4,201.25 320.4,203.05"/>
<polyline fill="none" stroke="#000000" stroke-width="0.5" points="330.413,201.25 330.413,203.05"/>
<polyline fill="none" stroke="#000000" stroke-width="0.5" points="340.425,201.25 340.425,203.05"/>
<text fill="#000000" style="stroke:none" x="47" y="215" transform="rotate(0, 47, 215)" font-size="10" font-family="SansSerif" font-style="normal" font-weight="normal">0</text>
<text fill="#000000" style="stroke:none" x="98" y="215" transform="rotate(0, 98, 215)" font-size="10" font-family="SansSerif" font-style="normal" font-weight="normal">1</text>
<text fill="#000000" style="stroke:none" x="147" y="215" transform="rotate(0, 147, 215)" font-size="10" font-family="SansSerif" font-style="normal" font-weight="normal">2</text>
<text fill="#000000" style="stroke:none" x="197" y="215" transform="rotate(0, 197, 215)" font-size="10" font-family="SansSerif" font-style="normal" font-weight="normal">3</text>
<text fill="#000000" style="stroke:none" x="247" y="215" transform="rotate(0, 247, 215)" font-size="10" font-family="SansSerif" font-style="normal" font-weight="normal">4</text>
<text fill="#000000" style="stroke:none" x="297" y="215" transform="rotate(0, 297, 215)" font-size="10" font-family="SansSerif" font-style="normal" font-weight="normal">5</text>
<text fill="#000000" style="stroke:none" x="347" y="215" transform="rotate(0, 347, 215)" font-size="10" font-family="SansSerif" font-style="normal" font-weight="normal">6</text>
<text fill="#000000" style="stroke:none" x="147" y="20" transform="rotate(0, 147, 20)" font-size="10" font-family="SansSerif" font-style="normal" font-weight="normal">Before Optimization</text>
<text fill="#000000" style="stroke:none" x="198" y="228" transform="rotate(0, 198, 228)" font-size="10" font-family="SansSerif" font-style="normal" font-weight="normal">t</text>
<text fill="#000000" style="stroke:none" x="11" y="121" transform="rotate(270, 11, 121)" font-size="10" font-family="SansSerif" font-style="normal" font-weight="normal">Y1</text>
<polyline fill="none" stroke="#000000" stroke-width="0.5" points="450.563,201.25 450.563,28.75 450.563,28.75 750.938,28.75 750.938,201.25 750.938,201.25 450.563,201.25"/>
<polyline fill="none" stroke="#000000" stroke-width="0.5" points="750.938,28.75 450.563,28.75"/>
<polyline fill="none" stroke="#000000" stroke-width="0.5" points="750.938,28.75 750.938,201.25"/>
<polyline fill="none" stroke="#000000" stroke-width="0.5" points="750.938,28.75 750.938,28.75"/>
<polygon fill="#ffffff" points="450.563,201.25 450.563,28.75 450.563,28.75"/>
<polygon fill="#ffffff" points="450.563,201.25 450.563,28.75 450.563,201.25"/>
<polygon fill="#ffffff" points="450.563,201.25 750.938,201.25 750.938,201.25"/>
<polygon fill="#ffffff" points="450.563,201.25 750.938,201.25 450.563,201.25"/>
<polygon fill="#ffffff" points="450.563,201.25 750.938,201.25 750.938,28.75"/>
<polygon fill="#ffffff" points="450.563,201.25 750.938,28.75 450.563,28.75"/>
<polyline fill="none" stroke="#ff0000" stroke-width="0.5" points="450.56,201 455,201"/>
<polyline fill="none" stroke="#ff0000" stroke-width="0.5" points="451,201.252 451,197"/>
<polyline fill="none" stroke="#ff0000" stroke-width="0.5" points="450.56,200.56 451.252,201.252"/>
<polyline fill="none" stroke="#ff0000" stroke-width="0.5" points="450.748,201.252 453.829,198.171"/>
<polyline fill="none" stroke="#ff0000" stroke-width="0.5" points="497,201 505,201"/>
<polyline fill="none" stroke="#ff0000" stroke-width="0.5" points="501,201.252 501,197"/>
<polyline fill="none" stroke="#ff0000" stroke-width="0.5" points="498.171,198.171 501.252,201.252"/>
<polyline fill="none" stroke="#ff0000" stroke-width="0.5" points="500.748,201.252 503.829,198.171"/>
<polyline fill="none" stroke="#ff0000" stroke-width="0.5" points="547,199 555,199"/>
<polyline fill="none" stroke="#ff0000" stroke-width="0.5" points="551,201.252 551,195"/>
<polyline fill="none" stroke="#ff0000" stroke-width="0.5" points="548.171,196.171 553.252,201.252"/>
<polyline fill="none" stroke="#ff0000" stroke-width="0.5" points="548.748,201.252 553.829,196.171"/>
<polyline fill="none" stroke="#ff0000" stroke-width="0.5" points="597,194 605,194"/>
<polyline fill="none" stroke="#ff0000" stroke-width="0.5" points="601,198 601,190"/>
<polyline fill="none" stroke="#ff0000" stroke-width="0.5" points="598.171,191.171 603.829,196.829"/>
<polyline fill="none" stroke="#ff0000" stroke-width="0.5" points="598.171,196.829 603.829,191.171"/>
<polyline fill="none" stroke="#ff0000" stroke-width="0.5" points="647,181 655,181"/>
<polyline fill="none" stroke="#ff0000" stroke-width="0.5" points="651,185 651,177"/>
<polyline fill="none" stroke="#ff0000" stroke-width="0.5" points="648.171,178.171 653.829,183.829"/>
<polyline fill="none" stroke="#ff0000" stroke-width="0.5" points="648.171,183.829 653.829,178.171"/>
<polyline fill="none" stroke="#ff0000" stroke-width="0.5" points="697,145 705,145"/>
<polyline fill="none" stroke="#ff0000" stroke-width="0.5" points="701,149 701,141"/>
<polyline fill="none" stroke="#ff0000" stroke-width="0.5" points="698.171,142.171 703.829,147.829"/>
<polyline fill="none" stroke="#ff0000" stroke-width="0.5" points="698.171,147.829 703.829,142.171"/>
<polyline fill="none" stroke="#ff0000" stroke-width="0.5" points="747,46 750.94,46"/>
<polyline fill="none" stroke="#ff0000" stroke-width="0.5" points="748.171,43.1714 750.94,45.9404"/>
<polyline fill="none" stroke="#ff0000" stroke-width="0.5" points="748.171,48.8286 750.94,46.0596"/>
<polyline fill="none" stroke="#0000ff" stroke-width="0.5" points="450.563,201.078 500.625,200.732 550.688,199.697 600.75,197.973 650.813,195.558 700.875,192.453 750.938,188.658"/>
<polyline fill="none" stroke="#0000ff" stroke-width="0.5" points="455,201 454.98,200.608 454.923,200.22 454.828,199.839 454.695,199.469 454.528,199.114 454.326,198.778 454.092,198.462 453.829,198.171 453.538,197.908 453.222,197.674 452.886,197.472 452.531,197.305 452.161,197.172 451.78,197.077 451.392,197.019 451,197 450.608,197.019 450.56,197.026"/>
<polyline fill="none" stroke="#0000ff" stroke-width="0.5" points="454.988,201.252 455,201"/>
<polyline fill="none" stroke="#0000ff" stroke-width="0.5" points="505,201 504.981,200.608 504.923,200.22 504.828,199.839 504.695,199.469 504.528,199.114 504.326,198.778 504.092,198.462 503.829,198.171 503.538,197.908 503.222,197.674 502.886,197.472 502.531,197.305 502.161,197.172 501.78,197.077 501.392,197.019 501,197 500.608,197.019 500.22,197.077 499.839,197.172 499.469,197.305 499.114,197.472 498.778,197.674 498.462,197.908 498.171,198.171 497.908,198.462 497.674,198.778 497.472,199.114 497.305,199.469 497.172,199.839 497.077,200.22 497.019,200.608 497,201 497.012,201.252"/>
<polyline fill="none" stroke="#0000ff" stroke-width="0.5" points="504.988,201.252 505,201"/>
<polyline fill="none" stroke="#0000ff" stroke-width="0.5" points="555,200 554.981,199.608 554.923,199.22 554.828,198.839 554.695,198.469 554.528,198.114 554.326,197.778 554.092,197.462 553.829,197.171 553.538,196.908 553.222,196.674 552.886,196.472 552.531,196.305 552.161,196.172 551.78,196.077 551.392,196.019 551,196 550.608,196.019 550.22,196.077 549.839,196.172 549.469,196.305 549.114,196.472 548.778,196.674 548.462,196.908 548.171,197.171 547.908,197.462 547.674,197.778 547.472,198.114 547.305,198.469 547.172,198.839 547.077,199.22 547.019,199.608 547,200 547.019,200.392 547.077,200.78 547.172,201.161 547.205,201.252"/>
<polyline fill="none" stroke="#0000ff" stroke-width="0.5" points="554.795,201.252 554.828,201.161 554.923,200.78 554.981,200.392 555,200"/>
<polyline fill="none" stroke="#0000ff" stroke-width="0.5" points="605,198 604.981,197.608 604.923,197.22 604.828,196.839 604.695,196.469 604.528,196.114 604.326,195.778 604.092,195.462 603.829,195.171 603.538,194.908 603.222,194.674 602.886,194.472 602.531,194.305 602.161,194.172 601.78,194.077 601.392,194.019 601,194 600.608,194.019 600.22,194.077 599.839,194.172 599.469,194.305 599.114,194.472 598.778,194.674 598.462,194.908 598.171,195.171 597.908,195.462 597.674,195.778 597.472,196.114 597.305,196.469 597.172,196.839 597.077,197.22 597.019,197.608 597,198 597.019,198.392 597.077,198.78 597.172,199.161 597.305,199.531 597.472,199.886 597.674,200.222 597.908,200.538 598.171,200.829 598.462,201.092 598.678,201.252"/>
<polyline fill="none" stroke="#0000ff" stroke-width="0.5" points="603.322,201.252 603.538,201.092 603.829,200.829 604.092,200.538 604.326,200.222 604.528,199.886 604.695,199.531 604.828,199.161 604.923,198.78 604.981,198.392 605,198"/>
<polyline fill="none" stroke="#0000ff" stroke-width="0.5" points="655,196 654.981,195.608 654.923,195.22 654.828,194.839 654.695,194.469 654.528,194.114 654.326,193.778 654.092,193.462 653.829,193.171 653.538,192.908 653.222,192.674 652.886,192.472 652.531,192.305 652.161,192.172 651.78,192.077 651.392,192.019 651,192 650.608,192.019 650.22,192.077 649.839,192.172 649.469,192.305 649.114,192.472 648.778,192.674 648.462,192.908 648.171,193.171 647.908,193.462 647.674,193.778 647.472,194.114 647.305,194.469 647.172,194.839 647.077,195.22 647.019,195.608 647,196 647.019,196.392 647.077,196.78 647.172,197.161 647.305,197.531 647.472,197.886 647.674,198.222 647.908,198.538 648.171,198.829 648.462,199.092 648.778,199.326 649.114,199.528 649.469,199.695 649.839,199.828 650.22,199.923 650.608,199.981 651,200 651.392,199.981 651.78,199.923 652.161,199.828 652.531,199.695 652.886,199.528 653.222,199.326 653.538,199.092 653.829,198.829 654.092,198.538 654.326,198.222 654.528,197.886 654.695,197.531 654.828,197.161 654.923,196.78 654.981,196.392 655,196"/>
<polyline fill="none" stroke="#0000ff" stroke-width="0.5" points="705,192 704.981,191.608 704.923,191.22 704.828,190.839 704.695,190.469 704.528,190.114 704.326,189.778 704.092,189.462 703.829,189.171 703.538,188.908 703.222,188.674 702.886,188.472 702.531,188.305 702.161,188.172 701.78,188.077 701.392,188.019 701,188 700.608,188.019 700.22,188.077 699.839,188.172 699.469,188.305 699.114,188.472 698.778,188.674 698.462,188.908 698.171,189.171 697.908,189.462 697.674,189.778 697.472,190.114 697.305,190.469 697.172,190.839 697.077,191.22 697.019,191.608 697,192 697.019,192.392 697.077,192.78 697.172,193.161 697.305,193.531 697.472,193.886 697.674,194.222 697.908,194.538 698.171,194.829 698.462,195.092 698.778,195.326 699.114,195.528 699.469,195.695 699.839,195.828 700.22,195.923 700.608,195.981 701,196 701.392,195.981 701.78,195.923 702.161,195.828 702.531,195.695 702.886,195.528 703.222,195.326 703.538,195.092 703.829,194.829 704.092,194.538 704.326,194.222 704.528,193.886 704.695,193.531 704.828,193.161 704.923,192.78 704.981,192.392 705,192"/>
<polyline fill="none" stroke="#0000ff" stroke-width="0.5" points="750.94,185.003 750.608,185.019 750.22,185.077 749.839,185.172 749.469,185.305 749.114,185.472 748.778,185.674 748.462,185.908 748.171,186.171 747.908,186.462 747.674,186.778 747.472,187.114 747.305,187.469 747.172,187.839 747.077,188.22 747.019,188.608 747,189 747.019,189.392 747.077,189.78 747.172,190.161 747.305,190.531 747.472,190.886 747.674,191.222 747.908,191.538 748.171,191.829 748.462,192.092 748.778,192.326 749.114,192.528 749.469,192.695 749.839,192.828 750.22,192.923 750.608,192.981 750.94,192.997"/>
<polygon fill="#ffffff" points="746.25,30.7202 679.7,58.1602 679.7,30.7202"/>
<polygon fill="#ffffff" points="746.25,58.1602 679.7,58.1602 746.25,30.7202"/>
<polyline fill="none" stroke="#000000" stroke-width="0.5" points="679.7,58.1602 679.7,30.7202 746.25,30.7202 746.25,58.1602 679.7,58.1602"/>
<text fill="#000000" style="stroke:none" x="720" y="42" transform="rotate(0, 720, 42)" font-size="10" font-family="SansSerif" font-style="normal" font-weight="normal">Data</text>
<text fill="#000000" style="stroke:none" x="720" y="54" transform="rotate(0, 720, 54)" font-size="10" font-family="SansSerif" font-style="normal" font-weight="normal">ODE</text>
<polyline fill="none" stroke="#0000ff" stroke-width="0.5" points="683.45,50.4399 698.45,50.4399 713.45,50.4399"/>
<polyline fill="none" stroke="#0000ff" stroke-width="0.5" points="687,50 686.981,49.6079 686.923,49.2197 686.828,48.8389 686.695,48.4692 686.528,48.1143 686.326,47.7778 686.092,47.4624 685.829,47.1714 685.538,46.9082 685.222,46.6743 684.886,46.4722 684.531,46.3047 684.161,46.1724 683.78,46.0767 683.392,46.019 683,46 682.608,46.019 682.22,46.0767 681.839,46.1724 681.469,46.3047 681.114,46.4722 680.778,46.6743 680.462,46.9082 680.171,47.1714 679.908,47.4624 679.674,47.7778 679.472,48.1143 679.305,48.4692 679.172,48.8389 679.077,49.2197 679.019,49.6079 679,50 679.019,50.3921 679.077,50.7803 679.172,51.1611 679.305,51.5308 679.472,51.8857 679.674,52.2222 679.908,52.5376 680.171,52.8286 680.462,53.0923 680.778,53.3257 681.114,53.5278 681.469,53.6953 681.839,53.8276 682.22,53.9233 682.608,53.981 683,54 683.392,53.981 683.78,53.9233 684.161,53.8276 684.531,53.6953 684.886,53.5278 685.222,53.3257 685.538,53.0923 685.829,52.8286 686.092,52.5376 686.326,52.2222 686.528,51.8857 686.695,51.5308 686.828,51.1611 686.923,50.7803 686.981,50.3921 687,50"/>
<polyline fill="none" stroke="#0000ff" stroke-width="0.5" points="702,50 701.981,49.6079 701.923,49.2197 701.828,48.8389 701.695,48.4692 701.528,48.1143 701.326,47.7778 701.092,47.4624 700.829,47.1714 700.538,46.9082 700.222,46.6743 699.886,46.4722 699.531,46.3047 699.161,46.1724 698.78,46.0767 698.392,46.019 698,46 697.608,46.019 697.22,46.0767 696.839,46.1724 696.469,46.3047 696.114,46.4722 695.778,46.6743 695.462,46.9082 695.171,47.1714 694.908,47.4624 694.674,47.7778 694.472,48.1143 694.305,48.4692 694.172,48.8389 694.077,49.2197 694.019,49.6079 694,50 694.019,50.3921 694.077,50.7803 694.172,51.1611 694.305,51.5308 694.472,51.8857 694.674,52.2222 694.908,52.5376 695.171,52.8286 695.462,53.0923 695.778,53.3257 696.114,53.5278 696.469,53.6953 696.839,53.8276 697.22,53.9233 697.608,53.981 698,54 698.392,53.981 698.78,53.9233 699.161,53.8276 699.531,53.6953 699.886,53.5278 700.222,53.3257 700.538,53.0923 700.829,52.8286 701.092,52.5376 701.326,52.2222 701.528,51.8857 701.695,51.5308 701.828,51.1611 701.923,50.7803 701.981,50.3921 702,50"/>
<polyline fill="none" stroke="#0000ff" stroke-width="0.5" points="717,50 716.981,49.6079 716.923,49.2197 716.828,48.8389 716.695,48.4692 716.528,48.1143 716.326,47.7778 716.092,47.4624 715.829,47.1714 715.538,46.9082 715.222,46.6743 714.886,46.4722 714.531,46.3047 714.161,46.1724 713.78,46.0767 713.392,46.019 713,46 712.608,46.019 712.22,46.0767 711.839,46.1724 711.469,46.3047 711.114,46.4722 710.778,46.6743 710.462,46.9082 710.171,47.1714 709.908,47.4624 709.674,47.7778 709.472,48.1143 709.305,48.4692 709.172,48.8389 709.077,49.2197 709.019,49.6079 709,50 709.019,50.3921 709.077,50.7803 709.172,51.1611 709.305,51.5308 709.472,51.8857 709.674,52.2222 709.908,52.5376 710.171,52.8286 710.462,53.0923 710.778,53.3257 711.114,53.5278 711.469,53.6953 711.839,53.8276 712.22,53.9233 712.608,53.981 713,54 713.392,53.981 713.78,53.9233 714.161,53.8276 714.531,53.6953 714.886,53.5278 715.222,53.3257 715.538,53.0923 715.829,52.8286 716.092,52.5376 716.326,52.2222 716.528,51.8857 716.695,51.5308 716.828,51.1611 716.923,50.7803 716.981,50.3921 717,50"/>
<polyline fill="none" stroke="#ff0000" stroke-width="0.5" points="679,38 687,38"/>
<polyline fill="none" stroke="#ff0000" stroke-width="0.5" points="683,42 683,34"/>
<polyline fill="none" stroke="#ff0000" stroke-width="0.5" points="680.171,35.1714 685.829,40.8286"/>
<polyline fill="none" stroke="#ff0000" stroke-width="0.5" points="680.171,40.8286 685.829,35.1714"/>
<polyline fill="none" stroke="#ff0000" stroke-width="0.5" points="694,38 702,38"/>
<polyline fill="none" stroke="#ff0000" stroke-width="0.5" points="698,42 698,34"/>
<polyline fill="none" stroke="#ff0000" stroke-width="0.5" points="695.171,35.1714 700.829,40.8286"/>
<polyline fill="none" stroke="#ff0000" stroke-width="0.5" points="695.171,40.8286 700.829,35.1714"/>
<polyline fill="none" stroke="#ff0000" stroke-width="0.5" points="709,38 717,38"/>
<polyline fill="none" stroke="#ff0000" stroke-width="0.5" points="713,42 713,34"/>
<polyline fill="none" stroke="#ff0000" stroke-width="0.5" points="710.171,35.1714 715.829,40.8286"/>
<polyline fill="none" stroke="#ff0000" stroke-width="0.5" points="710.171,40.8286 715.829,35.1714"/>
<polyline fill="none" stroke="#000000" stroke-width="0.5" points="450.563,201.25 450.563,28.75"/>
<polyline fill="none" stroke="#000000" stroke-width="0.5" points="450.563,201.25 446.063,201.25"/>
<polyline fill="none" stroke="#000000" stroke-width="0.5" points="450.563,184 446.063,184"/>
<polyline fill="none" stroke="#000000" stroke-width="0.5" points="450.563,166.75 446.063,166.75"/>
<polyline fill="none" stroke="#000000" stroke-width="0.5" points="450.563,149.5 446.063,149.5"/>
<polyline fill="none" stroke="#000000" stroke-width="0.5" points="450.563,132.25 446.063,132.25"/>
<polyline fill="none" stroke="#000000" stroke-width="0.5" points="450.563,115 446.063,115"/>
<polyline fill="none" stroke="#000000" stroke-width="0.5" points="450.563,97.75 446.063,97.75"/>
<polyline fill="none" stroke="#000000" stroke-width="0.5" points="450.563,80.5 446.063,80.5"/>
<polyline fill="none" stroke="#000000" stroke-width="0.5" points="450.563,63.25 446.063,63.25"/>
<polyline fill="none" stroke="#000000" stroke-width="0.5" points="450.563,46 446.063,46"/>
<polyline fill="none" stroke="#000000" stroke-width="0.5" points="450.563,28.75 446.063,28.75"/>
<polyline fill="none" stroke="#000000" stroke-width="0.5" points="450.563,192.625 447.862,192.625"/>
<polyline fill="none" stroke="#000000" stroke-width="0.5" points="450.563,175.375 447.862,175.375"/>
<polyline fill="none" stroke="#000000" stroke-width="0.5" points="450.563,158.125 447.862,158.125"/>
<polyline fill="none" stroke="#000000" stroke-width="0.5" points="450.563,140.875 447.862,140.875"/>
<polyline fill="none" stroke="#000000" stroke-width="0.5" points="450.563,123.625 447.862,123.625"/>
<polyline fill="none" stroke="#000000" stroke-width="0.5" points="450.563,106.375 447.862,106.375"/>
<polyline fill="none" stroke="#000000" stroke-width="0.5" points="450.563,89.125 447.862,89.125"/>
<polyline fill="none" stroke="#000000" stroke-width="0.5" points="450.563,71.875 447.862,71.875"/>
<polyline fill="none" stroke="#000000" stroke-width="0.5" points="450.563,54.625 447.862,54.625"/>
<polyline fill="none" stroke="#000000" stroke-width="0.5" points="450.563,37.375 447.862,37.375"/>
<text fill="#000000" style="stroke:none" x="438" y="206" transform="rotate(0, 438, 206)" font-size="10" font-family="SansSerif" font-style="normal" font-weight="normal">0</text>
<text fill="#000000" style="stroke:none" x="427" y="189" transform="rotate(0, 427, 189)" font-size="10" font-family="SansSerif" font-style="normal" font-weight="normal">100</text>
<text fill="#000000" style="stroke:none" x="426" y="172" transform="rotate(0, 426, 172)" font-size="10" font-family="SansSerif" font-style="normal" font-weight="normal">200</text>
<text fill="#000000" style="stroke:none" x="426" y="154" transform="rotate(0, 426, 154)" font-size="10" font-family="SansSerif" font-style="normal" font-weight="normal">300</text>
<text fill="#000000" style="stroke:none" x="426" y="137" transform="rotate(0, 426, 137)" font-size="10" font-family="SansSerif" font-style="normal" font-weight="normal">400</text>
<text fill="#000000" style="stroke:none" x="426" y="120" transform="rotate(0, 426, 120)" font-size="10" font-family="SansSerif" font-style="normal" font-weight="normal">500</text>
<text fill="#000000" style="stroke:none" x="426" y="103" transform="rotate(0, 426, 103)" font-size="10" font-family="SansSerif" font-style="normal" font-weight="normal">600</text>
<text fill="#000000" style="stroke:none" x="426" y="85" transform="rotate(0, 426, 85)" font-size="10" font-family="SansSerif" font-style="normal" font-weight="normal">700</text>
<text fill="#000000" style="stroke:none" x="426" y="68" transform="rotate(0, 426, 68)" font-size="10" font-family="SansSerif" font-style="normal" font-weight="normal">800</text>
<text fill="#000000" style="stroke:none" x="426" y="51" transform="rotate(0, 426, 51)" font-size="10" font-family="SansSerif" font-style="normal" font-weight="normal">900</text>
<text fill="#000000" style="stroke:none" x="421" y="34" transform="rotate(0, 421, 34)" font-size="10" font-family="SansSerif" font-style="normal" font-weight="normal">1000</text>
<polyline fill="none" stroke="#000000" stroke-width="0.5" points="450.563,201.25 750.938,201.25"/>
<polyline fill="none" stroke="#000000" stroke-width="0.5" points="450.563,201.25 450.563,204.25"/>
<polyline fill="none" stroke="#000000" stroke-width="0.5" points="500.625,201.25 500.625,204.25"/>
<polyline fill="none" stroke="#000000" stroke-width="0.5" points="550.688,201.25 550.688,204.25"/>
<polyline fill="none" stroke="#000000" stroke-width="0.5" points="600.75,201.25 600.75,204.25"/>
<polyline fill="none" stroke="#000000" stroke-width="0.5" points="650.813,201.25 650.813,204.25"/>
<polyline fill="none" stroke="#000000" stroke-width="0.5" points="700.875,201.25 700.875,204.25"/>
<polyline fill="none" stroke="#000000" stroke-width="0.5" points="750.938,201.25 750.938,204.25"/>
<polyline fill="none" stroke="#000000" stroke-width="0.5" points="460.575,201.25 460.575,203.05"/>
<polyline fill="none" stroke="#000000" stroke-width="0.5" points="470.587,201.25 470.587,203.05"/>
<polyline fill="none" stroke="#000000" stroke-width="0.5" points="480.6,201.25 480.6,203.05"/>
<polyline fill="none" stroke="#000000" stroke-width="0.5" points="490.612,201.25 490.612,203.05"/>
<polyline fill="none" stroke="#000000" stroke-width="0.5" points="510.638,201.25 510.638,203.05"/>
<polyline fill="none" stroke="#000000" stroke-width="0.5" points="520.65,201.25 520.65,203.05"/>
<polyline fill="none" stroke="#000000" stroke-width="0.5" points="530.663,201.25 530.663,203.05"/>
<polyline fill="none" stroke="#000000" stroke-width="0.5" points="540.675,201.25 540.675,203.05"/>
<polyline fill="none" stroke="#000000" stroke-width="0.5" points="560.7,201.25 560.7,203.05"/>
<polyline fill="none" stroke="#000000" stroke-width="0.5" points="570.712,201.25 570.712,203.05"/>
<polyline fill="none" stroke="#000000" stroke-width="0.5" points="580.725,201.25 580.725,203.05"/>
<polyline fill="none" stroke="#000000" stroke-width="0.5" points="590.737,201.25 590.737,203.05"/>
<polyline fill="none" stroke="#000000" stroke-width="0.5" points="610.763,201.25 610.763,203.05"/>
<polyline fill="none" stroke="#000000" stroke-width="0.5" points="620.775,201.25 620.775,203.05"/>
<polyline fill="none" stroke="#000000" stroke-width="0.5" points="630.788,201.25 630.788,203.05"/>
<polyline fill="none" stroke="#000000" stroke-width="0.5" points="640.8,201.25 640.8,203.05"/>
<polyline fill="none" stroke="#000000" stroke-width="0.5" points="660.825,201.25 660.825,203.05"/>
<polyline fill="none" stroke="#000000" stroke-width="0.5" points="670.837,201.25 670.837,203.05"/>
<polyline fill="none" stroke="#000000" stroke-width="0.5" points="680.85,201.25 680.85,203.05"/>
<polyline fill="none" stroke="#000000" stroke-width="0.5" points="690.862,201.25 690.862,203.05"/>
<polyline fill="none" stroke="#000000" stroke-width="0.5" points="710.888,201.25 710.888,203.05"/>
<polyline fill="none" stroke="#000000" stroke-width="0.5" points="720.9,201.25 720.9,203.05"/>
<polyline fill="none" stroke="#000000" stroke-width="0.5" points="730.913,201.25 730.913,203.05"/>
<polyline fill="none" stroke="#000000" stroke-width="0.5" points="740.925,201.25 740.925,203.05"/>
<text fill="#000000" style="stroke:none" x="447" y="215" transform="rotate(0, 447, 215)" font-size="10" font-family="SansSerif" font-style="normal" font-weight="normal">0</text>
<text fill="#000000" style="stroke:none" x="498" y="215" transform="rotate(0, 498, 215)" font-size="10" font-family="SansSerif" font-style="normal" font-weight="normal">1</text>
<text fill="#000000" style="stroke:none" x="547" y="215" transform="rotate(0, 547, 215)" font-size="10" font-family="SansSerif" font-style="normal" font-weight="normal">2</text>
<text fill="#000000" style="stroke:none" x="597" y="215" transform="rotate(0, 597, 215)" font-size="10" font-family="SansSerif" font-style="normal" font-weight="normal">3</text>
<text fill="#000000" style="stroke:none" x="647" y="215" transform="rotate(0, 647, 215)" font-size="10" font-family="SansSerif" font-style="normal" font-weight="normal">4</text>
<text fill="#000000" style="stroke:none" x="697" y="215" transform="rotate(0, 697, 215)" font-size="10" font-family="SansSerif" font-style="normal" font-weight="normal">5</text>
<text fill="#000000" style="stroke:none" x="747" y="215" transform="rotate(0, 747, 215)" font-size="10" font-family="SansSerif" font-style="normal" font-weight="normal">6</text>
<text fill="#000000" style="stroke:none" x="548" y="20" transform="rotate(0, 548, 20)" font-size="10" font-family="SansSerif" font-style="normal" font-weight="normal">Before Optimization</text>
<text fill="#000000" style="stroke:none" x="599" y="228" transform="rotate(0, 599, 228)" font-size="10" font-family="SansSerif" font-style="normal" font-weight="normal">t</text>
<text fill="#000000" style="stroke:none" x="413" y="122" transform="rotate(270, 413, 122)" font-size="10" font-family="SansSerif" font-style="normal" font-weight="normal">Y2</text>
<polyline fill="none" stroke="#000000" stroke-width="0.5" points="50.0625,431.25 50.0625,258.75 50.0625,258.75 350.438,258.75 350.438,431.25 350.438,431.25 50.0625,431.25"/>
<polyline fill="none" stroke="#000000" stroke-width="0.5" points="350.438,258.75 50.0625,258.75"/>
<polyline fill="none" stroke="#000000" stroke-width="0.5" points="350.438,258.75 350.438,431.25"/>
<polyline fill="none" stroke="#000000" stroke-width="0.5" points="350.438,258.75 350.438,258.75"/>
<polygon fill="#ffffff" points="50.0625,431.25 50.0625,258.75 50.0625,258.75"/>
<polygon fill="#ffffff" points="50.0625,431.25 50.0625,258.75 50.0625,431.25"/>
<polygon fill="#ffffff" points="50.0625,431.25 350.438,431.25 350.438,431.25"/>
<polygon fill="#ffffff" points="50.0625,431.25 350.438,431.25 50.0625,431.25"/>
<polygon fill="#ffffff" points="50.0625,431.25 350.438,431.25 350.438,258.75"/>
<polygon fill="#ffffff" points="50.0625,431.25 350.438,258.75 50.0625,258.75"/>
<polyline fill="none" stroke="#ff0000" stroke-width="0.5" points="50.0596,408 54,408"/>
<polyline fill="none" stroke="#ff0000" stroke-width="0.5" points="50.0596,408.06 52.8286,410.829"/>
<polyline fill="none" stroke="#ff0000" stroke-width="0.5" points="50.0596,407.94 52.8286,405.171"/>
<polyline fill="none" stroke="#ff0000" stroke-width="0.5" points="96,404 104,404"/>
<polyline fill="none" stroke="#ff0000" stroke-width="0.5" points="100,408 100,400"/>
<polyline fill="none" stroke="#ff0000" stroke-width="0.5" points="97.1714,401.171 102.829,406.829"/>
<polyline fill="none" stroke="#ff0000" stroke-width="0.5" points="97.1714,406.829 102.829,401.171"/>
<polyline fill="none" stroke="#ff0000" stroke-width="0.5" points="146,393 154,393"/>
<polyline fill="none" stroke="#ff0000" stroke-width="0.5" points="150,397 150,389"/>
<polyline fill="none" stroke="#ff0000" stroke-width="0.5" points="147.171,390.171 152.829,395.829"/>
<polyline fill="none" stroke="#ff0000" stroke-width="0.5" points="147.171,395.829 152.829,390.171"/>
<polyline fill="none" stroke="#ff0000" stroke-width="0.5" points="196,375 204,375"/>
<polyline fill="none" stroke="#ff0000" stroke-width="0.5" points="200,379 200,371"/>
<polyline fill="none" stroke="#ff0000" stroke-width="0.5" points="197.171,372.171 202.829,377.829"/>
<polyline fill="none" stroke="#ff0000" stroke-width="0.5" points="197.171,377.829 202.829,372.171"/>
<polyline fill="none" stroke="#ff0000" stroke-width="0.5" points="246,349 254,349"/>
<polyline fill="none" stroke="#ff0000" stroke-width="0.5" points="250,353 250,345"/>
<polyline fill="none" stroke="#ff0000" stroke-width="0.5" points="247.171,346.171 252.829,351.829"/>
<polyline fill="none" stroke="#ff0000" stroke-width="0.5" points="247.171,351.829 252.829,346.171"/>
<polyline fill="none" stroke="#ff0000" stroke-width="0.5" points="296,315 304,315"/>
<polyline fill="none" stroke="#ff0000" stroke-width="0.5" points="300,319 300,311"/>
<polyline fill="none" stroke="#ff0000" stroke-width="0.5" points="297.171,312.171 302.829,317.829"/>
<polyline fill="none" stroke="#ff0000" stroke-width="0.5" points="297.171,317.829 302.829,312.171"/>
<polyline fill="none" stroke="#ff0000" stroke-width="0.5" points="346,275 350.44,275"/>
<polyline fill="none" stroke="#ff0000" stroke-width="0.5" points="350,279 350,271"/>
<polyline fill="none" stroke="#ff0000" stroke-width="0.5" points="347.171,272.171 350.44,275.44"/>
<polyline fill="none" stroke="#ff0000" stroke-width="0.5" points="347.171,277.829 350.44,274.56"/>
<polyline fill="none" stroke="#0000ff" stroke-width="0.5" points="50.0625,407.839 100.125,404.143 150.188,393.054 200.25,374.571 250.313,348.696 300.375,315.429 350.438,274.768"/>
<polyline fill="none" stroke="#0000ff" stroke-width="0.5" points="54,408 53.981,407.608 53.9233,407.22 53.8276,406.839 53.6953,406.469 53.5278,406.114 53.3257,405.778 53.0918,405.462 52.8286,405.171 52.5376,404.908 52.2222,404.674 51.8857,404.472 51.5308,404.305 51.1611,404.172 50.7803,404.077 50.3921,404.019 50.0596,404.003"/>
<polyline fill="none" stroke="#0000ff" stroke-width="0.5" points="50.0596,411.997 50.3921,411.981 50.7803,411.923 51.1611,411.828 51.5308,411.695 51.8857,411.528 52.2222,411.326 52.5376,411.092 52.8286,410.829 53.0918,410.538 53.3257,410.222 53.5278,409.886 53.6953,409.531 53.8276,409.161 53.9233,408.78 53.981,408.392 54,408"/>
<polyline fill="none" stroke="#0000ff" stroke-width="0.5" points="104,404 103.981,403.608 103.923,403.22 103.828,402.839 103.695,402.469 103.528,402.114 103.326,401.778 103.092,401.462 102.829,401.171 102.538,400.908 102.222,400.674 101.886,400.472 101.531,400.305 101.161,400.172 100.78,400.077 100.392,400.019 100,400 99.6079,400.019 99.2197,400.077 98.8389,400.172 98.4692,400.305 98.1143,400.472 97.7778,400.674 97.4624,400.908 97.1714,401.171 96.9082,401.462 96.6743,401.778 96.4722,402.114 96.3047,402.469 96.1724,402.839 96.0767,403.22 96.019,403.608 96,404 96.019,404.392 96.0767,404.78 96.1724,405.161 96.3047,405.531 96.4722,405.886 96.6743,406.222 96.9082,406.538 97.1714,406.829 97.4624,407.092 97.7778,407.326 98.1143,407.528 98.4692,407.695 98.8389,407.828 99.2197,407.923 99.6079,407.981 100,408 100.392,407.981 100.78,407.923 101.161,407.828 101.531,407.695 101.886,407.528 102.222,407.326 102.538,407.092 102.829,406.829 103.092,406.538 103.326,406.222 103.528,405.886 103.695,405.531 103.828,405.161 103.923,404.78 103.981,404.392 104,404"/>
<polyline fill="none" stroke="#0000ff" stroke-width="0.5" points="154,393 153.981,392.608 153.923,392.22 153.828,391.839 153.695,391.469 153.528,391.114 153.326,390.778 153.092,390.462 152.829,390.171 152.538,389.908 152.222,389.674 151.886,389.472 151.531,389.305 151.161,389.172 150.78,389.077 150.392,389.019 150,389 149.608,389.019 149.22,389.077 148.839,389.172 148.469,389.305 148.114,389.472 147.778,389.674 147.462,389.908 147.171,390.171 146.908,390.462 146.674,390.778 146.472,391.114 146.305,391.469 146.172,391.839 146.077,392.22 146.019,392.608 146,393 146.019,393.392 146.077,393.78 146.172,394.161 146.305,394.531 146.472,394.886 146.674,395.222 146.908,395.538 147.171,395.829 147.462,396.092 147.778,396.326 148.114,396.528 148.469,396.695 148.839,396.828 149.22,396.923 149.608,396.981 150,397 150.392,396.981 150.78,396.923 151.161,396.828 151.531,396.695 151.886,396.528 152.222,396.326 152.538,396.092 152.829,395.829 153.092,395.538 153.326,395.222 153.528,394.886 153.695,394.531 153.828,394.161 153.923,393.78 153.981,393.392 154,393"/>
<polyline fill="none" stroke="#0000ff" stroke-width="0.5" points="204,375 203.981,374.608 203.923,374.22 203.828,373.839 203.695,373.469 203.528,373.114 203.326,372.778 203.092,372.462 202.829,372.171 202.538,371.908 202.222,371.674 201.886,371.472 201.531,371.305 201.161,371.172 200.78,371.077 200.392,371.019 200,371 199.608,371.019 199.22,371.077 198.839,371.172 198.469,371.305 198.114,371.472 197.778,371.674 197.462,371.908 197.171,372.171 196.908,372.462 196.674,372.778 196.472,373.114 196.305,373.469 196.172,373.839 196.077,374.22 196.019,374.608 196,375 196.019,375.392 196.077,375.78 196.172,376.161 196.305,376.531 196.472,376.886 196.674,377.222 196.908,377.538 197.171,377.829 197.462,378.092 197.778,378.326 198.114,378.528 198.469,378.695 198.839,378.828 199.22,378.923 199.608,378.981 200,379 200.392,378.981 200.78,378.923 201.161,378.828 201.531,378.695 201.886,378.528 202.222,378.326 202.538,378.092 202.829,377.829 203.092,377.538 203.326,377.222 203.528,376.886 203.695,376.531 203.828,376.161 203.923,375.78 203.981,375.392 204,375"/>
<polyline fill="none" stroke="#0000ff" stroke-width="0.5" points="254,349 253.981,348.608 253.923,348.22 253.828,347.839 253.695,347.469 253.528,347.114 253.326,346.778 253.092,346.462 252.829,346.171 252.538,345.908 252.222,345.674 251.886,345.472 251.531,345.305 251.161,345.172 250.78,345.077 250.392,345.019 250,345 249.608,345.019 249.22,345.077 248.839,345.172 248.469,345.305 248.114,345.472 247.778,345.674 247.462,345.908 247.171,346.171 246.908,346.462 246.674,346.778 246.472,347.114 246.305,347.469 246.172,347.839 246.077,348.22 246.019,348.608 246,349 246.019,349.392 246.077,349.78 246.172,350.161 246.305,350.531 246.472,350.886 246.674,351.222 246.908,351.538 247.171,351.829 247.462,352.092 247.778,352.326 248.114,352.528 248.469,352.695 248.839,352.828 249.22,352.923 249.608,352.981 250,353 250.392,352.981 250.78,352.923 251.161,352.828 251.531,352.695 251.886,352.528 252.222,352.326 252.538,352.092 252.829,351.829 253.092,351.538 253.326,351.222 253.528,350.886 253.695,350.531 253.828,350.161 253.923,349.78 253.981,349.392 254,349"/>
<polyline fill="none" stroke="#0000ff" stroke-width="0.5" points="304,315 303.981,314.608 303.923,314.22 303.828,313.839 303.695,313.469 303.528,313.114 303.326,312.778 303.092,312.462 302.829,312.171 302.538,311.908 302.222,311.674 301.886,311.472 301.531,311.305 301.161,311.172 300.78,311.077 300.392,311.019 300,311 299.608,311.019 299.22,311.077 298.839,311.172 298.469,311.305 298.114,311.472 297.778,311.674 297.462,311.908 297.171,312.171 296.908,312.462 296.674,312.778 296.472,313.114 296.305,313.469 296.172,313.839 296.077,314.22 296.019,314.608 296,315 296.019,315.392 296.077,315.78 296.172,316.161 296.305,316.531 296.472,316.886 296.674,317.222 296.908,317.538 297.171,317.829 297.462,318.092 297.778,318.326 298.114,318.528 298.469,318.695 298.839,318.828 299.22,318.923 299.608,318.981 300,319 300.392,318.981 300.78,318.923 301.161,318.828 301.531,318.695 301.886,318.528 302.222,318.326 302.538,318.092 302.829,317.829 303.092,317.538 303.326,317.222 303.528,316.886 303.695,316.531 303.828,316.161 303.923,315.78 303.981,315.392 304,315"/>
<polyline fill="none" stroke="#0000ff" stroke-width="0.5" points="350.44,271.026 350.392,271.019 350,271 349.608,271.019 349.22,271.077 348.839,271.172 348.469,271.305 348.114,271.472 347.778,271.674 347.462,271.908 347.171,272.171 346.908,272.462 346.674,272.778 346.472,273.114 346.305,273.469 346.172,273.839 346.077,274.22 346.019,274.608 346,275 346.019,275.392 346.077,275.78 346.172,276.161 346.305,276.531 346.472,276.886 346.674,277.222 346.908,277.538 347.171,277.829 347.462,278.092 347.778,278.326 348.114,278.528 348.469,278.695 348.839,278.828 349.22,278.923 349.608,278.981 350,279 350.392,278.981 350.44,278.974"/>
<polygon fill="#ffffff" points="346.25,260.72 279.7,288.16 279.7,260.72"/>
<polygon fill="#ffffff" points="346.25,288.16 279.7,288.16 346.25,260.72"/>
<polyline fill="none" stroke="#000000" stroke-width="0.5" points="279.7,288.16 279.7,260.72 346.25,260.72 346.25,288.16 279.7,288.16"/>
<text fill="#000000" style="stroke:none" x="320" y="272" transform="rotate(0, 320, 272)" font-size="10" font-family="SansSerif" font-style="normal" font-weight="normal">Data</text>
<text fill="#000000" style="stroke:none" x="320" y="284" transform="rotate(0, 320, 284)" font-size="10" font-family="SansSerif" font-style="normal" font-weight="normal">ODE</text>
<polyline fill="none" stroke="#0000ff" stroke-width="0.5" points="283.45,280.44 298.45,280.44 313.45,280.44"/>
<polyline fill="none" stroke="#0000ff" stroke-width="0.5" points="287,280 286.981,279.608 286.923,279.22 286.828,278.839 286.695,278.469 286.528,278.114 286.326,277.778 286.092,277.462 285.829,277.171 285.538,276.908 285.222,276.674 284.886,276.472 284.531,276.305 284.161,276.172 283.78,276.077 283.392,276.019 283,276 282.608,276.019 282.22,276.077 281.839,276.172 281.469,276.305 281.114,276.472 280.778,276.674 280.462,276.908 280.171,277.171 279.908,277.462 279.674,277.778 279.472,278.114 279.305,278.469 279.172,278.839 279.077,279.22 279.019,279.608 279,280 279.019,280.392 279.077,280.78 279.172,281.161 279.305,281.531 279.472,281.886 279.674,282.222 279.908,282.538 280.171,282.829 280.462,283.092 280.778,283.326 281.114,283.528 281.469,283.695 281.839,283.828 282.22,283.923 282.608,283.981 283,284 283.392,283.981 283.78,283.923 284.161,283.828 284.531,283.695 284.886,283.528 285.222,283.326 285.538,283.092 285.829,282.829 286.092,282.538 286.326,282.222 286.528,281.886 286.695,281.531 286.828,281.161 286.923,280.78 286.981,280.392 287,280"/>
<polyline fill="none" stroke="#0000ff" stroke-width="0.5" points="302,280 301.981,279.608 301.923,279.22 301.828,278.839 301.695,278.469 301.528,278.114 301.326,277.778 301.092,277.462 300.829,277.171 300.538,276.908 300.222,276.674 299.886,276.472 299.531,276.305 299.161,276.172 298.78,276.077 298.392,276.019 298,276 297.608,276.019 297.22,276.077 296.839,276.172 296.469,276.305 296.114,276.472 295.778,276.674 295.462,276.908 295.171,277.171 294.908,277.462 294.674,277.778 294.472,278.114 294.305,278.469 294.172,278.839 294.077,279.22 294.019,279.608 294,280 294.019,280.392 294.077,280.78 294.172,281.161 294.305,281.531 294.472,281.886 294.674,282.222 294.908,282.538 295.171,282.829 295.462,283.092 295.778,283.326 296.114,283.528 296.469,283.695 296.839,283.828 297.22,283.923 297.608,283.981 298,284 298.392,283.981 298.78,283.923 299.161,283.828 299.531,283.695 299.886,283.528 300.222,283.326 300.538,283.092 300.829,282.829 301.092,282.538 301.326,282.222 301.528,281.886 301.695,281.531 301.828,281.161 301.923,280.78 301.981,280.392 302,280"/>
<polyline fill="none" stroke="#0000ff" stroke-width="0.5" points="317,280 316.981,279.608 316.923,279.22 316.828,278.839 316.695,278.469 316.528,278.114 316.326,277.778 316.092,277.462 315.829,277.171 315.538,276.908 315.222,276.674 314.886,276.472 314.531,276.305 314.161,276.172 313.78,276.077 313.392,276.019 313,276 312.608,276.019 312.22,276.077 311.839,276.172 311.469,276.305 311.114,276.472 310.778,276.674 310.462,276.908 310.171,277.171 309.908,277.462 309.674,277.778 309.472,278.114 309.305,278.469 309.172,278.839 309.077,279.22 309.019,279.608 309,280 309.019,280.392 309.077,280.78 309.172,281.161 309.305,281.531 309.472,281.886 309.674,282.222 309.908,282.538 310.171,282.829 310.462,283.092 310.778,283.326 311.114,283.528 311.469,283.695 311.839,283.828 312.22,283.923 312.608,283.981 313,284 313.392,283.981 313.78,283.923 314.161,283.828 314.531,283.695 314.886,283.528 315.222,283.326 315.538,283.092 315.829,282.829 316.092,282.538 316.326,282.222 316.528,281.886 316.695,281.531 316.828,281.161 316.923,280.78 316.981,280.392 317,280"/>
<polyline fill="none" stroke="#ff0000" stroke-width="0.5" points="279,268 287,268"/>
<polyline fill="none" stroke="#ff0000" stroke-width="0.5" points="283,272 283,264"/>
<polyline fill="none" stroke="#ff0000" stroke-width="0.5" points="280.171,265.171 285.829,270.829"/>
<polyline fill="none" stroke="#ff0000" stroke-width="0.5" points="280.171,270.829 285.829,265.171"/>
<polyline fill="none" stroke="#ff0000" stroke-width="0.5" points="294,268 302,268"/>
<polyline fill="none" stroke="#ff0000" stroke-width="0.5" points="298,272 298,264"/>
<polyline fill="none" stroke="#ff0000" stroke-width="0.5" points="295.171,265.171 300.829,270.829"/>
<polyline fill="none" stroke="#ff0000" stroke-width="0.5" points="295.171,270.829 300.829,265.171"/>
<polyline fill="none" stroke="#ff0000" stroke-width="0.5" points="309,268 317,268"/>
<polyline fill="none" stroke="#ff0000" stroke-width="0.5" points="313,272 313,264"/>
<polyline fill="none" stroke="#ff0000" stroke-width="0.5" points="310.171,265.171 315.829,270.829"/>
<polyline fill="none" stroke="#ff0000" stroke-width="0.5" points="310.171,270.829 315.829,265.171"/>
<polyline fill="none" stroke="#000000" stroke-width="0.5" points="50.0625,431.25 50.0625,258.75"/>
<polyline fill="none" stroke="#000000" stroke-width="0.5" points="50.0625,431.25 45.5625,431.25"/>
<polyline fill="none" stroke="#000000" stroke-width="0.5" points="50.0625,406.607 45.5625,406.607"/>
<polyline fill="none" stroke="#000000" stroke-width="0.5" points="50.0625,381.964 45.5625,381.964"/>
<polyline fill="none" stroke="#000000" stroke-width="0.5" points="50.0625,357.321 45.5625,357.321"/>
<polyline fill="none" stroke="#000000" stroke-width="0.5" points="50.0625,332.679 45.5625,332.679"/>
<polyline fill="none" stroke="#000000" stroke-width="0.5" points="50.0625,308.036 45.5625,308.036"/>
<polyline fill="none" stroke="#000000" stroke-width="0.5" points="50.0625,283.393 45.5625,283.393"/>
<polyline fill="none" stroke="#000000" stroke-width="0.5" points="50.0625,258.75 45.5625,258.75"/>
<polyline fill="none" stroke="#000000" stroke-width="0.5" points="50.0625,418.929 47.3623,418.929"/>
<polyline fill="none" stroke="#000000" stroke-width="0.5" points="50.0625,394.286 47.3623,394.286"/>
<polyline fill="none" stroke="#000000" stroke-width="0.5" points="50.0625,369.643 47.3623,369.643"/>
<polyline fill="none" stroke="#000000" stroke-width="0.5" points="50.0625,345 47.3623,345"/>
<polyline fill="none" stroke="#000000" stroke-width="0.5" points="50.0625,320.357 47.3623,320.357"/>
<polyline fill="none" stroke="#000000" stroke-width="0.5" points="50.0625,295.714 47.3623,295.714"/>
<polyline fill="none" stroke="#000000" stroke-width="0.5" points="50.0625,271.071 47.3623,271.071"/>
<text fill="#000000" style="stroke:none" x="28" y="436" transform="rotate(0, 28, 436)" font-size="10" font-family="SansSerif" font-style="normal" font-weight="normal">-20</text>
<text fill="#000000" style="stroke:none" x="37" y="412" transform="rotate(0, 37, 412)" font-size="10" font-family="SansSerif" font-style="normal" font-weight="normal">0</text>
<text fill="#000000" style="stroke:none" x="31" y="387" transform="rotate(0, 31, 387)" font-size="10" font-family="SansSerif" font-style="normal" font-weight="normal">20</text>
<text fill="#000000" style="stroke:none" x="31" y="362" transform="rotate(0, 31, 362)" font-size="10" font-family="SansSerif" font-style="normal" font-weight="normal">40</text>
<text fill="#000000" style="stroke:none" x="31" y="338" transform="rotate(0, 31, 338)" font-size="10" font-family="SansSerif" font-style="normal" font-weight="normal">60</text>
<text fill="#000000" style="stroke:none" x="31" y="313" transform="rotate(0, 31, 313)" font-size="10" font-family="SansSerif" font-style="normal" font-weight="normal">80</text>
<text fill="#000000" style="stroke:none" x="26" y="288" transform="rotate(0, 26, 288)" font-size="10" font-family="SansSerif" font-style="normal" font-weight="normal">100</text>
<text fill="#000000" style="stroke:none" x="26" y="264" transform="rotate(0, 26, 264)" font-size="10" font-family="SansSerif" font-style="normal" font-weight="normal">120</text>
<polyline fill="none" stroke="#000000" stroke-width="0.5" points="50.0625,431.25 350.438,431.25"/>
<polyline fill="none" stroke="#000000" stroke-width="0.5" points="50.0625,431.25 50.0625,434.25"/>
<polyline fill="none" stroke="#000000" stroke-width="0.5" points="100.125,431.25 100.125,434.25"/>
<polyline fill="none" stroke="#000000" stroke-width="0.5" points="150.188,431.25 150.188,434.25"/>
<polyline fill="none" stroke="#000000" stroke-width="0.5" points="200.25,431.25 200.25,434.25"/>
<polyline fill="none" stroke="#000000" stroke-width="0.5" points="250.313,431.25 250.313,434.25"/>
<polyline fill="none" stroke="#000000" stroke-width="0.5" points="300.375,431.25 300.375,434.25"/>
<polyline fill="none" stroke="#000000" stroke-width="0.5" points="350.438,431.25 350.438,434.25"/>
<polyline fill="none" stroke="#000000" stroke-width="0.5" points="60.0752,431.25 60.0752,433.05"/>
<polyline fill="none" stroke="#000000" stroke-width="0.5" points="70.0874,431.25 70.0874,433.05"/>
<polyline fill="none" stroke="#000000" stroke-width="0.5" points="80.1001,431.25 80.1001,433.05"/>
<polyline fill="none" stroke="#000000" stroke-width="0.5" points="90.1123,431.25 90.1123,433.05"/>
<polyline fill="none" stroke="#000000" stroke-width="0.5" points="110.138,431.25 110.138,433.05"/>
<polyline fill="none" stroke="#000000" stroke-width="0.5" points="120.15,431.25 120.15,433.05"/>
<polyline fill="none" stroke="#000000" stroke-width="0.5" points="130.163,431.25 130.163,433.05"/>
<polyline fill="none" stroke="#000000" stroke-width="0.5" points="140.175,431.25 140.175,433.05"/>
<polyline fill="none" stroke="#000000" stroke-width="0.5" points="160.2,431.25 160.2,433.05"/>
<polyline fill="none" stroke="#000000" stroke-width="0.5" points="170.212,431.25 170.212,433.05"/>
<polyline fill="none" stroke="#000000" stroke-width="0.5" points="180.225,431.25 180.225,433.05"/>
<polyline fill="none" stroke="#000000" stroke-width="0.5" points="190.237,431.25 190.237,433.05"/>
<polyline fill="none" stroke="#000000" stroke-width="0.5" points="210.263,431.25 210.263,433.05"/>
<polyline fill="none" stroke="#000000" stroke-width="0.5" points="220.275,431.25 220.275,433.05"/>
<polyline fill="none" stroke="#000000" stroke-width="0.5" points="230.288,431.25 230.288,433.05"/>
<polyline fill="none" stroke="#000000" stroke-width="0.5" points="240.3,431.25 240.3,433.05"/>
<polyline fill="none" stroke="#000000" stroke-width="0.5" points="260.325,431.25 260.325,433.05"/>
<polyline fill="none" stroke="#000000" stroke-width="0.5" points="270.337,431.25 270.337,433.05"/>
<polyline fill="none" stroke="#000000" stroke-width="0.5" points="280.35,431.25 280.35,433.05"/>
<polyline fill="none" stroke="#000000" stroke-width="0.5" points="290.362,431.25 290.362,433.05"/>
<polyline fill="none" stroke="#000000" stroke-width="0.5" points="310.388,431.25 310.388,433.05"/>
<polyline fill="none" stroke="#000000" stroke-width="0.5" points="320.4,431.25 320.4,433.05"/>
<polyline fill="none" stroke="#000000" stroke-width="0.5" points="330.413,431.25 330.413,433.05"/>
<polyline fill="none" stroke="#000000" stroke-width="0.5" points="340.425,431.25 340.425,433.05"/>
<text fill="#000000" style="stroke:none" x="47" y="445" transform="rotate(0, 47, 445)" font-size="10" font-family="SansSerif" font-style="normal" font-weight="normal">0</text>
<text fill="#000000" style="stroke:none" x="98" y="445" transform="rotate(0, 98, 445)" font-size="10" font-family="SansSerif" font-style="normal" font-weight="normal">1</text>
<text fill="#000000" style="stroke:none" x="147" y="445" transform="rotate(0, 147, 445)" font-size="10" font-family="SansSerif" font-style="normal" font-weight="normal">2</text>
<text fill="#000000" style="stroke:none" x="197" y="445" transform="rotate(0, 197, 445)" font-size="10" font-family="SansSerif" font-style="normal" font-weight="normal">3</text>
<text fill="#000000" style="stroke:none" x="247" y="445" transform="rotate(0, 247, 445)" font-size="10" font-family="SansSerif" font-style="normal" font-weight="normal">4</text>
<text fill="#000000" style="stroke:none" x="297" y="445" transform="rotate(0, 297, 445)" font-size="10" font-family="SansSerif" font-style="normal" font-weight="normal">5</text>
<text fill="#000000" style="stroke:none" x="347" y="445" transform="rotate(0, 347, 445)" font-size="10" font-family="SansSerif" font-style="normal" font-weight="normal">6</text>
<text fill="#000000" style="stroke:none" x="152" y="250" transform="rotate(0, 152, 250)" font-size="10" font-family="SansSerif" font-style="normal" font-weight="normal">After Optimization</text>
<text fill="#000000" style="stroke:none" x="198" y="458" transform="rotate(0, 198, 458)" font-size="10" font-family="SansSerif" font-style="normal" font-weight="normal">t</text>
<text fill="#000000" style="stroke:none" x="20" y="351" transform="rotate(270, 20, 351)" font-size="10" font-family="SansSerif" font-style="normal" font-weight="normal">Y1</text>
<polyline fill="none" stroke="#000000" stroke-width="0.5" points="450.563,431.25 450.563,258.75 450.563,258.75 750.938,258.75 750.938,431.25 750.938,431.25 450.563,431.25"/>
<polyline fill="none" stroke="#000000" stroke-width="0.5" points="750.938,258.75 450.563,258.75"/>
<polyline fill="none" stroke="#000000" stroke-width="0.5" points="750.938,258.75 750.938,431.25"/>
<polyline fill="none" stroke="#000000" stroke-width="0.5" points="750.938,258.75 750.938,258.75"/>
<polygon fill="#ffffff" points="450.563,431.25 450.563,258.75 450.563,258.75"/>
<polygon fill="#ffffff" points="450.563,431.25 450.563,258.75 450.563,431.25"/>
<polygon fill="#ffffff" points="450.563,431.25 750.938,431.25 750.938,431.25"/>
<polygon fill="#ffffff" points="450.563,431.25 750.938,431.25 450.563,431.25"/>
<polygon fill="#ffffff" points="450.563,431.25 750.938,431.25 750.938,258.75"/>
<polygon fill="#ffffff" points="450.563,431.25 750.938,258.75 450.563,258.75"/>
<polyline fill="none" stroke="#ff0000" stroke-width="0.5" points="450.56,429 455,429"/>
<polyline fill="none" stroke="#ff0000" stroke-width="0.5" points="451,431.252 451,425"/>
<polyline fill="none" stroke="#ff0000" stroke-width="0.5" points="450.56,428.56 453.251,431.252"/>
<polyline fill="none" stroke="#ff0000" stroke-width="0.5" points="450.56,429.44 453.829,426.171"/>
<polyline fill="none" stroke="#ff0000" stroke-width="0.5" points="497,425 505,425"/>
<polyline fill="none" stroke="#ff0000" stroke-width="0.5" points="501,429 501,421"/>
<polyline fill="none" stroke="#ff0000" stroke-width="0.5" points="498.171,422.171 503.829,427.829"/>
<polyline fill="none" stroke="#ff0000" stroke-width="0.5" points="498.171,427.829 503.829,422.171"/>
<polyline fill="none" stroke="#ff0000" stroke-width="0.5" points="547,412 555,412"/>
<polyline fill="none" stroke="#ff0000" stroke-width="0.5" points="551,416 551,408"/>
<polyline fill="none" stroke="#ff0000" stroke-width="0.5" points="548.171,409.171 553.829,414.829"/>
<polyline fill="none" stroke="#ff0000" stroke-width="0.5" points="548.171,414.829 553.829,409.171"/>
<polyline fill="none" stroke="#ff0000" stroke-width="0.5" points="597,390 605,390"/>
<polyline fill="none" stroke="#ff0000" stroke-width="0.5" points="601,394 601,386"/>
<polyline fill="none" stroke="#ff0000" stroke-width="0.5" points="598.171,387.171 603.829,392.829"/>
<polyline fill="none" stroke="#ff0000" stroke-width="0.5" points="598.171,392.829 603.829,387.171"/>
<polyline fill="none" stroke="#ff0000" stroke-width="0.5" points="647,360 655,360"/>
<polyline fill="none" stroke="#ff0000" stroke-width="0.5" points="651,364 651,356"/>
<polyline fill="none" stroke="#ff0000" stroke-width="0.5" points="648.171,357.171 653.829,362.829"/>
<polyline fill="none" stroke="#ff0000" stroke-width="0.5" points="648.171,362.829 653.829,357.171"/>
<polyline fill="none" stroke="#ff0000" stroke-width="0.5" points="697,321 705,321"/>
<polyline fill="none" stroke="#ff0000" stroke-width="0.5" points="701,325 701,317"/>
<polyline fill="none" stroke="#ff0000" stroke-width="0.5" points="698.171,318.171 703.829,323.829"/>
<polyline fill="none" stroke="#ff0000" stroke-width="0.5" points="698.171,323.829 703.829,318.171"/>
<polyline fill="none" stroke="#ff0000" stroke-width="0.5" points="747,274 750.94,274"/>
<polyline fill="none" stroke="#ff0000" stroke-width="0.5" points="748.171,271.171 750.94,273.94"/>
<polyline fill="none" stroke="#ff0000" stroke-width="0.5" points="748.171,276.829 750.94,274.06"/>
<polyline fill="none" stroke="#0000ff" stroke-width="0.5" points="450.563,429.094 500.625,424.781 550.688,411.844 600.75,390.281 650.813,360.094 700.875,321.281 750.938,273.844"/>
<polyline fill="none" stroke="#0000ff" stroke-width="0.5" points="455,429 454.98,428.608 454.923,428.22 454.828,427.839 454.695,427.469 454.528,427.114 454.326,426.778 454.092,426.462 453.829,426.171 453.538,425.908 453.222,425.674 452.886,425.472 452.531,425.305 452.161,425.172 451.78,425.077 451.392,425.019 451,425 450.608,425.019 450.56,425.026"/>
<polyline fill="none" stroke="#0000ff" stroke-width="0.5" points="454.304,431.252 454.326,431.222 454.528,430.886 454.695,430.531 454.828,430.161 454.923,429.78 454.98,429.392 455,429"/>
<polyline fill="none" stroke="#0000ff" stroke-width="0.5" points="505,425 504.981,424.608 504.923,424.22 504.828,423.839 504.695,423.469 504.528,423.114 504.326,422.778 504.092,422.462 503.829,422.171 503.538,421.908 503.222,421.674 502.886,421.472 502.531,421.305 502.161,421.172 501.78,421.077 501.392,421.019 501,421 500.608,421.019 500.22,421.077 499.839,421.172 499.469,421.305 499.114,421.472 498.778,421.674 498.462,421.908 498.171,422.171 497.908,422.462 497.674,422.778 497.472,423.114 497.305,423.469 497.172,423.839 497.077,424.22 497.019,424.608 497,425 497.019,425.392 497.077,425.78 497.172,426.161 497.305,426.531 497.472,426.886 497.674,427.222 497.908,427.538 498.171,427.829 498.462,428.092 498.778,428.326 499.114,428.528 499.469,428.695 499.839,428.828 500.22,428.923 500.608,428.981 501,429 501.392,428.981 501.78,428.923 502.161,428.828 502.531,428.695 502.886,428.528 503.222,428.326 503.538,428.092 503.829,427.829 504.092,427.538 504.326,427.222 504.528,426.886 504.695,426.531 504.828,426.161 504.923,425.78 504.981,425.392 505,425"/>
<polyline fill="none" stroke="#0000ff" stroke-width="0.5" points="555,412 554.981,411.608 554.923,411.22 554.828,410.839 554.695,410.469 554.528,410.114 554.326,409.778 554.092,409.462 553.829,409.171 553.538,408.908 553.222,408.674 552.886,408.472 552.531,408.305 552.161,408.172 551.78,408.077 551.392,408.019 551,408 550.608,408.019 550.22,408.077 549.839,408.172 549.469,408.305 549.114,408.472 548.778,408.674 548.462,408.908 548.171,409.171 547.908,409.462 547.674,409.778 547.472,410.114 547.305,410.469 547.172,410.839 547.077,411.22 547.019,411.608 547,412 547.019,412.392 547.077,412.78 547.172,413.161 547.305,413.531 547.472,413.886 547.674,414.222 547.908,414.538 548.171,414.829 548.462,415.092 548.778,415.326 549.114,415.528 549.469,415.695 549.839,415.828 550.22,415.923 550.608,415.981 551,416 551.392,415.981 551.78,415.923 552.161,415.828 552.531,415.695 552.886,415.528 553.222,415.326 553.538,415.092 553.829,414.829 554.092,414.538 554.326,414.222 554.528,413.886 554.695,413.531 554.828,413.161 554.923,412.78 554.981,412.392 555,412"/>
<polyline fill="none" stroke="#0000ff" stroke-width="0.5" points="605,390 604.981,389.608 604.923,389.22 604.828,388.839 604.695,388.469 604.528,388.114 604.326,387.778 604.092,387.462 603.829,387.171 603.538,386.908 603.222,386.674 602.886,386.472 602.531,386.305 602.161,386.172 601.78,386.077 601.392,386.019 601,386 600.608,386.019 600.22,386.077 599.839,386.172 599.469,386.305 599.114,386.472 598.778,386.674 598.462,386.908 598.171,387.171 597.908,387.462 597.674,387.778 597.472,388.114 597.305,388.469 597.172,388.839 597.077,389.22 597.019,389.608 597,390 597.019,390.392 597.077,390.78 597.172,391.161 597.305,391.531 597.472,391.886 597.674,392.222 597.908,392.538 598.171,392.829 598.462,393.092 598.778,393.326 599.114,393.528 599.469,393.695 599.839,393.828 600.22,393.923 600.608,393.981 601,394 601.392,393.981 601.78,393.923 602.161,393.828 602.531,393.695 602.886,393.528 603.222,393.326 603.538,393.092 603.829,392.829 604.092,392.538 604.326,392.222 604.528,391.886 604.695,391.531 604.828,391.161 604.923,390.78 604.981,390.392 605,390"/>
<polyline fill="none" stroke="#0000ff" stroke-width="0.5" points="655,360 654.981,359.608 654.923,359.22 654.828,358.839 654.695,358.469 654.528,358.114 654.326,357.778 654.092,357.462 653.829,357.171 653.538,356.908 653.222,356.674 652.886,356.472 652.531,356.305 652.161,356.172 651.78,356.077 651.392,356.019 651,356 650.608,356.019 650.22,356.077 649.839,356.172 649.469,356.305 649.114,356.472 648.778,356.674 648.462,356.908 648.171,357.171 647.908,357.462 647.674,357.778 647.472,358.114 647.305,358.469 647.172,358.839 647.077,359.22 647.019,359.608 647,360 647.019,360.392 647.077,360.78 647.172,361.161 647.305,361.531 647.472,361.886 647.674,362.222 647.908,362.538 648.171,362.829 648.462,363.092 648.778,363.326 649.114,363.528 649.469,363.695 649.839,363.828 650.22,363.923 650.608,363.981 651,364 651.392,363.981 651.78,363.923 652.161,363.828 652.531,363.695 652.886,363.528 653.222,363.326 653.538,363.092 653.829,362.829 654.092,362.538 654.326,362.222 654.528,361.886 654.695,361.531 654.828,361.161 654.923,360.78 654.981,360.392 655,360"/>
<polyline fill="none" stroke="#0000ff" stroke-width="0.5" points="705,321 704.981,320.608 704.923,320.22 704.828,319.839 704.695,319.469 704.528,319.114 704.326,318.778 704.092,318.462 703.829,318.171 703.538,317.908 703.222,317.674 702.886,317.472 702.531,317.305 702.161,317.172 701.78,317.077 701.392,317.019 701,317 700.608,317.019 700.22,317.077 699.839,317.172 699.469,317.305 699.114,317.472 698.778,317.674 698.462,317.908 698.171,318.171 697.908,318.462 697.674,318.778 697.472,319.114 697.305,319.469 697.172,319.839 697.077,320.22 697.019,320.608 697,321 697.019,321.392 697.077,321.78 697.172,322.161 697.305,322.531 697.472,322.886 697.674,323.222 697.908,323.538 698.171,323.829 698.462,324.092 698.778,324.326 699.114,324.528 699.469,324.695 699.839,324.828 700.22,324.923 700.608,324.981 701,325 701.392,324.981 701.78,324.923 702.161,324.828 702.531,324.695 702.886,324.528 703.222,324.326 703.538,324.092 703.829,323.829 704.092,323.538 704.326,323.222 704.528,322.886 704.695,322.531 704.828,322.161 704.923,321.78 704.981,321.392 705,321"/>
<polyline fill="none" stroke="#0000ff" stroke-width="0.5" points="750.94,270.003 750.608,270.019 750.22,270.077 749.839,270.172 749.469,270.305 749.114,270.472 748.778,270.674 748.462,270.908 748.171,271.171 747.908,271.462 747.674,271.778 747.472,272.114 747.305,272.469 747.172,272.839 747.077,273.22 747.019,273.608 747,274 747.019,274.392 747.077,274.78 747.172,275.161 747.305,275.531 747.472,275.886 747.674,276.222 747.908,276.538 748.171,276.829 748.462,277.092 748.778,277.326 749.114,277.528 749.469,277.695 749.839,277.828 750.22,277.923 750.608,277.981 750.94,277.997"/>
<polygon fill="#ffffff" points="746.25,260.72 679.7,288.16 679.7,260.72"/>
<polygon fill="#ffffff" points="746.25,288.16 679.7,288.16 746.25,260.72"/>
<polyline fill="none" stroke="#000000" stroke-width="0.5" points="679.7,288.16 679.7,260.72 746.25,260.72 746.25,288.16 679.7,288.16"/>
<text fill="#000000" style="stroke:none" x="720" y="272" transform="rotate(0, 720, 272)" font-size="10" font-family="SansSerif" font-style="normal" font-weight="normal">Data</text>
<text fill="#000000" style="stroke:none" x="720" y="284" transform="rotate(0, 720, 284)" font-size="10" font-family="SansSerif" font-style="normal" font-weight="normal">ODE</text>
<polyline fill="none" stroke="#0000ff" stroke-width="0.5" points="683.45,280.44 698.45,280.44 713.45,280.44"/>
<polyline fill="none" stroke="#0000ff" stroke-width="0.5" points="687,280 686.981,279.608 686.923,279.22 686.828,278.839 686.695,278.469 686.528,278.114 686.326,277.778 686.092,277.462 685.829,277.171 685.538,276.908 685.222,276.674 684.886,276.472 684.531,276.305 684.161,276.172 683.78,276.077 683.392,276.019 683,276 682.608,276.019 682.22,276.077 681.839,276.172 681.469,276.305 681.114,276.472 680.778,276.674 680.462,276.908 680.171,277.171 679.908,277.462 679.674,277.778 679.472,278.114 679.305,278.469 679.172,278.839 679.077,279.22 679.019,279.608 679,280 679.019,280.392 679.077,280.78 679.172,281.161 679.305,281.531 679.472,281.886 679.674,282.222 679.908,282.538 680.171,282.829 680.462,283.092 680.778,283.326 681.114,283.528 681.469,283.695 681.839,283.828 682.22,283.923 682.608,283.981 683,284 683.392,283.981 683.78,283.923 684.161,283.828 684.531,283.695 684.886,283.528 685.222,283.326 685.538,283.092 685.829,282.829 686.092,282.538 686.326,282.222 686.528,281.886 686.695,281.531 686.828,281.161 686.923,280.78 686.981,280.392 687,280"/>
<polyline fill="none" stroke="#0000ff" stroke-width="0.5" points="702,280 701.981,279.608 701.923,279.22 701.828,278.839 701.695,278.469 701.528,278.114 701.326,277.778 701.092,277.462 700.829,277.171 700.538,276.908 700.222,276.674 699.886,276.472 699.531,276.305 699.161,276.172 698.78,276.077 698.392,276.019 698,276 697.608,276.019 697.22,276.077 696.839,276.172 696.469,276.305 696.114,276.472 695.778,276.674 695.462,276.908 695.171,277.171 694.908,277.462 694.674,277.778 694.472,278.114 694.305,278.469 694.172,278.839 694.077,279.22 694.019,279.608 694,280 694.019,280.392 694.077,280.78 694.172,281.161 694.305,281.531 694.472,281.886 694.674,282.222 694.908,282.538 695.171,282.829 695.462,283.092 695.778,283.326 696.114,283.528 696.469,283.695 696.839,283.828 697.22,283.923 697.608,283.981 698,284 698.392,283.981 698.78,283.923 699.161,283.828 699.531,283.695 699.886,283.528 700.222,283.326 700.538,283.092 700.829,282.829 701.092,282.538 701.326,282.222 701.528,281.886 701.695,281.531 701.828,281.161 701.923,280.78 701.981,280.392 702,280"/>
<polyline fill="none" stroke="#0000ff" stroke-width="0.5" points="717,280 716.981,279.608 716.923,279.22 716.828,278.839 716.695,278.469 716.528,278.114 716.326,277.778 716.092,277.462 715.829,277.171 715.538,276.908 715.222,276.674 714.886,276.472 714.531,276.305 714.161,276.172 713.78,276.077 713.392,276.019 713,276 712.608,276.019 712.22,276.077 711.839,276.172 711.469,276.305 711.114,276.472 710.778,276.674 710.462,276.908 710.171,277.171 709.908,277.462 709.674,277.778 709.472,278.114 709.305,278.469 709.172,278.839 709.077,279.22 709.019,279.608 709,280 709.019,280.392 709.077,280.78 709.172,281.161 709.305,281.531 709.472,281.886 709.674,282.222 709.908,282.538 710.171,282.829 710.462,283.092 710.778,283.326 711.114,283.528 711.469,283.695 711.839,283.828 712.22,283.923 712.608,283.981 713,284 713.392,283.981 713.78,283.923 714.161,283.828 714.531,283.695 714.886,283.528 715.222,283.326 715.538,283.092 715.829,282.829 716.092,282.538 716.326,282.222 716.528,281.886 716.695,281.531 716.828,281.161 716.923,280.78 716.981,280.392 717,280"/>
<polyline fill="none" stroke="#ff0000" stroke-width="0.5" points="679,268 687,268"/>
<polyline fill="none" stroke="#ff0000" stroke-width="0.5" points="683,272 683,264"/>
<polyline fill="none" stroke="#ff0000" stroke-width="0.5" points="680.171,265.171 685.829,270.829"/>
<polyline fill="none" stroke="#ff0000" stroke-width="0.5" points="680.171,270.829 685.829,265.171"/>
<polyline fill="none" stroke="#ff0000" stroke-width="0.5" points="694,268 702,268"/>
<polyline fill="none" stroke="#ff0000" stroke-width="0.5" points="698,272 698,264"/>
<polyline fill="none" stroke="#ff0000" stroke-width="0.5" points="695.171,265.171 700.829,270.829"/>
<polyline fill="none" stroke="#ff0000" stroke-width="0.5" points="695.171,270.829 700.829,265.171"/>
<polyline fill="none" stroke="#ff0000" stroke-width="0.5" points="709,268 717,268"/>
<polyline fill="none" stroke="#ff0000" stroke-width="0.5" points="713,272 713,264"/>
<polyline fill="none" stroke="#ff0000" stroke-width="0.5" points="710.171,265.171 715.829,270.829"/>
<polyline fill="none" stroke="#ff0000" stroke-width="0.5" points="710.171,270.829 715.829,265.171"/>
<polyline fill="none" stroke="#000000" stroke-width="0.5" points="450.563,431.25 450.563,258.75"/>
<polyline fill="none" stroke="#000000" stroke-width="0.5" points="450.563,431.25 446.063,431.25"/>
<polyline fill="none" stroke="#000000" stroke-width="0.5" points="450.563,409.688 446.063,409.688"/>
<polyline fill="none" stroke="#000000" stroke-width="0.5" points="450.563,388.125 446.063,388.125"/>
<polyline fill="none" stroke="#000000" stroke-width="0.5" points="450.563,366.563 446.063,366.563"/>
<polyline fill="none" stroke="#000000" stroke-width="0.5" points="450.563,345 446.063,345"/>
<polyline fill="none" stroke="#000000" stroke-width="0.5" points="450.563,323.438 446.063,323.438"/>
<polyline fill="none" stroke="#000000" stroke-width="0.5" points="450.563,301.875 446.063,301.875"/>
<polyline fill="none" stroke="#000000" stroke-width="0.5" points="450.563,280.313 446.063,280.313"/>
<polyline fill="none" stroke="#000000" stroke-width="0.5" points="450.563,258.75 446.063,258.75"/>
<polyline fill="none" stroke="#000000" stroke-width="0.5" points="450.563,420.469 447.862,420.469"/>
<polyline fill="none" stroke="#000000" stroke-width="0.5" points="450.563,398.906 447.862,398.906"/>
<polyline fill="none" stroke="#000000" stroke-width="0.5" points="450.563,377.344 447.862,377.344"/>
<polyline fill="none" stroke="#000000" stroke-width="0.5" points="450.563,355.781 447.862,355.781"/>
<polyline fill="none" stroke="#000000" stroke-width="0.5" points="450.563,334.219 447.862,334.219"/>
<polyline fill="none" stroke="#000000" stroke-width="0.5" points="450.563,312.656 447.862,312.656"/>
<polyline fill="none" stroke="#000000" stroke-width="0.5" points="450.563,291.094 447.862,291.094"/>
<polyline fill="none" stroke="#000000" stroke-width="0.5" points="450.563,269.531 447.862,269.531"/>
<text fill="#000000" style="stroke:none" x="438" y="436" transform="rotate(0, 438, 436)" font-size="10" font-family="SansSerif" font-style="normal" font-weight="normal">0</text>
<text fill="#000000" style="stroke:none" x="433" y="415" transform="rotate(0, 433, 415)" font-size="10" font-family="SansSerif" font-style="normal" font-weight="normal">10</text>
<text fill="#000000" style="stroke:none" x="432" y="393" transform="rotate(0, 432, 393)" font-size="10" font-family="SansSerif" font-style="normal" font-weight="normal">20</text>
<text fill="#000000" style="stroke:none" x="432" y="372" transform="rotate(0, 432, 372)" font-size="10" font-family="SansSerif" font-style="normal" font-weight="normal">30</text>
<text fill="#000000" style="stroke:none" x="432" y="350" transform="rotate(0, 432, 350)" font-size="10" font-family="SansSerif" font-style="normal" font-weight="normal">40</text>
<text fill="#000000" style="stroke:none" x="432" y="328" transform="rotate(0, 432, 328)" font-size="10" font-family="SansSerif" font-style="normal" font-weight="normal">50</text>
<text fill="#000000" style="stroke:none" x="432" y="307" transform="rotate(0, 432, 307)" font-size="10" font-family="SansSerif" font-style="normal" font-weight="normal">60</text>
<text fill="#000000" style="stroke:none" x="432" y="285" transform="rotate(0, 432, 285)" font-size="10" font-family="SansSerif" font-style="normal" font-weight="normal">70</text>
<text fill="#000000" style="stroke:none" x="432" y="264" transform="rotate(0, 432, 264)" font-size="10" font-family="SansSerif" font-style="normal" font-weight="normal">80</text>
<polyline fill="none" stroke="#000000" stroke-width="0.5" points="450.563,431.25 750.938,431.25"/>
<polyline fill="none" stroke="#000000" stroke-width="0.5" points="450.563,431.25 450.563,434.25"/>
<polyline fill="none" stroke="#000000" stroke-width="0.5" points="500.625,431.25 500.625,434.25"/>
<polyline fill="none" stroke="#000000" stroke-width="0.5" points="550.688,431.25 550.688,434.25"/>
<polyline fill="none" stroke="#000000" stroke-width="0.5" points="600.75,431.25 600.75,434.25"/>
<polyline fill="none" stroke="#000000" stroke-width="0.5" points="650.813,431.25 650.813,434.25"/>
<polyline fill="none" stroke="#000000" stroke-width="0.5" points="700.875,431.25 700.875,434.25"/>
<polyline fill="none" stroke="#000000" stroke-width="0.5" points="750.938,431.25 750.938,434.25"/>
<polyline fill="none" stroke="#000000" stroke-width="0.5" points="460.575,431.25 460.575,433.05"/>
<polyline fill="none" stroke="#000000" stroke-width="0.5" points="470.587,431.25 470.587,433.05"/>
<polyline fill="none" stroke="#000000" stroke-width="0.5" points="480.6,431.25 480.6,433.05"/>
<polyline fill="none" stroke="#000000" stroke-width="0.5" points="490.612,431.25 490.612,433.05"/>
<polyline fill="none" stroke="#000000" stroke-width="0.5" points="510.638,431.25 510.638,433.05"/>
<polyline fill="none" stroke="#000000" stroke-width="0.5" points="520.65,431.25 520.65,433.05"/>
<polyline fill="none" stroke="#000000" stroke-width="0.5" points="530.663,431.25 530.663,433.05"/>
<polyline fill="none" stroke="#000000" stroke-width="0.5" points="540.675,431.25 540.675,433.05"/>
<polyline fill="none" stroke="#000000" stroke-width="0.5" points="560.7,431.25 560.7,433.05"/>
<polyline fill="none" stroke="#000000" stroke-width="0.5" points="570.712,431.25 570.712,433.05"/>
<polyline fill="none" stroke="#000000" stroke-width="0.5" points="580.725,431.25 580.725,433.05"/>
<polyline fill="none" stroke="#000000" stroke-width="0.5" points="590.737,431.25 590.737,433.05"/>
<polyline fill="none" stroke="#000000" stroke-width="0.5" points="610.763,431.25 610.763,433.05"/>
<polyline fill="none" stroke="#000000" stroke-width="0.5" points="620.775,431.25 620.775,433.05"/>
<polyline fill="none" stroke="#000000" stroke-width="0.5" points="630.788,431.25 630.788,433.05"/>
<polyline fill="none" stroke="#000000" stroke-width="0.5" points="640.8,431.25 640.8,433.05"/>
<polyline fill="none" stroke="#000000" stroke-width="0.5" points="660.825,431.25 660.825,433.05"/>
<polyline fill="none" stroke="#000000" stroke-width="0.5" points="670.837,431.25 670.837,433.05"/>
<polyline fill="none" stroke="#000000" stroke-width="0.5" points="680.85,431.25 680.85,433.05"/>
<polyline fill="none" stroke="#000000" stroke-width="0.5" points="690.862,431.25 690.862,433.05"/>
<polyline fill="none" stroke="#000000" stroke-width="0.5" points="710.888,431.25 710.888,433.05"/>
<polyline fill="none" stroke="#000000" stroke-width="0.5" points="720.9,431.25 720.9,433.05"/>
<polyline fill="none" stroke="#000000" stroke-width="0.5" points="730.913,431.25 730.913,433.05"/>
<polyline fill="none" stroke="#000000" stroke-width="0.5" points="740.925,431.25 740.925,433.05"/>
<text fill="#000000" style="stroke:none" x="447" y="445" transform="rotate(0, 447, 445)" font-size="10" font-family="SansSerif" font-style="normal" font-weight="normal">0</text>
<text fill="#000000" style="stroke:none" x="498" y="445" transform="rotate(0, 498, 445)" font-size="10" font-family="SansSerif" font-style="normal" font-weight="normal">1</text>
<text fill="#000000" style="stroke:none" x="547" y="445" transform="rotate(0, 547, 445)" font-size="10" font-family="SansSerif" font-style="normal" font-weight="normal">2</text>
<text fill="#000000" style="stroke:none" x="597" y="445" transform="rotate(0, 597, 445)" font-size="10" font-family="SansSerif" font-style="normal" font-weight="normal">3</text>
<text fill="#000000" style="stroke:none" x="647" y="445" transform="rotate(0, 647, 445)" font-size="10" font-family="SansSerif" font-style="normal" font-weight="normal">4</text>
<text fill="#000000" style="stroke:none" x="697" y="445" transform="rotate(0, 697, 445)" font-size="10" font-family="SansSerif" font-style="normal" font-weight="normal">5</text>
<text fill="#000000" style="stroke:none" x="747" y="445" transform="rotate(0, 747, 445)" font-size="10" font-family="SansSerif" font-style="normal" font-weight="normal">6</text>
<text fill="#000000" style="stroke:none" x="553" y="250" transform="rotate(0, 553, 250)" font-size="10" font-family="SansSerif" font-style="normal" font-weight="normal">After Optimization</text>
<text fill="#000000" style="stroke:none" x="599" y="458" transform="rotate(0, 599, 458)" font-size="10" font-family="SansSerif" font-style="normal" font-weight="normal">t</text>
<text fill="#000000" style="stroke:none" x="426" y="352" transform="rotate(270, 426, 352)" font-size="10" font-family="SansSerif" font-style="normal" font-weight="normal">Y2</text>
</g>
</svg>
