<?xml version="1.0" encoding="UTF-8" standalone="no"?>
<svg xmlns="http://www.w3.org/2000/svg"
     xmlns:xlink="http://www.w3.org/1999/xlink"
     width="610px" height="460px" viewBox="0 0 610 460"
     style="stroke:none">
<title>Graphic window number 0</title>
<desc>
Creator: GL2PS 1.3.2, (C) 1999-2006 Christophe Geuzaine (geuz@geuz.org)
For: Scilab
CreationDate: Thu Apr 22 17:03:57 2010
</desc>
<defs>
</defs>
<polygon fill="#ffffff" points="0,0 610,0 610,460 0,460"/>
<g>
<polygon fill="#ffffff" points="76.25,402.5 76.25,57.5 76.25,57.5"/>
<polygon fill="#ffffff" points="76.25,402.5 76.25,57.5 76.25,402.5"/>
<polygon fill="#ffffff" points="76.25,402.5 533.75,402.5 533.75,402.5"/>
<polygon fill="#ffffff" points="76.25,402.5 533.75,402.5 76.25,402.5"/>
<polygon fill="#ffffff" points="76.25,402.5 533.75,402.5 533.75,57.5"/>
<polygon fill="#ffffff" points="76.25,402.5 533.75,57.5 76.25,57.5"/>
<polyline fill="none" stroke="#000000" stroke-width="0.5" points="461.582,57.5 461.24,58.5781 459.885,60.9287 459.861,60.9849 459.852,61.0156 459.811,61.0762 459.071,63.9116 458.841,64.4697 458.506,65.4531 458.201,66.7407 457.691,67.9546 457.189,69.4624 456.744,70.2671 456.235,71.4395 456.031,72.0742 455.189,73.438 454.844,74.6641 454.735,74.9243 454.57,75.3916 454.012,77.521 453.632,78.4092 453.079,80.0005 453.02,80.2573 452.301,81.894 451.949,82.9351 450.568,85.272 450.542,85.3589 450.534,85.3789 450.521,85.415 449.725,88.228 449.447,88.8638 449.027,90.0259 448.776,90.9971 448.171,92.3486 447.704,93.6733 446.841,95.1587 446.529,95.8335 446.41,96.1826 445.947,96.8965 445.353,98.8701 445.151,99.3184 444.837,100.155 444.419,101.651 443.891,102.803 443.334,104.318 442.865,105.127 442.316,106.288 442.107,106.877 441.326,108.104 440.897,109.45 440.748,109.773 440.508,110.39 439.96,112.228 439.474,113.258 438.856,114.88 438.604,115.311 437.909,116.742 437.646,117.453 436.705,118.93 436.358,119.966 436.232,120.227 436.027,120.738 435.401,122.729 434.921,123.712 434.27,125.361 434.066,125.702 433.318,127.197 433.041,127.919 432.083,129.399 431.728,130.414 431.595,130.682 431.371,131.219 430.735,133.15 430.221,134.167 429.571,135.757 429.221,136.325 428.533,137.651 428.287,138.273 427.462,139.513 426.998,140.786 426.817,141.136 426.506,141.857 425.949,143.48 425.349,144.621 424.743,146.056 423.986,147.242 423.519,148.106 423.359,148.497 422.841,149.248 422.151,151.071 421.871,151.591 421.379,152.693 421.021,153.703 420.266,155.076 419.76,156.237 418.22,158.55 418.216,158.558 418.215,158.561 418.212,158.566 417.164,161.249 416.714,162.045 415.913,163.785 415.911,163.79 414.907,165.53 414.577,166.268 413.599,167.659 413.163,168.687 412.972,169.015 412.61,169.76 411.996,171.292 411.279,172.5 410.673,173.779 409.301,175.741 409.152,175.985 409.107,176.083 408.977,176.256 407.924,178.675 407.437,179.47 406.593,181.156 406.423,181.396 405.445,182.955 405.153,183.556 404.356,184.62 403.727,185.965 403.423,186.439 402.809,187.606 402.426,188.469 401.479,189.924 400.992,190.873 399.735,192.532 399.416,193.169 399.256,193.409 398.911,194.03 398.124,195.679 397.3,196.894 396.666,198.064 395.114,200.065 394.994,200.289 394.931,200.379 394.788,200.625 393.684,202.785 392.916,203.864 392.188,205.142 390.492,207.255 390.455,207.32 390.435,207.349 390.385,207.43 389.101,209.784 388.315,210.833 387.554,212.102 385.871,214.116 385.787,214.255 385.738,214.318 385.61,214.515 384.362,216.666 383.461,217.803 382.748,218.933 381.25,220.642 380.97,221.077 380.795,221.288 380.313,221.995 379.441,223.409 378.292,224.773 377.737,225.608 376.629,226.806 375.974,227.764 375.537,228.258 374.294,229.982 374.176,230.107 372.702,231.742 372.463,232.086 372.008,232.547 370.75,234.279 369.849,235.227 368.953,236.409 367.386,237.952 367.007,238.426 366.717,238.712 365.616,240.047 365.219,240.563 363.537,242.197 363.248,242.561 362.765,243.002 361.374,244.632 360.218,245.682 359.397,246.627 358.144,247.717 357.344,248.563 356.626,249.167 355.331,250.53 353.523,252.009 353.146,252.368 352.778,252.651 351.072,254.289 348.901,255.94 348.779,256.044 348.648,256.136 347.016,257.558 346.625,257.905 345.766,258.501 344.28,259.541 344.228,259.581 344.164,259.621 341.958,261.355 339.659,262.821 339.459,262.955 339.189,263.106 337.043,264.618 335.038,265.77 334.424,266.128 333.478,266.591 331.807,267.639 330.417,268.35 329.044,269.041 326.586,270.076 326.131,270.329 325.795,270.48 324.559,271.008 323.21,271.611 321.174,272.383 320.087,272.741 317.224,273.561 316.778,273.73 316.553,273.803 316.057,273.935 313.412,274.677 311.932,275.043 309.781,275.423 309.374,275.489 307.311,275.843 305.895,275.978 303.847,276.172 302.689,276.283 301.703,276.301 298.94,276.388 298.068,276.405 297.157,276.358 294.459,276.282 293.447,276.227 292.169,276.082 290.3,275.934 288.826,275.747 286.623,275.384 286.436,275.363 284.205,274.93 282.763,274.648 279.781,273.709 279.583,273.66 279.478,273.641 279.267,273.561 275.968,272.802 274.962,272.427 272.69,271.789 272.466,271.678 270.341,270.775 269.577,270.652 268.51,270.076 266.466,269.513 265.72,269.102 263.864,268.677 262.957,268.674 261.099,267.6 259.275,268.701 259.103,270.076 260.024,270.886 260.754,273.301 260.9,273.561 260.994,273.64 261.099,273.794 263.187,275.471 264.132,277.045 264.914,277.653 265.72,278.709 266.919,279.626 267.545,280.53 268.987,281.551 270.341,283.068 270.989,283.526 271.402,284.015 273.336,285.242 274.962,286.753 275.501,287.093 275.935,287.5 278.035,288.668 279.583,289.837 280.469,290.317 281.384,290.985 283.115,291.807 284.205,292.463 285.875,293.209 288.143,294.47 288.593,294.646 288.826,294.755 289.529,295 291.771,295.734 293.447,296.385 294.96,296.813 297.754,297.717 298.068,297.813 298.214,297.844 298.689,297.955 301.965,298.5 302.689,298.631 303.715,298.728 305.999,298.944 307.311,299.068 308.803,299.08 310.398,299.111 311.932,299.123 313.327,299.007 315.313,298.89 316.553,298.792 317.452,298.632 320.921,298.146 321.174,298.104 321.32,298.064 321.808,297.955 324.686,297.118 325.795,296.865 327.939,296.086 328.475,295.934 330.417,295.321 331.115,294.997 332.515,294.47 334.05,293.725 335.038,293.35 336.834,292.34 339.327,291.236 339.659,291.08 339.726,291.035 339.82,290.985 342.173,289.396 344.28,288.268 344.786,287.881 345.409,287.5 347.136,286.168 348.901,285.106 349.574,284.522 350.31,284.015 351.806,282.72 353.523,281.571 354.126,280.985 354.718,280.53 356.226,279.084 358.144,277.666 358.483,277.301 358.784,277.045 360.421,275.328 360.448,275.298 362.565,273.561 362.648,273.472 362.765,273.382 364.453,271.348 365.854,270.076 366.458,269.376 367.386,268.589 368.358,267.323 369.092,266.591 370.194,265.223 372.008,263.537 372.208,263.257 372.347,263.106 372.797,262.511 373.842,261.004 375.148,259.621 375.678,258.905 376.629,257.985 377.439,256.748 377.969,256.136 379.105,254.519 379.92,253.654 380.814,252.651 380.962,252.435 381.25,252.146 382.484,250.098 383.244,249.167 384.113,247.841 385.871,245.895 385.957,245.747 386.006,245.682 386.127,245.489 387.343,243.307 388.199,242.197 388.926,241.016 390.492,239.204 390.681,238.854 390.783,238.712 391.019,238.315 392.023,236.381 392.864,235.227 393.55,234.048 395.114,232.153 395.265,231.856 395.342,231.742 395.511,231.443 396.541,229.333 397.282,228.258 398.003,226.952 399.69,224.807 399.714,224.773 399.72,224.762 399.735,224.744 400.921,222.182 401.503,221.288 402.315,219.749 403.012,218.817 403.69,217.803 403.875,217.44 404.356,216.837 405.191,214.948 405.581,214.318 406.337,212.824 406.495,212.446 407.512,210.833 407.91,210.028 408.977,208.602 409.381,207.653 409.56,207.349 409.898,206.654 410.547,205.047 411.252,203.864 411.874,202.563 413.193,200.685 413.38,200.379 413.437,200.257 413.599,200.043 414.554,197.615 414.961,196.894 415.691,195.316 415.786,195.058 416.737,193.409 417.113,192.574 418.22,190.995 418.539,190.165 418.668,189.924 418.897,189.413 419.601,187.481 420.169,186.439 420.834,184.926 421.419,184.027 422.018,182.955 422.218,182.485 422.841,181.595 423.444,179.925 423.679,179.47 424.08,178.535 424.516,177.248 425.18,175.985 425.728,174.677 426.806,172.995 427.074,172.5 427.165,172.275 427.462,171.849 428.229,169.594 428.518,169.015 428.993,167.861 429.293,166.911 429.994,165.53 430.479,164.321 431.754,162.294 431.884,162.045 431.929,161.929 432.083,161.705 432.9,159.177 433.196,158.561 433.67,157.364 433.936,156.473 434.62,155.076 435.09,153.858 436.287,151.906 436.446,151.591 436.502,151.438 436.705,151.139 437.465,148.68 437.73,148.106 438.146,147.019 438.454,145.94 439.075,144.621 439.569,143.297 440.47,141.782 440.783,141.136 440.898,140.814 441.326,140.16 441.937,138.112 442.142,137.651 442.458,136.797 442.864,135.327 443.39,134.167 443.938,132.652 444.397,131.851 444.94,130.682 445.15,130.081 445.947,128.807 446.33,127.486 446.454,127.197 446.643,126.672 447.189,124.649 447.597,123.712 448.196,122.016 448.215,121.938 448.977,120.227 449.303,119.273 450.568,117.139 450.661,116.813 450.689,116.742 450.733,116.618 451.451,113.923 451.729,113.258 452.138,112.074 452.365,111.128 452.944,109.773 453.397,108.421 454.154,107.069 454.498,106.288 454.632,105.868 455.189,104.974 455.667,103.163 455.813,102.803 456.025,102.173 456.482,100.293 456.881,99.3184 457.441,97.6196 457.458,97.5439 458.174,95.8335 458.491,94.8384 459.811,92.5405 459.853,92.3804 459.865,92.3486 459.883,92.2939 460.583,89.4458 460.811,88.8638 461.136,87.8643 461.418,86.5908 461.903,85.3789 462.39,83.8394 462.749,83.1631 463.271,81.894 463.487,81.1812 464.432,79.5801 464.676,78.5938 464.746,78.4092 464.846,78.0967 465.405,75.6582 465.686,74.9243 466.074,73.6855 466.251,72.8115 466.788,71.4395 467.21,70.0498 467.84,68.8696 468.209,67.9546 468.36,67.4316 469.053,66.2852 469.416,64.7432 469.517,64.4697 469.658,64.0137 470.134,61.8003 470.439,60.9849 470.85,59.6299 470.977,58.9507 471.53,57.5"/>
<polyline fill="none" stroke="#0000ff" stroke-width="0.5" points="151.84,57.5 152.46,59.2124 152.474,59.2617 153.201,60.9849 153.544,61.9395 154.811,64.4111 154.826,64.458 154.831,64.4697 154.839,64.4907 155.717,67.271 156.008,67.9546 156.479,69.2119 156.72,70 157.34,71.4395 157.799,72.6709 158.655,74.3384 158.913,74.9243 159.026,75.2305 159.432,75.9839 160.076,77.9233 160.289,78.4092 160.642,79.3213 161.073,80.6563 161.621,81.894 162.169,83.3149 162.717,84.3711 163.171,85.3789 163.369,85.895 164.053,87.1597 164.523,88.5093 164.683,88.8638 164.955,89.5435 165.53,91.2349 166.038,92.3486 166.647,93.877 167.023,94.5879 167.6,95.8335 167.847,96.457 168.674,97.9653 169.061,99.0264 169.197,99.3184 169.434,99.8911 170.091,101.734 170.595,102.803 171.236,104.356 171.582,104.996 172.199,106.288 172.459,106.918 173.295,108.414 173.697,109.47 173.843,109.773 174.106,110.384 174.765,112.149 175.305,113.258 175.943,114.746 176.427,115.619 176.983,116.742 177.21,117.275 177.917,118.505 178.443,119.83 178.642,120.227 179.009,121.051 179.563,122.471 180.191,123.712 180.781,125.037 181.622,126.506 181.977,127.197 182.118,127.514 182.538,128.223 183.315,130.096 183.62,130.682 184.201,131.936 184.505,132.683 185.287,134.167 185.771,135.213 187.159,137.55 187.193,137.626 187.206,137.651 187.233,137.708 188.334,140.25 188.816,141.136 189.606,142.776 189.833,143.153 190.642,144.621 190.944,145.251 191.78,146.601 192.293,147.719 192.511,148.106 192.958,148.994 193.534,150.268 194.287,151.591 194.867,152.748 196.273,154.979 196.329,155.076 196.349,155.115 196.401,155.196 197.586,157.667 198.114,158.561 198.939,160.132 199.369,160.798 200.115,162.045 200.372,162.536 201.023,163.519 201.762,164.973 202.104,165.53 202.87,166.923 203.124,167.43 204.11,169.015 204.559,169.833 205.644,171.426 206.055,172.19 206.254,172.5 206.724,173.314 207.429,174.639 208.304,175.985 208.897,177.016 210.265,178.958 210.469,179.316 210.573,179.47 210.833,179.898 211.874,181.742 212.701,182.955 213.386,184.086 214.886,186.134 215.013,186.344 215.082,186.439 215.263,186.723 216.467,188.732 217.323,189.924 218.033,191.037 219.508,192.96 219.702,193.263 219.812,193.409 220.127,193.876 221.226,195.598 222.209,196.894 222.856,197.854 224.129,199.433 224.556,200.057 224.813,200.379 225.617,201.5 226.175,202.321 227.418,203.864 227.885,204.516 228.75,205.533 229.607,206.702 230.156,207.349 231.33,208.888 232.422,210.117 233.038,210.833 233.159,210.993 233.371,211.227 234.897,213.167 235.946,214.318 236.725,215.274 237.992,216.609 238.611,217.336 239.065,217.803 240.476,219.415 241.557,220.491 242.342,221.288 242.45,221.412 242.614,221.572 244.356,223.459 245.745,224.773 246.364,225.429 247.235,226.229 248.398,227.381 249.401,228.258 250.472,229.301 251.856,230.485 252.617,231.169 253.333,231.742 254.775,233.026 256.477,234.368 257.027,234.813 257.598,235.227 259.29,236.591 261.099,237.891 261.655,238.292 262.3,238.712 264.047,239.973 265.72,241.055 266.542,241.577 267.624,242.197 269.096,243.136 270.341,243.85 271.749,244.62 273.888,245.682 274.508,246.024 274.962,246.251 276.898,247.142 277.36,247.359 279.583,248.314 280.337,248.598 281.975,249.167 283.451,249.735 284.205,250 286.006,250.525 286.733,250.745 288.826,251.328 290.199,251.616 292.725,252.107 293.447,252.254 293.897,252.312 296.735,252.651 297.869,252.802 298.068,252.826 298.314,252.837 302.191,253.027 302.689,253.049 303.193,253.032 306.982,252.899 307.311,252.888 307.583,252.856 309.3,252.651 311.603,252.403 311.932,252.366 312.438,252.27 315.338,251.735 316.553,251.5 318.834,250.887 318.929,250.86 321.174,250.237 322.147,249.9 324.125,249.167 325.281,248.779 325.795,248.594 327.515,247.87 328.279,247.555 330.417,246.605 331.155,246.239 332.187,245.682 333.917,244.837 335.038,244.246 336.584,243.363 338.459,242.197 339.146,241.81 339.659,241.496 341.649,240.212 343.778,238.712 344.05,238.538 344.28,238.377 346.42,236.841 348.468,235.227 348.69,235.068 348.901,234.902 350.948,233.286 352.717,231.742 353.109,231.431 353.523,231.07 355.264,229.571 356.636,228.258 357.336,227.648 358.144,226.871 359.39,225.712 360.291,224.773 361.388,223.734 362.765,222.283 363.333,221.716 363.712,221.288 365.273,219.694 366.028,218.828 366.94,217.803 367.13,217.609 367.386,217.317 369.03,215.558 370.054,214.318 370.85,213.445 372.008,212.013 372.632,211.304 372.995,210.833 374.417,209.166 374.675,208.822 375.817,207.349 376.134,206.976 376.629,206.32 377.883,204.809 378.568,203.864 379.577,202.602 381.009,200.56 381.142,200.379 381.182,200.328 381.25,200.232 382.896,198.135 383.745,196.894 384.516,195.872 385.871,193.813 386.065,193.555 386.159,193.409 386.497,192.938 387.709,191.31 388.606,189.924 389.266,188.999 390.492,187.021 390.763,186.644 390.888,186.439 391.301,185.83 392.349,184.354 393.208,182.955 393.852,182.002 395.114,179.845 395.284,179.598 395.358,179.47 395.589,179.111 396.833,177.281 397.589,175.985 398.29,174.895 399.526,172.657 399.619,172.5 399.656,172.441 399.735,172.3 401.171,170.098 401.773,169.015 402.59,167.683 403.298,166.328 403.744,165.53 403.937,165.214 404.356,164.42 405.369,162.809 405.773,162.045 406.756,160.371 406.862,160.155 407.712,158.561 408.099,157.898 408.977,156.143 409.422,155.411 409.592,155.076 410.045,154.271 410.82,152.98 411.527,151.591 412.142,150.493 413.094,148.487 413.288,148.106 413.38,147.941 413.599,147.486 414.758,145.496 415.184,144.621 416.06,142.993 416.215,142.648 416.955,141.136 417.319,140.457 418.22,138.476 418.547,137.898 418.663,137.651 418.947,137.103 419.887,135.424 420.476,134.167 421.139,132.883 421.725,131.523 422.121,130.682 422.322,130.291 422.841,129.102 423.579,127.753 423.828,127.197 424.423,126.004 424.844,125.223 425.526,123.712 426.053,122.65 426.872,120.673 427.073,120.227 427.179,120.014 427.462,119.337 428.443,117.482 428.763,116.742 429.501,115.205 429.654,114.911 430.374,113.258 430.827,112.31 431.728,110.041 431.845,109.773 431.908,109.64 432.083,109.204 433.161,107.101 433.5,106.288 434.261,104.646 434.334,104.5 435.047,102.803 435.474,101.875 436.346,99.5884 436.46,99.3184 436.523,99.1812 436.705,98.7109 437.746,96.6191 438.063,95.8335 438.755,94.2871 438.896,94.001 439.565,92.3486 440.008,91.355 440.765,89.2866 440.937,88.8638 441.034,88.644 441.326,87.8579 442.207,86.043 442.466,85.3789 443.019,84.1021 443.346,83.4175 443.943,81.894 444.435,80.7534 445.009,79.1167 445.287,78.4092 445.449,78.0332 445.947,76.6328 446.544,75.3745 446.714,74.9243 447.07,74.0776 447.688,72.7524 448.186,71.4395 448.757,70.0732 449.096,69.0649 449.518,67.9546 449.769,67.3516 450.568,65.0103 450.755,64.6104 450.806,64.4697 450.912,64.2104 451.921,62.0049 452.295,60.9849 452.973,59.3135 453.033,59.126 453.632,57.5"/>
<polyline fill="none" stroke="#0000ff" stroke-width="0.5" points="135.684,57.5 135.815,57.8848 136.326,59.9731 136.674,60.7222 136.75,60.9849 136.906,61.4229 137.773,63.3784 138.099,64.4697 138.699,66.165 138.725,66.2788 139.235,67.9546 139.595,68.9741 140.023,70.7427 140.238,71.4395 140.387,71.8618 140.947,74.0688 141.244,74.7007 141.311,74.9243 141.449,75.3027 142.364,77.3403 142.693,78.4092 143.313,80.1104 143.336,80.2109 143.865,81.894 144.23,82.9028 144.69,84.7168 144.901,85.3789 145.044,85.7739 145.568,87.7524 145.955,88.5718 146.046,88.8638 146.235,89.3662 147.074,91.2134 147.436,92.3486 148.041,93.9688 148.118,94.271 148.625,95.8335 148.968,96.7544 149.517,98.811 149.684,99.3184 149.794,99.6162 150.189,101.04 150.806,102.338 150.956,102.803 151.271,103.619 151.903,104.996 152.33,106.288 152.888,107.738 153.085,108.472 153.522,109.773 153.811,110.526 154.519,113.038 154.594,113.258 154.643,113.384 154.811,113.961 155.786,116.007 156.034,116.742 156.557,118.06 156.849,118.69 157.378,120.227 157.85,121.42 158.252,122.823 158.563,123.712 158.762,124.217 159.432,126.465 159.695,126.998 159.764,127.197 159.913,127.56 160.885,129.586 161.271,130.682 161.926,132.286 162.031,132.642 162.577,134.167 162.923,135.019 163.632,137.334 163.747,137.651 163.819,137.828 164.053,138.571 164.979,140.438 165.232,141.136 165.783,142.44 166.093,143.083 166.66,144.621 167.145,145.774 167.633,147.321 167.926,148.106 168.105,148.535 168.674,150.281 169.158,151.227 169.293,151.591 169.598,152.288 170.356,153.807 170.838,155.076 171.445,156.471 171.747,157.393 172.196,158.561 172.467,159.186 173.295,161.64 173.448,161.93 173.493,162.045 173.595,162.271 174.719,164.457 175.14,165.53 175.844,167.093 176.008,167.576 176.581,169.015 176.919,169.768 177.865,172.461 177.881,172.5 177.89,172.52 177.917,172.594 179.199,175.018 179.592,175.985 180.359,177.628 180.456,177.899 181.104,179.47 181.476,180.27 182.433,182.875 182.466,182.955 182.484,182.995 182.538,183.137 183.812,185.479 184.218,186.439 185.005,188.064 185.127,188.393 185.785,189.924 186.152,190.684 187.159,193.299 187.203,193.376 187.217,193.409 187.253,193.48 188.568,195.832 189.037,196.894 189.791,198.394 190.064,199.084 190.643,200.379 190.955,201.001 191.78,203.036 192.116,203.61 192.231,203.864 192.526,204.426 193.473,206.072 194.062,207.349 194.724,208.614 195.308,210.008 195.693,210.833 195.893,211.217 196.401,212.404 197.193,213.722 197.478,214.318 198.23,215.697 198.528,216.2 199.304,217.803 199.805,218.722 200.907,221.201 200.95,221.288 200.971,221.327 201.023,221.441 202.428,223.713 202.96,224.773 203.767,226.188 204.232,227.192 204.774,228.258 205.035,228.717 205.644,230.005 206.398,231.173 206.696,231.742 207.556,233.185 207.815,233.59 208.685,235.227 209.174,236.05 210.265,238.253 210.47,238.557 210.555,238.712 210.814,239.126 211.993,240.894 212.717,242.197 213.412,243.309 214.494,245.386 214.66,245.682 214.732,245.798 214.886,246.088 216.293,248.105 216.913,249.167 217.772,250.476 218.588,251.958 218.997,252.651 219.166,252.909 219.508,253.519 220.741,255.207 221.313,256.136 222.278,257.532 223.004,258.773 223.531,259.621 223.736,259.917 224.129,260.579 225.357,262.18 225.961,263.106 226.953,264.461 227.862,265.921 228.303,266.591 228.462,266.808 228.75,267.264 230.162,269.011 230.899,270.076 231.812,271.251 233.336,273.534 233.354,273.561 233.361,273.568 233.371,273.584 235.169,275.689 236.173,277.045 236.872,277.891 237.992,279.45 238.575,280.091 238.921,280.53 240.397,282.202 240.656,282.539 241.83,284.015 242.143,284.37 242.614,284.974 244.028,286.433 244.936,287.5 245.895,288.511 247.235,290.114 247.743,290.602 248.094,290.985 249.734,292.585 250.543,293.48 251.459,294.47 251.632,294.638 251.856,294.883 253.726,296.544 255.142,297.955 255.751,298.501 256.477,299.228 257.886,300.377 259.053,301.439 260.034,302.242 261.099,303.209 262.245,304.06 263.294,304.924 264.519,305.83 265.72,306.812 266.844,307.562 267.997,308.409 269.246,309.235 270.341,310.03 271.727,310.849 273.344,311.894 274.257,312.426 274.962,312.873 276.939,313.888 279.492,315.31 279.583,315.36 279.599,315.367 279.624,315.379 282.551,316.626 284.205,317.385 285.534,317.861 288.148,318.864 288.612,319.024 288.826,319.104 289.328,319.242 291.995,319.959 293.447,320.374 295.523,320.783 296.171,320.917 298.068,321.3 299.272,321.44 301.911,321.761 302.689,321.853 303.317,321.875 306.846,321.998 307.311,322.015 307.784,321.992 311.221,321.812 311.932,321.778 312.85,321.657 315.201,321.329 316.553,321.153 318.783,320.667 318.907,320.639 321.174,320.16 322.398,319.787 325.667,318.864 325.758,318.835 325.795,318.824 325.903,318.782 328.782,317.631 330.417,317.027 331.754,316.387 334.046,315.379 334.649,315.085 335.038,314.912 337.323,313.618 337.483,313.535 339.659,312.391 340.012,312.16 340.455,311.894 342.495,310.547 344.28,309.474 344.99,308.944 345.78,308.409 347.348,307.238 348.901,306.187 349.696,305.523 350.487,304.924 351.929,303.722 353.523,302.524 354.168,301.926 354.75,301.439 356.279,300.033 358.144,298.491 358.447,298.183 358.696,297.955 360.349,296.292 360.438,296.2 362.338,294.47 362.521,294.286 362.765,294.067 364.414,292.229 365.668,290.985 366.369,290.218 367.386,289.231 368.27,288.166 368.89,287.5 370.106,286.066 372.008,284.079 372.039,284.039 372.059,284.015 372.134,283.92 373.733,281.832 374.866,280.53 375.523,279.696 376.629,278.467 377.29,277.544 377.695,277.045 378.968,275.325 379.066,275.207 380.41,273.561 380.71,273.153 381.25,272.517 382.335,270.894 382.96,270.076 383.961,268.635 385.163,267.125 385.573,266.591 385.675,266.443 385.871,266.199 387.188,264.099 387.903,263.106 388.759,261.799 390.286,259.777 390.398,259.621 390.43,259.574 390.492,259.491 391.862,257.169 392.567,256.136 393.378,254.828 394.736,252.937 394.931,252.651 394.989,252.558 395.114,252.386 396.377,250.12 396.993,249.167 397.836,247.735 398.713,246.452 399.214,245.682 399.374,245.409 399.735,244.887 400.751,242.964 401.223,242.197 402.154,240.536 402.364,240.214 403.292,238.712 403.607,238.147 404.356,237.012 405.007,235.718 405.294,235.227 405.93,234.041 406.332,233.232 407.208,231.742 407.716,230.791 408.977,228.788 409.165,228.399 409.243,228.258 409.411,227.931 410.401,225.847 411.004,224.773 411.725,223.36 412.453,222.152 412.94,221.288 413.122,220.929 413.599,220.147 414.394,218.402 414.715,217.803 415.369,216.468 415.643,215.86 416.473,214.318 416.942,213.355 418.22,211.163 418.328,210.915 418.37,210.833 418.453,210.657 419.476,208.296 419.964,207.349 420.716,205.746 420.984,205.264 421.709,203.864 422.004,203.232 422.841,201.75 423.276,200.707 423.438,200.379 423.748,199.695 424.414,198.08 425.001,196.894 425.625,195.509 426.275,194.304 426.721,193.409 426.908,192.991 427.462,191.979 428.092,190.399 428.318,189.924 428.737,188.963 429.211,187.758 429.841,186.439 430.393,185.165 431.201,183.62 431.52,182.955 431.658,182.634 432.083,181.832 432.785,179.999 433.027,179.47 433.463,178.429 433.875,177.336 434.498,175.985 435.026,174.719 435.807,173.177 436.12,172.5 436.259,172.164 436.705,171.298 437.361,169.511 437.581,169.015 437.966,168.064 438.416,166.821 438.989,165.53 439.534,164.179 440.143,162.938 440.541,162.045 440.723,161.591 441.326,160.38 441.834,158.944 441.998,158.561 442.28,157.841 442.845,156.222 443.336,155.076 443.929,153.554 444.256,152.866 444.805,151.591 445.063,150.924 445.947,149.093 446.215,148.309 446.299,148.106 446.439,147.734 447.177,145.549 447.561,144.621 448.203,142.92 448.225,142.854 448.939,141.136 449.299,140.179 450.43,137.756 450.474,137.651 450.494,137.596 450.568,137.44 451.426,134.814 451.686,134.167 452.112,133.002 452.411,132.072 452.97,130.682 453.448,129.369 454.036,128.067 454.387,127.197 454.56,126.722 455.189,125.35 455.609,124.028 455.731,123.712 455.93,123.154 456.529,121.237 456.922,120.227 457.531,118.508 457.561,118.439 458.223,116.742 458.557,115.796 459.617,113.404 459.674,113.258 459.703,113.176 459.811,112.938 460.595,110.364 460.817,109.773 461.17,108.747 461.521,107.578 462.008,106.288 462.506,104.835 462.873,103.979 463.319,102.803 463.546,102.135 464.432,100.101 464.622,99.4614 464.674,99.3184 464.756,99.0732 465.475,96.6201 465.763,95.8335 466.211,94.4917 466.4,93.833 466.946,92.3486 467.368,91.0781 467.947,89.6978 468.255,88.8638 468.414,88.3818 469.053,86.8857 469.409,85.647 469.503,85.3789 469.65,84.9282 470.251,82.7979 470.573,81.894 471.066,80.376 471.168,80.0044 471.739,78.4092 472.118,77.2354 472.794,75.5879 473.033,74.9243 473.157,74.5347 473.674,73.3008 474.101,71.7612 474.212,71.4395 474.381,70.9063 474.928,68.8999 475.255,67.9546 475.749,66.3896 475.828,66.0938 476.393,64.4697 476.757,63.3096 477.429,61.6387 477.657,60.9849 477.778,60.5952 478.295,59.3345 478.706,57.8091 478.809,57.5"/>
<polyline fill="none" stroke="#00ff00" stroke-width="0.5" points="189.438,57.5 190.07,58.79 190.84,60.2759 191.199,60.9849 191.355,61.3052 191.78,62.123 192.63,63.8291 192.967,64.4697 193.709,65.9238 193.917,66.3433 194.766,67.9546 195.22,68.8457 196.401,71.0347 196.553,71.3252 196.615,71.4395 196.759,71.709 197.86,73.8242 198.464,74.9243 199.197,76.3008 199.91,77.5698 200.371,78.4092 200.558,78.7598 201.023,79.5859 201.915,81.2212 202.301,81.894 203.226,83.5552 203.289,83.6704 204.27,85.3789 204.676,86.1084 205.644,87.7563 206.087,88.5298 206.288,88.8638 206.793,89.7305 207.493,90.9541 208.333,92.3486 208.923,93.3604 210.265,95.5464 210.384,95.7437 210.44,95.8335 210.591,96.0796 211.831,98.1377 212.577,99.3184 213.307,100.509 214.686,102.651 214.781,102.803 214.814,102.857 214.886,102.969 216.312,105.213 217.027,106.288 217.839,107.546 219.176,109.522 219.342,109.773 219.396,109.856 219.508,110.021 220.951,112.169 221.716,113.258 222.535,114.459 224.129,116.695 224.151,116.726 224.164,116.742 224.205,116.8 225.767,118.992 226.687,120.227 227.414,121.235 228.75,123.006 229.091,123.455 229.294,123.712 230.042,124.686 230.783,125.664 231.997,127.197 232.5,127.854 233.371,128.941 234.248,130.021 234.806,130.682 236.022,132.167 237.248,133.605 237.722,134.167 237.825,134.292 237.992,134.488 239.655,136.397 240.791,137.651 241.517,138.479 242.614,139.68 243.415,140.532 244.004,141.136 245.35,142.558 247.235,144.479 247.317,144.559 247.383,144.621 247.889,145.115 249.33,146.526 251.002,148.106 251.375,148.469 251.856,148.922 253.475,150.371 254.884,151.591 255.614,152.242 256.477,152.987 257.811,154.07 259.091,155.076 260.058,155.86 261.099,156.677 262.37,157.602 263.726,158.561 264.74,159.299 265.72,159.992 267.188,160.938 268.954,162.045 269.701,162.528 270.341,162.93 272.316,164.041 274.761,165.378 274.962,165.489 274.996,165.505 275.049,165.53 277.814,166.864 279.583,167.696 280.729,168.151 282.956,169.015 283.771,169.342 284.205,169.511 285.334,169.867 286.996,170.396 288.826,170.965 290.38,171.328 292.552,171.825 293.447,172.032 293.963,172.11 296.572,172.5 297.814,172.691 298.068,172.729 298.404,172.753 302.01,173.012 302.689,173.06 303.422,173.053 306.621,173.02 307.311,173.013 307.918,172.958 311.8,172.6 311.932,172.587 312.026,172.571 312.435,172.5 315.798,171.931 316.553,171.801 317.944,171.451 319.327,171.107 321.174,170.638 322.669,170.143 325.628,169.141 325.795,169.085 325.855,169.061 325.963,169.015 328.853,167.836 330.417,167.183 331.744,166.532 333.736,165.53 334.526,165.145 335.038,164.889 337.187,163.666 338.629,162.822 339.659,162.222 339.785,162.141 339.927,162.045 342.271,160.53 344.28,159.192 344.707,158.882 345.136,158.561 347.054,157.167 348.901,155.784 349.355,155.418 349.768,155.076 351.583,153.613 353.523,151.999 353.771,151.779 353.977,151.591 355.893,149.894 356.451,149.382 357.85,148.106 357.985,147.986 358.144,147.84 360.021,146.037 361.443,144.621 362.023,144.062 362.765,143.32 363.983,142.055 364.835,141.136 365.904,140.019 367.386,138.413 367.793,137.958 368.059,137.651 369.426,136.113 369.645,135.87 371.114,134.167 371.472,133.763 372.008,133.138 373.269,131.633 374.035,130.682 375.034,129.479 376.629,127.481 376.769,127.303 376.849,127.197 377.162,126.794 378.486,125.113 379.545,123.712 380.176,122.902 381.25,121.465 381.839,120.672 382.155,120.227 383.276,118.7 383.48,118.424 384.677,116.742 385.102,116.163 385.871,115.068 386.703,113.885 387.125,113.258 388.281,111.59 388.478,111.292 389.5,109.773 389.84,109.281 390.492,108.297 391.384,106.96 391.813,106.288 392.906,104.623 393.091,104.329 394.063,102.803 394.411,102.273 395.114,101.152 395.901,99.9126 396.261,99.3184 397.281,97.6836 397.374,97.5376 398.406,95.8335 398.831,95.1519 399.735,93.6333 400.27,92.7515 400.502,92.3486 401.125,91.2998 401.703,90.3472 402.558,88.8638 403.115,87.9272 404.356,85.7339 404.5,85.4868 404.559,85.3789 404.71,85.1113 405.9,83.0586 406.542,81.894 407.271,80.6079 408.101,79.0698 408.465,78.4092 408.619,78.1387 408.977,77.4736 409.976,75.6772 410.372,74.9243 411.31,73.1982 411.337,73.1445 412.236,71.4395 412.631,70.7104 413.599,68.8345 413.933,68.207 414.061,67.9546 414.36,67.3804 415.249,65.7139 415.876,64.4697 416.537,63.2007 417.28,61.6934 417.638,60.9849 417.802,60.6699 418.22,59.8232 419.079,58.1484 419.394,57.5"/>
<polyline fill="none" stroke="#00ff00" stroke-width="0.5" points="108.179,57.5 108.254,57.7598 108.599,59.0615 109.085,60.6177 109.19,60.9849 109.359,61.5586 109.95,63.4507 110.241,64.4697 110.712,66.0635 110.787,66.3042 111.259,67.9546 111.616,69.1641 111.978,70.5034 112.246,71.4395 112.423,72.0396 113.202,74.9111 113.206,74.9243 113.208,74.9326 113.22,74.9746 114.104,77.7422 114.299,78.4092 114.618,79.4634 114.972,80.5728 115.359,81.894 115.82,83.418 115.973,83.9697 116.386,85.3789 116.656,86.2725 117.253,88.4199 117.383,88.8638 117.468,89.145 117.841,90.4839 118.33,91.9795 118.441,92.3486 118.624,92.939 119.228,94.7876 119.541,95.8335 120.06,97.5068 120.096,97.6177 120.607,99.3184 120.958,100.452 121.4,102.002 121.641,102.803 121.796,103.305 122.462,105.634 122.637,106.156 122.678,106.288 122.746,106.501 123.562,108.943 123.817,109.773 124.245,111.117 124.457,111.753 124.92,113.258 125.338,114.573 125.659,115.668 125.99,116.742 126.202,117.407 127.014,120.174 127.03,120.227 127.04,120.26 127.083,120.407 127.983,123.033 128.198,123.712 128.562,124.827 128.903,125.825 129.336,127.197 129.804,128.63 130.044,129.43 130.44,130.682 130.69,131.447 131.453,133.977 131.513,134.167 131.551,134.283 131.705,134.792 132.499,137.052 132.693,137.651 133.027,138.649 133.441,139.827 133.866,141.136 134.362,142.617 134.573,143.299 135.002,144.621 135.269,145.418 136.035,147.887 136.106,148.106 136.15,148.238 136.326,148.803 137.116,150.995 137.314,151.591 137.661,152.598 138.078,153.755 138.518,155.076 139.019,156.53 139.261,157.289 139.685,158.561 139.945,159.316 140.775,161.916 140.819,162.045 140.845,162.122 140.947,162.441 141.841,164.856 142.072,165.53 142.481,166.688 142.82,167.603 143.304,169.015 143.781,170.363 144.126,171.413 144.5,172.5 144.725,173.136 145.568,175.699 145.653,175.921 145.675,175.985 145.716,176.096 146.679,178.632 146.975,179.47 147.508,180.933 147.673,181.367 148.234,182.955 148.655,184.111 149.188,185.685 149.455,186.439 149.613,186.874 150.189,188.57 150.599,189.616 150.71,189.924 150.917,190.473 151.637,192.317 152.034,193.409 152.647,195.041 152.752,195.341 153.317,196.894 153.646,197.772 154.468,200.121 154.563,200.379 154.617,200.524 154.811,201.076 155.671,203.215 155.915,203.864 156.37,205.039 156.719,205.909 157.259,207.349 157.75,208.617 158.221,209.92 158.563,210.833 158.76,211.34 159.432,213.198 159.786,214.051 159.889,214.318 160.086,214.812 160.875,216.715 161.296,217.803 161.935,219.401 162.085,219.804 162.66,221.288 162.982,222.095 163.956,224.699 163.984,224.773 164,224.813 164.053,224.954 165.121,227.452 165.443,228.258 166.071,229.78 166.214,230.113 166.866,231.742 167.295,232.782 168.062,234.766 168.247,235.227 168.348,235.473 168.674,236.314 169.468,238.113 169.716,238.712 170.211,239.871 170.597,240.747 171.197,242.197 171.708,243.394 172.334,244.957 172.635,245.682 172.795,246.059 173.295,247.305 173.928,248.69 174.132,249.167 174.55,250.113 175.091,251.298 175.671,252.651 176.232,253.921 176.804,255.297 177.164,256.136 177.352,256.562 177.917,257.919 178.51,259.174 178.708,259.621 179.126,260.534 179.705,261.758 180.304,263.106 180.877,264.358 181.504,265.812 181.851,266.591 182.027,266.976 182.538,268.157 183.224,269.558 183.463,270.076 183.981,271.164 184.449,272.12 185.113,273.561 185.654,274.696 186.478,276.532 186.715,277.045 186.833,277.292 187.159,278.019 188.082,279.834 188.416,280.53 189.164,282.042 189.333,282.375 190.12,284.015 190.571,284.927 191.772,287.494 191.775,287.5 191.776,287.503 191.78,287.512 193.092,289.996 193.587,290.985 194.375,292.513 194.704,293.19 195.344,294.47 195.64,295.044 196.401,296.604 196.927,297.558 197.133,297.955 197.633,298.883 198.266,300.034 198.999,301.439 199.583,302.525 200.669,304.658 200.809,304.924 200.87,305.039 201.023,305.338 202.253,307.481 202.759,308.409 203.618,309.938 204,310.654 204.676,311.894 204.964,312.407 205.644,313.68 206.346,314.849 206.648,315.379 207.45,316.74 207.764,317.265 208.677,318.864 209.165,319.693 210.265,321.657 210.56,322.126 210.693,322.349 211.067,322.953 212.038,324.497 212.838,325.833 213.489,326.887 214.886,329.26 214.912,329.299 214.924,329.318 214.961,329.375 216.448,331.625 217.19,332.803 217.953,333.976 219.282,336.118 219.39,336.288 219.428,336.348 219.508,336.475 221.013,338.638 221.768,339.773 222.573,340.946 224.049,343.198 224.089,343.258 224.103,343.277 224.129,343.317 225.749,345.521 226.609,346.742 227.367,347.786 228.75,349.774 228.973,350.06 229.098,350.227 229.581,350.854 230.677,352.259 231.763,353.712 232.354,354.479 233.371,355.853 234.057,356.68 234.47,357.197 235.818,358.837 236.218,359.344 237.285,360.682 237.556,361.011 237.992,361.563 239.376,363.123 240.267,364.167 241.204,365.23 242.614,366.895 243.034,367.335 243.324,367.651 244.954,369.372 245.085,369.515 246.575,371.136 246.85,371.427 247.235,371.848 248.843,373.409 250.049,374.621 250.837,375.39 251.856,376.418 252.881,377.333 253.719,378.106 254.98,379.235 256.477,380.619 257.097,381.124 257.654,381.591 259.31,382.939 261.099,384.442 261.524,384.755 261.948,385.076 263.859,386.479 265.72,387.885 266.199,388.199 266.735,388.561 268.667,389.823 270.341,390.948 271.167,391.423 272.22,392.045 273.778,392.938 274.962,393.635 276.479,394.386 278.733,395.53 279.248,395.784 279.583,395.953 280.83,396.471 282.206,397.038 284.205,397.881 285.247,398.229 287.544,399.015 288.434,399.311 288.826,399.443 289.681,399.66 291.864,400.208 293.447,400.614 295.481,400.966 296.202,401.093 298.068,401.417 299.348,401.535 301.7,401.754 302.689,401.845 303.546,401.854 306.493,401.884 307.311,401.892 308.201,401.828 310.792,401.64 311.932,401.559 313.5,401.318 314.731,401.126 316.553,400.848 318.404,400.411 319.73,400.104 321.174,399.767 321.875,399.543 323.569,399.015 325.13,398.513 325.795,398.304 327.812,397.495 328.195,397.34 330.417,396.462 331.169,396.098 332.369,395.53 333.99,394.74 335.038,394.243 336.7,393.299 338.966,392.045 339.361,391.82 339.659,391.655 341.86,390.22 343.228,389.354 344.28,388.686 344.365,388.624 344.454,388.561 346.705,386.904 348.901,385.334 349.066,385.2 349.222,385.076 351.284,383.388 353.523,381.611 353.535,381.6 353.545,381.591 353.661,381.487 355.636,379.7 357.459,378.106 357.771,377.825 358.144,377.5 359.795,375.866 361.099,374.621 361.821,373.91 362.765,373.012 363.792,371.91 364.538,371.136 365.717,369.878 367.386,368.16 367.652,367.852 367.832,367.651 368.678,366.677 369.481,365.747 370.896,364.167 371.336,363.661 372.008,362.917 373.126,361.525 373.831,360.682 374.893,359.373 376.629,357.314 376.685,357.239 376.718,357.197 376.838,357.039 378.358,355.016 379.379,353.712 380.061,352.815 381.25,351.313 381.75,350.605 382.028,350.227 382.939,348.954 383.371,348.342 384.549,346.742 385.012,346.094 385.871,344.943 386.618,343.821 387.01,343.258 388.184,341.517 388.19,341.509 389.398,339.773 389.767,339.226 390.492,338.198 391.307,336.902 391.712,336.288 392.818,334.557 392.849,334.511 393.974,332.803 394.345,332.223 395.114,331.074 395.836,329.863 396.177,329.318 397.074,327.839 397.292,327.476 398.319,325.833 398.763,325.101 399.735,323.575 400.222,322.716 400.441,322.349 400.986,321.405 401.621,320.286 402.467,318.864 403.041,317.872 404.356,315.705 404.481,315.473 404.535,315.379 404.662,315.148 405.822,313 406.451,311.894 407.192,310.548 408.011,309.138 408.425,308.409 408.587,308.115 408.977,307.443 409.913,305.63 410.296,304.924 411.167,303.273 411.234,303.142 412.16,301.439 412.569,300.663 413.599,298.812 413.907,298.187 414.028,297.955 414.292,297.432 415.169,295.654 415.785,294.47 416.457,293.14 417.194,291.759 417.597,290.985 417.769,290.645 418.22,289.8 419.021,288.104 419.323,287.5 419.959,286.188 420.259,285.553 421.028,284.015 421.513,283.014 422.753,280.596 422.787,280.53 422.801,280.5 422.841,280.422 423.982,277.906 424.396,277.045 425.194,275.335 425.244,275.234 426.047,273.561 426.416,272.771 427.462,270.652 427.651,270.219 427.717,270.076 427.848,269.785 428.801,267.6 429.268,266.591 429.979,265.004 430.211,264.518 430.864,263.106 431.172,262.419 432.083,260.508 432.366,259.834 432.461,259.621 432.645,259.198 433.485,257.194 433.957,256.136 434.633,254.574 434.887,254.022 435.498,252.651 435.795,251.965 436.705,249.989 436.959,249.359 437.042,249.167 437.198,248.794 438.047,246.694 438.483,245.682 439.164,244.052 439.314,243.714 439.968,242.197 440.293,241.418 441.326,239.096 441.442,238.8 441.478,238.712 441.545,238.547 442.497,236.11 442.864,235.227 443.537,233.56 443.582,233.444 444.29,231.742 444.677,230.785 445.677,228.461 445.762,228.258 445.805,228.151 445.947,227.822 446.843,225.448 447.114,224.773 447.602,223.524 447.892,222.755 448.483,221.288 448.958,220.073 449.6,218.534 449.894,217.803 450.047,217.41 450.568,216.163 451.096,214.716 451.251,214.318 451.524,213.597 452.108,211.995 452.562,210.833 453.145,209.292 453.378,208.714 453.911,207.349 454.195,206.599 455.189,204.144 455.268,203.922 455.29,203.864 455.328,203.759 456.242,201.172 456.542,200.379 457.059,198.969 457.244,198.443 457.831,196.894 458.259,195.724 458.899,194.096 459.159,193.409 459.3,193.024 459.811,191.728 460.302,190.294 460.438,189.924 460.668,189.278 461.264,187.535 461.666,186.439 462.251,184.795 462.356,184.52 462.931,182.955 463.249,182.062 464.162,179.673 464.236,179.47 464.278,179.354 464.432,178.951 465.219,176.579 465.431,175.985 465.784,174.965 466.167,173.809 466.634,172.5 467.134,171.053 467.439,170.232 467.873,169.015 468.117,168.309 469.053,165.793 469.121,165.582 469.139,165.53 469.168,165.443 470.026,162.779 470.281,162.045 470.698,160.805 470.958,159.997 471.456,158.561 471.904,157.226 472.31,156.104 472.667,155.076 472.87,154.469 473.674,152.251 473.842,151.717 473.884,151.591 473.953,151.381 474.729,148.901 474.997,148.106 475.43,146.782 475.641,146.104 476.141,144.621 476.567,143.318 476.989,142.121 477.322,141.136 477.514,140.547 478.295,138.335 478.465,137.779 478.507,137.651 478.574,137.442 479.332,134.948 479.588,134.167 479.997,132.884 480.224,132.136 480.701,130.682 481.13,129.334 481.497,128.268 481.849,127.197 482.055,126.547 482.917,124.046 482.998,123.773 483.017,123.712 483.048,123.613 483.843,120.926 484.066,120.227 484.417,119.096 484.712,118.097 485.146,116.742 485.599,115.28 485.851,114.53 486.258,113.258 486.5,112.475 487.364,109.904 487.406,109.773 487.431,109.692 487.538,109.375 488.269,106.839 488.44,106.288 488.707,105.406 489.114,103.991 489.484,102.803 489.981,101.161 490.068,100.895 490.56,99.3184 490.856,98.3359 491.519,96.3159 491.67,95.8335 491.761,95.5327 492.159,94.3198 492.616,92.6929 492.721,92.3486 492.881,91.8037 493.436,89.8262 493.728,88.8638 494.177,87.3418 494.279,86.9775 494.766,85.3789 495.132,84.1357 495.554,82.8188 495.835,81.894 496.007,81.311 496.78,78.9019 496.892,78.4937 496.917,78.4092 496.955,78.2773 497.685,75.6064 497.888,74.9243 498.195,73.8574 498.5,72.7368 498.886,71.4395 499.334,69.8809 499.485,69.3999 499.914,67.9546 500.18,67.0332 500.854,64.8833 500.976,64.4697 501.052,64.2061 501.401,63.0933 501.87,61.3379 501.972,60.9849 502.126,60.4385 502.656,58.4463 502.931,57.5"/>
<polyline fill="none" stroke="#00ffff" stroke-width="0.5" points="533.75,84.3857 533.534,85.2158 533.493,85.3789 533.433,85.6177 532.779,88.1313 532.597,88.8638 532.325,89.938 532.035,91.0552 531.712,92.3486 531.299,93.9854 531.236,94.2437 530.84,95.8335 530.566,96.9175 530.177,98.5278 529.98,99.3184 529.844,99.8574 529.13,102.802 529.13,102.803 529.13,102.804 529.129,102.809 528.359,105.708 528.212,106.288 527.991,107.146 527.6,108.62 527.307,109.773 526.867,111.479 526.851,111.54 526.413,113.258 526.103,114.461 525.775,115.787 525.532,116.742 525.365,117.389 524.699,120.083 524.662,120.227 524.637,120.325 524.508,120.848 523.863,123.226 523.737,123.712 523.546,124.437 523.089,126.127 522.811,127.197 522.39,128.793 522.325,129.036 521.897,130.682 521.564,131.947 521.266,133.126 520.996,134.167 520.812,134.864 520.159,137.446 520.105,137.651 520.069,137.79 519.886,138.513 519.286,140.684 519.166,141.136 518.982,141.818 518.497,143.574 518.219,144.621 517.794,146.199 517.719,146.472 517.285,148.106 516.944,149.373 516.639,150.555 516.364,151.591 516.179,152.28 515.502,154.897 515.455,155.076 515.422,155.194 515.265,155.803 514.623,158.076 514.492,158.561 514.289,159.297 513.82,160.956 513.525,162.045 513.069,163.701 513.029,163.844 512.571,165.53 512.24,166.734 511.885,168.08 511.631,169.015 511.461,169.631 510.717,172.445 510.702,172.5 510.692,172.536 510.644,172.719 509.87,175.401 509.708,175.985 509.456,176.881 509.054,178.271 508.722,179.47 508.249,181.149 508.206,181.308 507.749,182.955 507.447,184.029 506.993,185.708 506.79,186.439 506.655,186.917 506.023,189.253 505.861,189.802 505.826,189.924 505.771,190.114 505.021,192.654 504.807,193.409 504.47,194.58 504.194,195.515 503.803,196.894 503.375,198.382 503.196,199.025 502.812,200.379 502.56,201.252 501.951,203.449 501.833,203.864 501.756,204.131 501.401,205.412 500.925,206.989 500.821,207.349 500.654,207.912 500.075,209.833 499.784,210.833 499.321,212.402 499.236,212.685 498.761,214.318 498.401,215.54 498.025,216.865 497.752,217.803 497.575,218.402 496.78,221.201 496.759,221.271 496.754,221.288 496.746,221.314 495.885,224.098 495.684,224.773 495.361,225.843 495.024,226.933 494.63,228.258 494.171,229.775 494.004,230.352 493.589,231.742 493.324,232.621 492.68,234.834 492.563,235.227 492.488,235.475 492.159,236.604 491.62,238.306 491.496,238.712 491.294,239.364 490.737,241.125 490.41,242.197 489.877,243.918 489.866,243.953 489.338,245.682 488.998,246.782 488.503,248.439 488.28,249.167 488.14,249.621 487.538,251.637 487.273,252.452 487.211,252.651 487.108,252.976 486.369,255.254 486.092,256.136 485.637,257.57 485.476,258.066 484.989,259.621 484.589,260.882 484.205,262.134 483.901,263.106 483.71,263.705 482.917,266.295 482.838,266.532 482.819,266.591 482.787,266.688 481.912,269.318 481.668,270.076 481.262,271.324 480.999,272.114 480.534,273.561 480.092,274.916 479.772,275.932 479.415,277.045 479.194,277.723 478.314,280.516 478.31,280.53 478.307,280.539 478.295,280.576 477.361,283.311 477.129,284.015 476.735,285.192 476.428,286.091 475.963,287.5 475.501,288.878 475.19,289.842 474.813,290.985 474.583,291.67 473.678,294.467 473.677,294.47 473.677,294.471 473.674,294.479 472.71,297.228 472.463,297.955 472.039,299.188 471.756,299.993 471.266,301.439 470.81,302.764 470.439,303.879 470.084,304.924 469.872,305.542 469.053,308.002 468.938,308.322 468.907,308.409 468.854,308.559 467.952,311.063 467.662,311.894 467.155,313.325 466.979,313.814 466.433,315.379 466.011,316.57 465.502,318.057 465.22,318.864 465.054,319.333 464.432,321.15 464.084,322.086 463.99,322.349 463.823,322.808 463.079,324.813 462.712,325.833 462.087,327.55 462.063,327.62 461.453,329.318 461.099,330.29 460.357,332.391 460.209,332.803 460.123,333.039 459.811,333.924 459.109,335.759 458.914,336.288 458.56,337.231 458.086,338.472 457.604,339.773 457.072,341.192 456.748,342.082 456.313,343.258 456.065,343.918 455.189,346.324 455.063,346.646 455.026,346.742 454.958,346.917 454.006,349.335 453.666,350.227 453.038,351.85 452.965,352.035 452.325,353.712 451.928,354.737 451.177,356.738 451.001,357.197 450.903,357.45 450.568,358.342 449.841,360.133 449.625,360.682 449.218,361.7 448.768,362.809 448.233,364.167 447.704,365.491 447.246,366.672 446.859,367.651 446.648,368.18 445.947,369.987 445.581,370.86 445.469,371.136 445.252,371.66 444.476,373.512 444.024,374.621 443.383,376.173 443.164,376.72 442.6,378.106 442.297,378.838 441.326,381.259 441.217,381.509 441.183,381.591 441.115,381.75 440.081,384.137 439.685,385.076 438.959,386.776 438.907,386.899 438.208,388.561 437.841,389.418 436.771,391.996 436.75,392.045 436.738,392.071 436.705,392.153 435.572,394.677 435.2,395.53 434.446,397.233 434.42,397.292 433.668,399.015 433.271,399.911 432.192,402.418 432.156,402.5"/>
<polyline fill="none" stroke="#00ffff" stroke-width="0.5" points="76.25,82.3203 76.9141,84.8779 77.0386,85.3789 77.2236,86.1128 77.6611,87.7993 77.9258,88.8638 78.3188,90.4238 78.3979,90.7285 78.8008,92.3486 79.1313,93.6606 79.3857,94.7129 79.6641,95.8335 79.8569,96.5981 80.4341,98.9888 80.5161,99.3184 80.5728,99.543 80.8711,100.778 81.3184,102.466 81.4038,102.803 81.5322,103.301 82.0811,105.375 82.3125,106.288 82.6597,107.637 82.8335,108.293 83.209,109.773 83.5801,111.215 83.7617,111.953 84.0933,113.258 84.3203,114.141 84.8408,116.251 84.9658,116.742 85.0513,117.075 85.4922,118.862 85.7988,119.996 85.8589,120.227 85.9492,120.572 86.5767,122.895 86.7886,123.712 87.1094,124.931 87.3438,125.801 87.7061,127.197 88.104,128.712 88.2451,129.273 88.6104,130.682 88.8589,131.628 89.355,133.595 89.5034,134.167 89.604,134.551 90.1138,136.571 90.3604,137.465 90.4097,137.651 90.4849,137.932 91.1528,140.353 91.3604,141.136 91.6768,142.315 91.9341,143.249 92.2979,144.621 92.708,146.149 92.8447,146.681 93.2222,148.106 93.4771,149.055 93.9849,151.025 94.1348,151.591 94.2358,151.967 94.7349,153.902 95.0078,154.87 95.0635,155.076 95.1489,155.388 95.8135,157.747 96.0342,158.561 96.373,159.796 96.6084,160.632 96.9912,162.045 97.3965,163.523 97.5708,164.184 97.9351,165.53 98.1787,166.418 98.7417,168.552 98.8672,169.015 98.9507,169.321 99.356,170.857 99.7451,172.207 99.8262,172.5 99.9521,172.95 100.564,175.074 100.816,175.985 101.208,177.381 101.372,177.95 101.792,179.47 102.174,180.83 102.433,181.79 102.755,182.955 102.969,183.715 103.635,186.181 103.706,186.439 103.753,186.608 103.977,187.437 104.577,189.472 104.705,189.924 104.906,190.625 105.408,192.33 105.713,193.409 106.193,195.08 106.228,195.197 106.708,196.894 107.045,198.065 107.443,199.508 107.69,200.379 107.852,200.942 108.599,203.643 108.653,203.823 108.665,203.864 108.684,203.928 109.507,206.663 109.706,207.349 110.021,208.421 110.35,209.513 110.733,210.833 111.184,212.368 111.333,212.896 111.746,214.318 112.014,215.228 112.613,217.346 112.746,217.803 112.832,218.096 113.22,219.464 113.676,220.944 113.778,221.288 113.942,221.833 114.541,223.776 114.837,224.773 115.313,226.351 115.395,226.618 115.882,228.258 116.245,229.461 116.645,230.84 116.913,231.742 117.084,232.313 117.841,234.918 117.92,235.168 117.938,235.227 117.967,235.322 118.807,237.983 119.029,238.712 119.39,239.88 119.683,240.808 120.105,242.197 120.551,243.639 120.781,244.415 121.167,245.682 121.412,246.474 122.142,248.925 122.215,249.167 122.262,249.318 122.462,249.99 123.155,252.129 123.318,252.651 123.586,253.499 124.051,254.938 124.426,256.136 124.938,257.754 125.037,258.078 125.519,259.621 125.82,260.574 126.448,262.626 126.597,263.106 126.691,263.402 127.083,264.686 127.589,266.209 127.711,266.591 127.915,267.218 128.507,269.002 128.851,270.076 129.413,271.804 129.424,271.841 129.976,273.561 130.316,274.608 130.887,276.429 131.085,277.045 131.207,277.421 131.705,279.006 132.118,280.219 132.22,280.53 132.394,281.05 133.056,282.996 133.392,284.015 133.958,285.715 133.982,285.783 134.547,287.5 134.905,288.572 135.476,290.344 135.687,290.985 135.815,291.37 136.326,292.951 136.746,294.153 136.854,294.47 137.037,295.006 137.705,296.915 138.057,297.955 138.65,299.687 138.66,299.714 139.243,301.439 139.593,302.46 140.231,304.385 140.414,304.924 140.523,305.244 140.947,306.519 141.481,308.006 141.622,308.409 141.866,309.102 142.459,310.753 142.856,311.894 143.426,313.509 143.543,313.852 144.074,315.379 144.388,316.269 145.172,318.565 145.276,318.864 145.337,319.038 145.568,319.713 146.33,321.774 146.536,322.349 146.901,323.354 147.327,324.507 147.802,325.833 148.315,327.247 148.63,328.143 149.052,329.318 149.296,329.992 150.189,332.531 150.27,332.742 150.292,332.803 150.333,332.911 151.299,335.451 151.608,336.288 152.166,337.778 152.314,338.17 152.906,339.773 153.325,340.893 153.946,342.605 154.187,343.258 154.324,343.625 154.811,344.966 155.348,346.337 155.502,346.742 155.786,347.478 156.396,349.032 156.851,350.227 157.432,351.735 157.676,352.388 158.18,353.712 158.462,354.443 159.432,357.034 159.482,357.159 159.497,357.197 159.525,357.268 160.562,359.83 160.896,360.682 161.525,362.26 161.626,362.512 162.276,364.167 162.687,365.197 163.464,367.207 163.638,367.651 163.734,367.892 164.053,368.717 164.822,370.557 165.057,371.136 165.508,372.234 165.918,373.215 166.489,374.621 167.006,375.879 167.561,377.266 167.901,378.106 168.084,378.551 168.674,380.026 169.184,381.207 169.345,381.591 169.662,382.336 170.312,383.841 170.83,385.076 171.429,386.483 171.832,387.457 172.295,388.561 172.538,389.131 173.295,390.961 173.658,391.772 173.777,392.045 174.016,392.589 174.817,394.382 175.316,395.53 175.965,397.002 176.308,397.802 176.835,399.015 177.105,399.627 177.917,401.519 178.253,402.246 178.368,402.5"/>
<polyline fill="none" stroke="#ff0000" stroke-width="0.5" points="533.75,190.977 533.226,193.014 533.127,193.409 532.98,193.989 532.479,195.936 532.24,196.894 531.885,198.3 531.74,198.863 531.362,200.379 531.005,201.793 530.809,202.597 530.492,203.864 530.274,204.728 529.747,206.882 529.63,207.349 529.55,207.667 529.129,209.389 528.812,210.594 528.751,210.833 528.66,211.187 528.051,213.505 527.844,214.318 527.534,215.521 527.297,216.422 526.945,217.803 526.549,219.342 526.424,219.843 526.056,221.288 525.804,222.266 525.333,224.15 525.174,224.773 525.066,225.193 524.508,227.426 524.322,228.118 524.286,228.258 524.231,228.466 523.546,231.018 523.358,231.742 523.074,232.824 522.779,233.924 522.439,235.227 522.017,236.834 521.931,237.17 521.529,238.712 521.258,239.746 520.81,241.501 520.628,242.197 520.505,242.664 519.886,245.087 519.751,245.58 519.724,245.682 519.683,245.835 518.962,248.469 518.776,249.167 518.494,250.216 518.18,251.365 517.837,252.651 517.404,254.265 517.32,254.587 516.908,256.136 516.631,257.167 516.168,258.94 515.987,259.621 515.865,260.074 515.265,262.371 515.095,262.978 515.061,263.106 515.007,263.301 514.292,265.857 514.092,266.591 513.786,267.707 513.496,268.742 513.133,270.076 512.707,271.631 512.581,272.1 512.184,273.561 511.919,274.522 511.398,276.477 511.243,277.045 511.14,277.42 510.644,279.278 510.349,280.308 510.288,280.53 510.192,280.871 509.532,283.177 509.299,284.015 508.938,285.302 508.724,286.052 508.32,287.5 507.919,288.93 507.704,289.717 507.351,290.985 507.119,291.812 506.489,294.118 506.391,294.47 506.327,294.699 506.023,295.81 505.509,297.567 505.398,297.955 505.226,298.556 504.679,300.426 504.39,301.439 503.938,303.011 503.857,303.291 503.392,304.924 503.037,306.158 502.676,307.448 502.403,308.409 502.225,309.03 501.429,311.874 501.423,311.894 501.419,311.907 501.401,311.97 500.569,314.751 500.386,315.379 500.097,316.363 499.726,317.6 499.358,318.864 498.89,320.455 498.779,320.841 498.34,322.349 498.057,323.311 497.486,325.301 497.331,325.833 497.231,326.173 496.78,327.746 496.389,329.023 496.301,329.318 496.16,329.786 495.525,331.856 495.243,332.803 494.791,334.304 494.67,334.697 494.195,336.288 493.818,337.539 493.447,338.801 493.157,339.773 492.972,340.386 492.159,343.154 492.133,343.238 492.126,343.258 492.117,343.29 491.249,346.056 491.038,346.742 490.698,347.844 490.373,348.88 489.96,350.227 489.502,351.709 489.299,352.384 488.893,353.712 488.637,354.541 487.924,356.906 487.835,357.197 487.779,357.379 487.538,358.179 486.89,360.193 486.736,360.682 486.484,361.476 485.994,363.002 485.628,364.167 485.105,365.817 485.031,366.058 484.53,367.651 484.219,368.634 483.606,370.617 483.443,371.136 483.341,371.457 482.917,372.83 482.443,374.264 482.328,374.621 482.137,375.209 481.526,377.058 481.189,378.106 480.627,379.833 480.619,379.858 480.061,381.591 479.713,382.66 479.151,384.431 478.943,385.076 478.815,385.468 478.295,387.106 477.903,388.265 477.805,388.561 477.64,389.055 476.966,391.043 476.634,392.045 476.075,393.72 476.038,393.828 475.475,395.53 475.113,396.615 474.543,398.359 474.327,399.015 474.195,399.408 473.674,401.006 473.262,402.189 473.156,402.5"/>
<polyline fill="none" stroke="#ff0000" stroke-width="0.5" points="76.25,189.52 76.3369,189.858 76.3535,189.924 76.3774,190.021 77.0864,192.778 77.2437,193.409 77.4771,194.334 77.8286,195.704 78.1255,196.894 78.5635,198.634 78.5649,198.64 78.999,200.379 79.2974,201.565 79.6304,202.928 79.8638,203.864 80.0244,204.502 80.686,207.208 80.7207,207.349 80.7446,207.444 80.8711,207.961 81.5,210.359 81.6206,210.833 81.8013,211.535 82.2568,213.273 82.5229,214.318 82.9199,215.863 83.0063,216.193 83.4165,217.803 83.7534,219.114 84.0186,220.176 84.3013,221.288 84.4946,222.04 85.1035,224.479 85.1782,224.773 85.229,224.971 85.4922,226.026 85.9897,227.883 86.0869,228.258 86.2339,228.816 86.7607,230.786 87.0093,231.742 87.3838,233.169 87.5249,233.695 87.9233,235.227 88.2852,236.606 88.5146,237.506 88.8281,238.712 89.0405,239.521 89.6294,241.832 89.7246,242.197 89.7886,242.442 90.1138,243.716 90.5591,245.346 90.6484,245.682 90.7842,246.188 91.3447,248.238 91.5913,249.167 91.9658,250.563 92.1226,251.137 92.5249,252.651 92.897,254.038 93.1279,254.924 93.4497,256.136 93.666,256.942 94.2734,259.273 94.3657,259.621 94.4277,259.853 94.7349,261.03 95.2139,262.745 95.312,263.106 95.4624,263.655 96.0132,265.627 96.2749,266.591 96.6763,268.055 96.8047,268.515 97.2285,270.076 97.5928,271.405 97.8687,272.439 98.1733,273.561 98.376,274.3 99.0449,276.811 99.1089,277.045 99.1514,277.2 99.356,277.968 99.958,280.076 100.084,280.53 100.279,281.227 100.771,282.948 101.067,284.015 101.525,285.651 101.576,285.826 102.041,287.5 102.378,288.706 102.747,290.057 103.004,290.985 103.174,291.59 103.956,294.453 103.96,294.47 103.963,294.48 103.977,294.533 104.796,297.337 104.972,297.955 105.246,298.911 105.622,300.199 105.974,301.439 106.441,303.066 106.522,303.359 106.967,304.924 107.258,305.936 107.775,307.788 107.951,308.409 108.066,308.81 108.599,310.715 108.886,311.677 108.949,311.894 109.049,312.233 109.733,314.523 109.981,315.379 110.375,316.719 110.571,317.376 111.004,318.864 111.406,320.231 111.679,321.187 112.017,322.349 112.235,323.091 112.965,325.641 113.021,325.833 113.057,325.956 113.22,326.526 113.914,328.795 114.07,329.318 114.319,330.147 114.773,331.632 115.122,332.803 115.625,334.474 115.679,334.657 116.165,336.288 116.475,337.318 117.01,339.146 117.197,339.773 117.316,340.168 117.841,341.958 118.17,343.009 118.246,343.258 118.369,343.656 119.05,345.831 119.329,346.742 119.78,348.205 119.922,348.658 120.401,350.227 120.79,351.488 121.164,352.733 121.463,353.712 121.652,354.323 122.462,357.019 122.508,357.162 122.519,357.197 122.537,357.253 123.409,359.968 123.632,360.682 123.999,361.841 124.301,362.78 124.735,364.167 125.188,365.597 125.438,366.411 125.827,367.651 126.069,368.417 126.855,370.964 126.909,371.136 126.942,371.243 127.083,371.699 127.854,374.04 128.042,374.621 128.352,375.578 128.767,376.836 129.175,378.106 129.672,379.639 129.847,380.19 130.297,381.591 130.574,382.443 131.315,384.782 131.409,385.076 131.467,385.254 131.705,386.003 132.394,388.041 132.565,388.561 132.854,389.428 133.326,390.823 133.73,392.045 134.251,393.61 134.405,394.082 134.883,395.53 135.173,396.399 135.926,398.714 136.026,399.015 136.086,399.196 136.326,399.932 137.033,401.967 137.213,402.5"/>
<polyline fill="none" stroke="#ff00ff" stroke-width="0.5" points="533.75,341.664 533.409,343 533.344,343.258 533.249,343.635 532.664,345.923 532.459,346.742 532.157,347.944 531.925,348.851 531.581,350.227 531.189,351.781 531.075,352.245 530.708,353.712 530.456,354.713 530.006,356.535 529.841,357.197 529.727,357.648 529.129,360.074 528.996,360.582 528.971,360.682 528.933,360.83 528.238,363.495 528.066,364.167 527.81,365.161 527.484,366.411 527.167,367.651 526.735,369.332 526.697,369.485 526.275,371.136 525.988,372.253 525.599,373.798 525.389,374.621 525.246,375.178 524.508,378.105 524.508,378.106 524.508,378.106 524.508,378.108 523.735,381.008 523.583,381.591 523.355,382.46 522.968,383.915 522.665,385.076 522.21,386.809 522.206,386.825 521.753,388.561 521.444,389.735 521.082,391.144 520.847,392.045 520.688,392.65 519.961,395.474 519.947,395.53 519.937,395.568 519.886,395.764 519.152,398.462 519.005,399.015 518.781,399.848 518.371,401.357 518.066,402.5"/>
<polyline fill="none" stroke="#ff00ff" stroke-width="0.5" points="76.25,340.635 76.8115,342.834 76.9175,343.258 77.0737,343.878 77.5537,345.759 77.7993,346.742 78.1621,348.185 78.291,348.688 78.6753,350.227 79.0254,351.619 79.2378,352.48 79.5454,353.712 79.7568,354.552 80.3027,356.768 80.4097,357.197 80.4834,357.489 80.8711,359.063 81.2236,360.416 81.2915,360.682 81.3926,361.075 81.98,363.331 82.1934,364.167 82.5107,365.403 82.7314,366.249 83.0889,367.651 83.479,369.17 83.6182,369.723 83.9785,371.136 84.2241,372.093 84.7124,374.033 84.8623,374.621 84.9648,375.019 85.4922,377.117 85.7114,377.941 85.7544,378.106 85.8193,378.353 86.4819,380.845 86.6763,381.591 86.9683,382.704 87.2471,383.752 87.5918,385.076 88.0083,386.663 88.1069,387.047 88.5015,388.561 88.7676,389.576 89.2314,391.38 89.4048,392.045 89.522,392.492 90.1138,394.795 90.2793,395.405 90.3125,395.53 90.3633,395.718 91.064,398.298 91.2549,399.015 91.5439,400.094 91.8433,401.196 92.1904,402.5"/>
<text fill="#000000" style="stroke:none" x="276" y="285" transform="rotate(0, 276, 285)" font-size="10" font-family="SansSerif" font-style="normal" font-weight="normal"> 2</text>
<text fill="#000000" style="stroke:none" x="304" y="251" transform="rotate(0, 304, 251)" font-size="10" font-family="SansSerif" font-style="normal" font-weight="normal"> 10</text>
<text fill="#000000" style="stroke:none" x="308" y="320" transform="rotate(0, 308, 320)" font-size="10" font-family="SansSerif" font-style="normal" font-weight="normal"> 10</text>
<text fill="#000000" style="stroke:none" x="308" y="171" transform="rotate(0, 308, 171)" font-size="10" font-family="SansSerif" font-style="normal" font-weight="normal"> 100</text>
<text fill="#000000" style="stroke:none" x="308" y="400" transform="rotate(0, 308, 400)" font-size="10" font-family="SansSerif" font-style="normal" font-weight="normal"> 100</text>
<text fill="#000000" style="stroke:none" x="491" y="242" transform="rotate(0, 491, 242)" font-size="10" font-family="SansSerif" font-style="normal" font-weight="normal"> 500</text>
<text fill="#000000" style="stroke:none" x="122" y="244" transform="rotate(0, 122, 244)" font-size="10" font-family="SansSerif" font-style="normal" font-weight="normal"> 500</text>
<text fill="#000000" style="stroke:none" x="105" y="293" transform="rotate(0, 105, 293)" font-size="10" font-family="SansSerif" font-style="normal" font-weight="normal"> 1e+003</text>
<text fill="#000000" style="stroke:none" x="85" y="370" transform="rotate(0, 85, 370)" font-size="10" font-family="SansSerif" font-style="normal" font-weight="normal"> 2e+003</text>
<polyline fill="none" stroke="#000000" stroke-width="0.5" points="76.25,402.5 76.25,57.5"/>
<polyline fill="none" stroke="#000000" stroke-width="0.5" points="76.25,402.5 69.395,402.5"/>
<polyline fill="none" stroke="#000000" stroke-width="0.5" points="76.25,345 69.395,345"/>
<polyline fill="none" stroke="#000000" stroke-width="0.5" points="76.25,287.5 69.395,287.5"/>
<polyline fill="none" stroke="#000000" stroke-width="0.5" points="76.25,230 69.395,230"/>
<polyline fill="none" stroke="#000000" stroke-width="0.5" points="76.25,172.5 69.395,172.5"/>
<polyline fill="none" stroke="#000000" stroke-width="0.5" points="76.25,115 69.395,115"/>
<polyline fill="none" stroke="#000000" stroke-width="0.5" points="76.25,57.5 69.395,57.5"/>
<polyline fill="none" stroke="#000000" stroke-width="0.5" points="76.25,388.125 72.1372,388.125"/>
<polyline fill="none" stroke="#000000" stroke-width="0.5" points="76.25,373.75 72.1372,373.75"/>
<polyline fill="none" stroke="#000000" stroke-width="0.5" points="76.25,359.375 72.1372,359.375"/>
<polyline fill="none" stroke="#000000" stroke-width="0.5" points="76.25,330.625 72.1372,330.625"/>
<polyline fill="none" stroke="#000000" stroke-width="0.5" points="76.25,316.25 72.1372,316.25"/>
<polyline fill="none" stroke="#000000" stroke-width="0.5" points="76.25,301.875 72.1372,301.875"/>
<polyline fill="none" stroke="#000000" stroke-width="0.5" points="76.25,273.125 72.1372,273.125"/>
<polyline fill="none" stroke="#000000" stroke-width="0.5" points="76.25,258.75 72.1372,258.75"/>
<polyline fill="none" stroke="#000000" stroke-width="0.5" points="76.25,244.375 72.1372,244.375"/>
<polyline fill="none" stroke="#000000" stroke-width="0.5" points="76.25,215.625 72.1372,215.625"/>
<polyline fill="none" stroke="#000000" stroke-width="0.5" points="76.25,201.25 72.1372,201.25"/>
<polyline fill="none" stroke="#000000" stroke-width="0.5" points="76.25,186.875 72.1372,186.875"/>
<polyline fill="none" stroke="#000000" stroke-width="0.5" points="76.25,158.125 72.1372,158.125"/>
<polyline fill="none" stroke="#000000" stroke-width="0.5" points="76.25,143.75 72.1372,143.75"/>
<polyline fill="none" stroke="#000000" stroke-width="0.5" points="76.25,129.375 72.1372,129.375"/>
<polyline fill="none" stroke="#000000" stroke-width="0.5" points="76.25,100.625 72.1372,100.625"/>
<polyline fill="none" stroke="#000000" stroke-width="0.5" points="76.25,86.25 72.1372,86.25"/>
<polyline fill="none" stroke="#000000" stroke-width="0.5" points="76.25,71.875 72.1372,71.875"/>
<text fill="#000000" style="stroke:none" x="49" y="407" transform="rotate(-0, 49, 407)" font-size="10" font-family="SansSerif" font-style="normal" font-weight="normal">-1.0</text>
<text fill="#000000" style="stroke:none" x="49" y="350" transform="rotate(-0, 49, 350)" font-size="10" font-family="SansSerif" font-style="normal" font-weight="normal">-0.5</text>
<text fill="#000000" style="stroke:none" x="52" y="292" transform="rotate(-0, 52, 292)" font-size="10" font-family="SansSerif" font-style="normal" font-weight="normal">0.0</text>
<text fill="#000000" style="stroke:none" x="52" y="235" transform="rotate(-0, 52, 235)" font-size="10" font-family="SansSerif" font-style="normal" font-weight="normal">0.5</text>
<text fill="#000000" style="stroke:none" x="53" y="177" transform="rotate(-0, 53, 177)" font-size="10" font-family="SansSerif" font-style="normal" font-weight="normal">1.0</text>
<text fill="#000000" style="stroke:none" x="52" y="120" transform="rotate(-0, 52, 120)" font-size="10" font-family="SansSerif" font-style="normal" font-weight="normal">1.5</text>
<text fill="#000000" style="stroke:none" x="52" y="62" transform="rotate(-0, 52, 62)" font-size="10" font-family="SansSerif" font-style="normal" font-weight="normal">2.0</text>
<polyline fill="none" stroke="#000000" stroke-width="0.5" points="76.25,402.5 533.75,402.5"/>
<polyline fill="none" stroke="#000000" stroke-width="0.5" points="76.25,402.5 76.25,407.675"/>
<polyline fill="none" stroke="#000000" stroke-width="0.5" points="133.438,402.5 133.438,407.675"/>
<polyline fill="none" stroke="#000000" stroke-width="0.5" points="190.625,402.5 190.625,407.675"/>
<polyline fill="none" stroke="#000000" stroke-width="0.5" points="247.813,402.5 247.813,407.675"/>
<polyline fill="none" stroke="#000000" stroke-width="0.5" points="305,402.5 305,407.675"/>
<polyline fill="none" stroke="#000000" stroke-width="0.5" points="362.188,402.5 362.188,407.675"/>
<polyline fill="none" stroke="#000000" stroke-width="0.5" points="419.375,402.5 419.375,407.675"/>
<polyline fill="none" stroke="#000000" stroke-width="0.5" points="476.563,402.5 476.563,407.675"/>
<polyline fill="none" stroke="#000000" stroke-width="0.5" points="533.75,402.5 533.75,407.675"/>
<polyline fill="none" stroke="#000000" stroke-width="0.5" points="104.844,402.5 104.844,405.605"/>
<polyline fill="none" stroke="#000000" stroke-width="0.5" points="162.031,402.5 162.031,405.605"/>
<polyline fill="none" stroke="#000000" stroke-width="0.5" points="219.219,402.5 219.219,405.605"/>
<polyline fill="none" stroke="#000000" stroke-width="0.5" points="276.406,402.5 276.406,405.605"/>
<polyline fill="none" stroke="#000000" stroke-width="0.5" points="333.594,402.5 333.594,405.605"/>
<polyline fill="none" stroke="#000000" stroke-width="0.5" points="390.781,402.5 390.781,405.605"/>
<polyline fill="none" stroke="#000000" stroke-width="0.5" points="447.969,402.5 447.969,405.605"/>
<polyline fill="none" stroke="#000000" stroke-width="0.5" points="505.156,402.5 505.156,405.605"/>
<text fill="#000000" style="stroke:none" x="67" y="419" transform="rotate(-0, 67, 419)" font-size="10" font-family="SansSerif" font-style="normal" font-weight="normal">-2.0</text>
<text fill="#000000" style="stroke:none" x="124" y="419" transform="rotate(-0, 124, 419)" font-size="10" font-family="SansSerif" font-style="normal" font-weight="normal">-1.5</text>
<text fill="#000000" style="stroke:none" x="181" y="419" transform="rotate(-0, 181, 419)" font-size="10" font-family="SansSerif" font-style="normal" font-weight="normal">-1.0</text>
<text fill="#000000" style="stroke:none" x="238" y="419" transform="rotate(-0, 238, 419)" font-size="10" font-family="SansSerif" font-style="normal" font-weight="normal">-0.5</text>
<text fill="#000000" style="stroke:none" x="297" y="419" transform="rotate(-0, 297, 419)" font-size="10" font-family="SansSerif" font-style="normal" font-weight="normal">0.0</text>
<text fill="#000000" style="stroke:none" x="354" y="419" transform="rotate(-0, 354, 419)" font-size="10" font-family="SansSerif" font-style="normal" font-weight="normal">0.5</text>
<text fill="#000000" style="stroke:none" x="412" y="419" transform="rotate(-0, 412, 419)" font-size="10" font-family="SansSerif" font-style="normal" font-weight="normal">1.0</text>
<text fill="#000000" style="stroke:none" x="469" y="419" transform="rotate(-0, 469, 419)" font-size="10" font-family="SansSerif" font-style="normal" font-weight="normal">1.5</text>
<text fill="#000000" style="stroke:none" x="526" y="419" transform="rotate(-0, 526, 419)" font-size="10" font-family="SansSerif" font-style="normal" font-weight="normal">2.0</text>
</g>
</svg>
