<?xml version="1.0" encoding="UTF-8" standalone="no"?>
<svg xmlns="http://www.w3.org/2000/svg"
     xmlns:xlink="http://www.w3.org/1999/xlink"
     width="610px" height="460px" viewBox="0 0 610 460">
<title>Graphic window number 0</title>
<desc>
Creator: GL2PS 1.3.2, (C) 1999-2006 Christophe Geuzaine (geuz@geuz.org)
For: Scilab
CreationDate: Thu Apr 22 21:46:54 2010
</desc>
<defs>
</defs>
<polygon fill="#ffffff" points="0,0 610,0 610,460 0,460"/>
<g>
<polyline fill="none" stroke="#000000" stroke-width="0.5" points="76.25,402.5 76.25,57.5 76.25,57.5 533.75,57.5 533.75,402.5 533.75,402.5 76.25,402.5"/>
<polyline fill="none" stroke="#000000" stroke-width="0.5" points="533.75,57.5 76.25,57.5"/>
<polyline fill="none" stroke="#000000" stroke-width="0.5" points="533.75,57.5 533.75,402.5"/>
<polyline fill="none" stroke="#000000" stroke-width="0.5" points="533.75,57.5 533.75,57.5"/>
<polygon fill="#ffffff" points="76.25,402.5 76.25,57.5 76.25,57.5"/>
<polygon fill="#ffffff" points="76.25,402.5 76.25,57.5 76.25,402.5"/>
<polygon fill="#ffffff" points="76.25,402.5 533.75,402.5 533.75,402.5"/>
<polygon fill="#ffffff" points="76.25,402.5 533.75,402.5 76.25,402.5"/>
<polygon fill="#ffffff" points="76.25,402.5 533.75,402.5 533.75,57.5"/>
<polygon fill="#ffffff" points="76.25,402.5 533.75,57.5 76.25,57.5"/>
<polyline fill="none" stroke="#0000ff" stroke-width="0.5" points="91.5,140.122 91.9429,142.096 92.3853,144.016 92.8281,145.883 93.271,147.702 93.7134,149.473 94.1563,151.201 94.5986,152.886 95.0415,154.531 95.4844,156.137 95.9268,157.708 96.3696,159.243 96.8125,160.744 97.2549,162.214 97.6978,163.653 98.1406,165.063 98.583,166.444 99.0259,167.799 99.4683,169.127 99.9111,170.43 100.354,171.709 100.796,172.965 101.239,174.198 101.682,175.41 102.125,176.601 102.567,177.771 103.01,178.922 103.453,180.055 103.896,181.168 104.338,182.265 104.781,183.343 105.224,184.406 105.666,185.452 106.109,186.483 106.552,187.499 106.994,188.499 107.437,189.486 107.879,190.458 108.322,191.417 108.765,192.363 109.208,193.296 109.65,194.217 110.093,195.125 110.536,196.022 110.979,196.907 111.421,197.781 111.864,198.645 112.307,199.497 112.749,200.339 113.192,201.17 113.635,201.993 114.077,202.805 114.52,203.607 114.963,204.401 115.405,205.186 115.848,205.961 116.291,206.729 116.733,207.487 117.176,208.238 117.619,208.98 118.062,209.714 118.504,210.441 118.947,211.161 119.39,211.872 119.833,212.577 120.275,213.274 120.718,213.964 121.161,214.648 121.603,215.325 122.046,215.995 122.488,216.659 122.931,217.316 123.374,217.967 123.816,218.613 124.259,219.252 124.702,219.885 125.145,220.513 125.587,221.135 126.03,221.751 126.473,222.362 126.916,222.967 127.358,223.568 127.801,224.163 128.244,224.753 128.686,225.338 129.129,225.918 129.572,226.493 130.014,227.063 130.457,227.629 130.899,228.191 131.342,228.748 131.785,229.3 132.228,229.848 132.67,230.391 133.113,230.93 133.556,231.465 133.999,231.997 134.441,232.523 134.884,233.046 135.327,233.565 135.769,234.081 136.212,234.592 136.655,235.099 137.097,235.603 137.54,236.103 137.983,236.6 138.425,237.093 138.868,237.583 139.311,238.068 139.753,238.551 140.196,239.031 140.639,239.506 141.082,239.979 141.524,240.449 141.967,240.916 142.41,241.378 142.853,241.839 143.295,242.296 143.738,242.75 144.181,243.201 144.623,243.649 145.066,244.095 145.508,244.537 145.951,244.977 146.394,245.414 146.836,245.848 147.279,246.279 147.722,246.708 148.165,247.134 148.607,247.557 149.05,247.978 149.493,248.396 149.936,248.812 150.378,249.226 150.821,249.636 151.264,250.045 151.706,250.451 152.149,250.854 152.592,251.256 153.034,251.655 153.477,252.051 153.919,252.446 154.362,252.838 154.805,253.228 155.248,253.616 155.69,254.001 156.133,254.385 156.576,254.766 157.019,255.145 157.461,255.522 157.904,255.897 158.347,256.271 158.789,256.642 159.232,257.011 159.675,257.378 160.117,257.743 160.56,258.106 161.003,258.468 161.445,258.827 161.888,259.185 162.331,259.541 162.773,259.895 163.216,260.247 163.659,260.597 164.102,260.945 164.544,261.292 164.987,261.637 165.43,261.981 165.873,262.322 166.315,262.663 166.758,263 167.201,263.337 167.643,263.672 168.086,264.006 168.528,264.337 168.971,264.668 169.414,264.997 169.856,265.324 170.299,265.649 170.742,265.973 171.185,266.296 171.627,266.617 172.07,266.936 172.513,267.254 172.956,267.571 173.398,267.886 173.841,268.2 174.284,268.512 174.726,268.823 175.169,269.132 175.612,269.44 176.054,269.747 176.497,270.053 176.939,270.356 177.382,270.659 177.825,270.961 178.268,271.261 178.71,271.56 179.153,271.857 179.596,272.153 180.039,272.448 180.481,272.742 180.924,273.034 181.367,273.326 181.809,273.615 182.252,273.904 182.695,274.192 183.137,274.478 183.58,274.763 184.023,275.047 184.465,275.33 184.908,275.612 185.351,275.893 185.793,276.172 186.236,276.45 186.679,276.728 187.122,277.003 187.564,277.278 188.007,277.552 188.45,277.825 188.893,278.097 189.335,278.367 189.778,278.637 190.221,278.905 190.663,279.173 191.106,279.439 191.548,279.705 191.991,279.969 192.434,280.233 192.876,280.495 193.319,280.756 193.762,281.017 194.205,281.276 194.647,281.535 195.09,281.792 195.533,282.049 195.976,282.305 196.418,282.559 196.861,282.813 197.304,283.066 197.746,283.317 198.189,283.568 198.632,283.818 199.074,284.068 199.517,284.316 199.959,284.563 200.402,284.81 200.845,285.056 201.288,285.3 201.73,285.544 202.173,285.787 202.616,286.029 203.059,286.271 203.501,286.511 203.944,286.75 204.387,286.989 204.829,287.228 205.272,287.464 205.715,287.701 206.157,287.937 206.6,288.171 207.043,288.405 207.485,288.638 207.928,288.871 208.371,289.102 208.813,289.333 209.256,289.563 209.699,289.792 210.142,290.021 210.584,290.249 211.027,290.476 211.47,290.702 211.913,290.927 212.355,291.152 212.798,291.376 213.241,291.6 213.683,291.822 214.126,292.044 214.568,292.265 215.011,292.486 215.454,292.706 215.896,292.925 216.339,293.143 216.782,293.361 217.225,293.578 217.667,293.794 218.11,294.01 218.553,294.225 218.996,294.439 219.438,294.653 219.881,294.866 220.324,295.078 220.766,295.29 221.209,295.501 221.652,295.711 222.094,295.921 222.537,296.13 222.979,296.338 223.422,296.546 223.865,296.753 224.308,296.96 224.75,297.166 225.193,297.372 225.636,297.576 226.079,297.781 226.521,297.984 226.964,298.187 227.407,298.39 227.849,298.591 228.292,298.792 228.735,298.993 229.177,299.193 229.62,299.393 230.063,299.591 230.505,299.79 230.948,299.987 231.391,300.185 231.833,300.381 232.276,300.577 232.719,300.773 233.162,300.968 233.604,301.162 234.047,301.356 234.49,301.549 234.933,301.742 235.375,301.934 235.818,302.126 236.261,302.317 236.703,302.508 237.146,302.698 237.588,302.888 238.031,303.077 238.474,303.265 238.917,303.453 239.359,303.641 239.802,303.828 240.245,304.014 240.688,304.2 241.13,304.386 241.573,304.571 242.016,304.755 242.458,304.939 242.901,305.123 243.344,305.306 243.786,305.488 244.229,305.67 244.672,305.852 245.114,306.033 245.557,306.214 246,306.394 246.442,306.574 246.885,306.753 247.328,306.932 247.771,307.11 248.213,307.288 248.656,307.465 249.099,307.643 249.542,307.819 249.984,307.995 250.427,308.17 250.869,308.346 251.312,308.521 251.755,308.695 252.197,308.869 252.64,309.042 253.083,309.215 253.525,309.387 253.968,309.56 254.411,309.731 254.854,309.902 255.296,310.073 255.739,310.244 256.182,310.414 256.625,310.583 257.067,310.752 257.51,310.921 257.953,311.089 258.395,311.257 258.838,311.425 259.281,311.592 259.723,311.758 260.166,311.925 260.608,312.09 261.051,312.256 261.494,312.421 261.937,312.586 262.379,312.75 262.822,312.914 263.265,313.078 263.708,313.241 264.15,313.403 264.593,313.566 265.036,313.728 265.478,313.89 265.921,314.051 266.364,314.211 266.806,314.372 267.249,314.532 267.692,314.692 268.134,314.851 268.577,315.01 269.02,315.169 269.462,315.327 269.905,315.485 270.348,315.643 270.791,315.8 271.233,315.957 271.676,316.113 272.119,316.269 272.562,316.425 273.004,316.581 273.447,316.735 273.889,316.89 274.332,317.044 274.775,317.199 275.217,317.353 275.66,317.506 276.103,317.659 276.545,317.812 276.988,317.964 277.431,318.116 277.874,318.268 278.316,318.419 278.759,318.57 279.202,318.72 279.645,318.871 280.087,319.021 280.53,319.17 280.973,319.32 281.415,319.469 281.858,319.618 282.301,319.766 282.743,319.914 283.186,320.062 283.628,320.209 284.071,320.356 284.514,320.503 284.957,320.65 285.399,320.796 285.842,320.942 286.285,321.087 286.728,321.233 287.17,321.378 287.613,321.522 288.056,321.667 288.498,321.811 288.941,321.955 289.384,322.098 289.826,322.241 290.269,322.384 290.712,322.527 291.154,322.669 291.597,322.811 292.04,322.953 292.482,323.094 292.925,323.235 293.368,323.376 293.811,323.517 294.253,323.657 294.696,323.797 295.139,323.937 295.582,324.076 296.024,324.215 296.467,324.354 296.909,324.493 297.352,324.631 297.795,324.769 298.237,324.907 298.68,325.044 299.123,325.181 299.565,325.318 300.008,325.455 300.451,325.591 300.894,325.727 301.336,325.863 301.779,325.999 302.222,326.134 302.665,326.269 303.107,326.404 303.55,326.538 303.993,326.672 304.435,326.807 304.878,326.94 305.321,327.074 305.763,327.207 306.206,327.34 306.648,327.473 307.091,327.605 307.534,327.737 307.977,327.869 308.419,328.001 308.862,328.132 309.305,328.264 309.748,328.395 310.19,328.525 310.633,328.656 311.076,328.786 311.518,328.916 311.961,329.045 312.404,329.175 312.846,329.304 313.289,329.433 313.732,329.562 314.174,329.69 314.617,329.819 315.06,329.947 315.502,330.075 315.945,330.202 316.388,330.33 316.831,330.457 317.273,330.583 317.716,330.71 318.159,330.836 318.602,330.962 319.044,331.088 319.487,331.214 319.929,331.339 320.372,331.465 320.815,331.59 321.257,331.714 321.7,331.839 322.143,331.963 322.585,332.087 323.028,332.211 323.471,332.335 323.914,332.458 324.356,332.582 324.799,332.705 325.242,332.828 325.685,332.95 326.127,333.073 326.57,333.195 327.013,333.316 327.455,333.438 327.898,333.56 328.341,333.681 328.783,333.802 329.226,333.923 329.668,334.043 330.111,334.164 330.554,334.284 330.997,334.404 331.439,334.524 331.882,334.644 332.325,334.763 332.768,334.882 333.21,335.001 333.653,335.12 334.096,335.239 334.538,335.357 334.981,335.475 335.424,335.593 335.866,335.711 336.309,335.828 336.752,335.946 337.194,336.063 337.637,336.18 338.08,336.296 338.522,336.413 338.965,336.529 339.408,336.646 339.851,336.762 340.293,336.877 340.736,336.993 341.179,337.108 341.622,337.224 342.064,337.339 342.507,337.454 342.949,337.568 343.392,337.683 343.835,337.797 344.277,337.911 344.72,338.025 345.163,338.138 345.605,338.252 346.048,338.365 346.491,338.479 346.934,338.591 347.376,338.704 347.819,338.816 348.262,338.929 348.705,339.041 349.147,339.153 349.59,339.265 350.033,339.376 350.475,339.488 350.918,339.6 351.361,339.71 351.803,339.822 352.246,339.932 352.688,340.043 353.131,340.153 353.574,340.264 354.017,340.374 354.459,340.483 354.902,340.593 355.345,340.703 355.788,340.812 356.23,340.921 356.673,341.03 357.116,341.139 357.558,341.248 358.001,341.356 358.444,341.465 358.886,341.573 359.329,341.681 359.772,341.789 360.214,341.896 360.657,342.004 361.1,342.111 361.542,342.218 361.985,342.325 362.428,342.432 362.871,342.539 363.313,342.645 363.756,342.751 364.199,342.857 364.642,342.964 365.084,343.069 365.527,343.175 365.969,343.281 366.412,343.386 366.855,343.491 367.297,343.596 367.74,343.701 368.183,343.806 368.625,343.91 369.068,344.015 369.511,344.119 369.954,344.223 370.396,344.327 370.839,344.431 371.282,344.534 371.725,344.638 372.167,344.741 372.61,344.844 373.053,344.947 373.495,345.05 373.938,345.153 374.381,345.255 374.823,345.358 375.266,345.46 375.708,345.562 376.151,345.664 376.594,345.766 377.037,345.867 377.479,345.969 377.922,346.07 378.365,346.171 378.808,346.272 379.25,346.373 379.693,346.474 380.136,346.575 380.578,346.675 381.021,346.775 381.464,346.875 381.906,346.976 382.349,347.075 382.792,347.175 383.234,347.274 383.677,347.374 384.12,347.473 384.563,347.573 385.005,347.671 385.448,347.771 385.891,347.869 386.333,347.968 386.776,348.066 387.219,348.165 387.662,348.263 388.104,348.361 388.547,348.458 388.989,348.556 389.432,348.654 389.875,348.751 390.317,348.849 390.76,348.946 391.203,349.043 391.646,349.14 392.088,349.236 392.531,349.333 392.974,349.43 393.417,349.526 393.859,349.623 394.302,349.718 394.745,349.814 395.187,349.91 395.63,350.006 396.073,350.102 396.515,350.197 396.958,350.292 397.401,350.388 397.843,350.482 398.286,350.578 398.729,350.672 399.171,350.767 399.614,350.861 400.057,350.956 400.5,351.05 400.942,351.144 401.385,351.238 401.828,351.332 402.271,351.426 402.713,351.52 403.156,351.613 403.598,351.707 404.041,351.8 404.484,351.893 404.926,351.986 405.369,352.079 405.812,352.171 406.254,352.264 406.697,352.356 407.14,352.449 407.583,352.541 408.025,352.633 408.468,352.725 408.911,352.817 409.354,352.909 409.796,353 410.239,353.092 410.682,353.184 411.124,353.275 411.567,353.366 412.009,353.457 412.452,353.548 412.895,353.639 413.337,353.729 413.78,353.82 414.223,353.91 414.666,354 415.108,354.091 415.551,354.181 415.994,354.271 416.437,354.361 416.879,354.451 417.322,354.54 417.765,354.629 418.207,354.719 418.65,354.808 419.093,354.897 419.535,354.986 419.978,355.075 420.421,355.164 420.863,355.253 421.306,355.341 421.749,355.43 422.191,355.518 422.634,355.606 423.077,355.695 423.52,355.783 423.962,355.871 424.405,355.958 424.848,356.046 425.291,356.134 425.733,356.221 426.176,356.309 426.618,356.396 427.061,356.483 427.504,356.57 427.946,356.657 428.389,356.744 428.832,356.83 429.274,356.917 429.717,357.003 430.16,357.089 430.603,357.176 431.045,357.262 431.488,357.348 431.931,357.434 432.374,357.52 432.816,357.605 433.259,357.691 433.702,357.777 434.144,357.862 434.587,357.947 435.029,358.033 435.472,358.118 435.915,358.203 436.357,358.288 436.8,358.372 437.243,358.457 437.686,358.542 438.128,358.626 438.571,358.71 439.014,358.794 439.457,358.879 439.899,358.963 440.342,359.047 440.785,359.13 441.227,359.214 441.67,359.298 442.113,359.381 442.555,359.465 442.998,359.548 443.441,359.631 443.883,359.714 444.326,359.798 444.769,359.88 445.211,359.963 445.654,360.046 446.097,360.129 446.54,360.211 446.982,360.294 447.425,360.376 447.868,360.458 448.311,360.541 448.753,360.623 449.196,360.705 449.638,360.787 450.081,360.868 450.524,360.95 450.966,361.031 451.409,361.113 451.852,361.194 452.294,361.275 452.737,361.356 453.18,361.438 453.623,361.519 454.065,361.6 454.508,361.68 454.951,361.761 455.394,361.842 455.836,361.922 456.279,362.002 456.722,362.083 457.164,362.163 457.607,362.244 458.05,362.323 458.492,362.403 458.935,362.483 459.377,362.563 459.82,362.643 460.263,362.722 460.706,362.802 461.148,362.881 461.591,362.96 462.034,363.04 462.477,363.119 462.919,363.198 463.362,363.277 463.805,363.356 464.247,363.435 464.69,363.513 465.133,363.592 465.575,363.67 466.018,363.749 466.461,363.827 466.903,363.905 467.346,363.983 467.789,364.062 468.231,364.14 468.674,364.217 469.117,364.295 469.56,364.373 470.002,364.451 470.445,364.528 470.888,364.605 471.33,364.683 471.773,364.76 472.216,364.837 472.658,364.915 473.101,364.991 473.544,365.068 473.986,365.145 474.429,365.222 474.872,365.298 475.314,365.375 475.757,365.452 476.2,365.528 476.643,365.604 477.085,365.681 477.528,365.757 477.971,365.833 478.414,365.909 478.856,365.985 479.299,366.061 479.742,366.136 480.184,366.212 480.627,366.288 481.069,366.363 481.512,366.438 481.955,366.514 482.397,366.589 482.84,366.664 483.283,366.739 483.726,366.814 484.168,366.889 484.611,366.964 485.054,367.039 485.497,367.114 485.939,367.188 486.382,367.263 486.825,367.337 487.267,367.412 487.71,367.486 488.153,367.56 488.595,367.634 489.038,367.708 489.481,367.782 489.923,367.856 490.366,367.93 490.809,368.003 491.251,368.077 491.694,368.151 492.137,368.224 492.58,368.297 493.022,368.371 493.465,368.444 493.908,368.517 494.351,368.59 494.793,368.664 495.236,368.736 495.678,368.809 496.121,368.882 496.564,368.955 497.006,369.027 497.449,369.1 497.892,369.172 498.334,369.245 498.777,369.317 499.22,369.39 499.663,369.461 500.105,369.534 500.548,369.606 500.991,369.678 501.434,369.75 501.876,369.821 502.319,369.893 502.762,369.965 503.204,370.036 503.647,370.108 504.089,370.179 504.532,370.25 504.975,370.322 505.417,370.393 505.86,370.464 506.303,370.535 506.746,370.606 507.188,370.677 507.631,370.748 508.074,370.819 508.517,370.89 508.959,370.96 509.402,371.031 509.845,371.101 510.287,371.172 510.73,371.242 511.173,371.312 511.615,371.382 512.058,371.453 512.501,371.522 512.943,371.593 513.386,371.663 513.829,371.732 514.271,371.802 514.714,371.872 515.157,371.941 515.6,372.011 516.042,372.081 516.485,372.15 516.928,372.219 517.371,372.289 517.813,372.358 518.256,372.427 518.698,372.496 519.141,372.565 519.584,372.634 520.026,372.703 520.469,372.771 520.912,372.84 521.354,372.909 521.797,372.978 522.24,373.046 522.683,373.115 523.125,373.183 523.568,373.251 524.011,373.319 524.454,373.388 524.896,373.456 525.339,373.524 525.782,373.592 526.224,373.66 526.667,373.728 527.109,373.795 527.552,373.863 527.995,373.931 528.438,373.999 528.88,374.066 529.323,374.133 529.766,374.201 530.208,374.268 530.651,374.335 531.094,374.402 531.537,374.47 531.979,374.537 532.422,374.604 532.865,374.67 533.307,374.737 533.75,374.804"/>
<polyline fill="none" stroke="#00ff00" stroke-width="0.5" stroke-dasharray="11,5" points="91.5,314.888 91.9429,315.146 92.3853,315.398 92.8281,315.645 93.271,315.887 93.7134,316.123 94.1563,316.354 94.5986,316.581 95.0415,316.802 95.4844,317.019 95.9268,317.231 96.3696,317.438 96.8125,317.642 97.2549,317.841 97.6978,318.035 98.1406,318.226 98.583,318.412 99.0259,318.595 99.4683,318.773 99.9111,318.948 100.354,319.119 100.796,319.287 101.239,319.451 101.682,319.611 102.125,319.768 102.567,319.921 103.01,320.071 103.453,320.217 103.896,320.361 104.338,320.501 104.781,320.638 105.224,320.772 105.666,320.902 106.109,321.03 106.552,321.155 106.994,321.277 107.437,321.396 107.879,321.512 108.322,321.626 108.765,321.736 109.208,321.844 109.65,321.95 110.093,322.052 110.536,322.152 110.979,322.25 111.421,322.344 111.864,322.437 112.307,322.526 112.749,322.613 113.192,322.698 113.635,322.781 114.077,322.861 114.52,322.939 114.963,323.014 115.405,323.087 115.848,323.158 116.291,323.227 116.733,323.293 117.176,323.358 117.619,323.42 118.062,323.48 118.504,323.538 118.947,323.593 119.39,323.647 119.833,323.699 120.275,323.748 120.718,323.796 121.161,323.841 121.603,323.885 122.046,323.926 122.488,323.966 122.931,324.004 123.374,324.04 123.816,324.074 124.259,324.106 124.702,324.136 125.145,324.165 125.587,324.191 126.03,324.216 126.473,324.239 126.916,324.26 127.358,324.28 127.801,324.298 128.244,324.314 128.686,324.328 129.129,324.341 129.572,324.352 130.014,324.361 130.457,324.369 130.899,324.375 131.342,324.379 131.785,324.382 132.228,324.384 132.67,324.383 133.113,324.381 133.556,324.378 133.999,324.373 134.441,324.366 134.884,324.358 135.327,324.349 135.769,324.337 136.212,324.325 136.655,324.311 137.097,324.295 137.54,324.278 137.983,324.26 138.425,324.24 138.868,324.219 139.311,324.196 139.753,324.172 140.196,324.146 140.639,324.12 141.082,324.091 141.524,324.062 141.967,324.03 142.41,323.998 142.853,323.964 143.295,323.929 143.738,323.893 144.181,323.855 144.623,323.816 145.066,323.776 145.508,323.734 145.951,323.692 146.394,323.647 146.836,323.602 147.279,323.556 147.722,323.508 148.165,323.458 148.607,323.408 149.05,323.357 149.493,323.304 149.936,323.25 150.378,323.195 150.821,323.138 151.264,323.081 151.706,323.022 152.149,322.962 152.592,322.901 153.034,322.838 153.477,322.775 153.919,322.71 154.362,322.645 154.805,322.578 155.248,322.51 155.69,322.441 156.133,322.371 156.576,322.299 157.019,322.227 157.461,322.153 157.904,322.079 158.347,322.003 158.789,321.926 159.232,321.848 159.675,321.77 160.117,321.689 160.56,321.608 161.003,321.526 161.445,321.443 161.888,321.359 162.331,321.273 162.773,321.188 163.216,321.1 163.659,321.012 164.102,320.922 164.544,320.832 164.987,320.741 165.43,320.648 165.873,320.555 166.315,320.46 166.758,320.365 167.201,320.269 167.643,320.172 168.086,320.074 168.528,319.975 168.971,319.874 169.414,319.773 169.856,319.671 170.299,319.568 170.742,319.464 171.185,319.359 171.627,319.253 172.07,319.146 172.513,319.039 172.956,318.93 173.398,318.821 173.841,318.71 174.284,318.599 174.726,318.487 175.169,318.374 175.612,318.26 176.054,318.145 176.497,318.029 176.939,317.912 177.382,317.794 177.825,317.676 178.268,317.557 178.71,317.437 179.153,317.315 179.596,317.193 180.039,317.071 180.481,316.947 180.924,316.823 181.367,316.697 181.809,316.571 182.252,316.444 182.695,316.316 183.137,316.188 183.58,316.058 184.023,315.927 184.465,315.796 184.908,315.665 185.351,315.532 185.793,315.398 186.236,315.263 186.679,315.128 187.122,314.992 187.564,314.855 188.007,314.718 188.45,314.579 188.893,314.44 189.335,314.3 189.778,314.159 190.221,314.018 190.663,313.875 191.106,313.732 191.548,313.588 191.991,313.443 192.434,313.298 192.876,313.152 193.319,313.005 193.762,312.857 194.205,312.708 194.647,312.56 195.09,312.41 195.533,312.259 195.976,312.107 196.418,311.955 196.861,311.802 197.304,311.648 197.746,311.494 198.189,311.339 198.632,311.183 199.074,311.026 199.517,310.869 199.959,310.711 200.402,310.552 200.845,310.393 201.288,310.233 201.73,310.072 202.173,309.91 202.616,309.748 203.059,309.585 203.501,309.421 203.944,309.257 204.387,309.092 204.829,308.926 205.272,308.76 205.715,308.592 206.157,308.425 206.6,308.256 207.043,308.087 207.485,307.917 207.928,307.747 208.371,307.575 208.813,307.403 209.256,307.23 209.699,307.058 210.142,306.884 210.584,306.709 211.027,306.534 211.47,306.358 211.913,306.181 212.355,306.004 212.798,305.826 213.241,305.648 213.683,305.469 214.126,305.289 214.568,305.108 215.011,304.927 215.454,304.746 215.896,304.563 216.339,304.38 216.782,304.197 217.225,304.013 217.667,303.828 218.11,303.642 218.553,303.456 218.996,303.269 219.438,303.082 219.881,302.894 220.324,302.705 220.766,302.516 221.209,302.326 221.652,302.136 222.094,301.945 222.537,301.753 222.979,301.561 223.422,301.368 223.865,301.174 224.308,300.98 224.75,300.786 225.193,300.59 225.636,300.395 226.079,300.198 226.521,300.001 226.964,299.803 227.407,299.605 227.849,299.406 228.292,299.207 228.735,299.007 229.177,298.806 229.62,298.605 230.063,298.403 230.505,298.201 230.948,297.998 231.391,297.795 231.833,297.591 232.276,297.386 232.719,297.181 233.162,296.975 233.604,296.769 234.047,296.562 234.49,296.355 234.933,296.147 235.375,295.938 235.818,295.729 236.261,295.52 236.703,295.309 237.146,295.099 237.588,294.887 238.031,294.675 238.474,294.463 238.917,294.25 239.359,294.037 239.802,293.822 240.245,293.608 240.688,293.393 241.13,293.177 241.573,292.961 242.016,292.744 242.458,292.527 242.901,292.309 243.344,292.091 243.786,291.872 244.229,291.652 244.672,291.433 245.114,291.212 245.557,290.991 246,290.77 246.442,290.547 246.885,290.325 247.328,290.102 247.771,289.878 248.213,289.654 248.656,289.43 249.099,289.205 249.542,288.979 249.984,288.752 250.427,288.526 250.869,288.299 251.312,288.071 251.755,287.843 252.197,287.614 252.64,287.385 253.083,287.155 253.525,286.925 253.968,286.694 254.411,286.463 254.854,286.231 255.296,286 255.739,285.767 256.182,285.534 256.625,285.3 257.067,285.065 257.51,284.831 257.953,284.596 258.395,284.36 258.838,284.124 259.281,283.887 259.723,283.65 260.166,283.413 260.608,283.175 261.051,282.936 261.494,282.697 261.937,282.458 262.379,282.218 262.822,281.977 263.265,281.736 263.708,281.495 264.15,281.253 264.593,281.011 265.036,280.768 265.478,280.524 265.921,280.281 266.364,280.037 266.806,279.792 267.249,279.547 267.692,279.301 268.134,279.055 268.577,278.809 269.02,278.562 269.462,278.314 269.905,278.066 270.348,277.818 270.791,277.569 271.233,277.319 271.676,277.07 272.119,276.82 272.562,276.569 273.004,276.318 273.447,276.066 273.889,275.814 274.332,275.562 274.775,275.309 275.217,275.056 275.66,274.802 276.103,274.547 276.545,274.293 276.988,274.038 277.431,273.782 277.874,273.526 278.316,273.27 278.759,273.013 279.202,272.755 279.645,272.498 280.087,272.239 280.53,271.981 280.973,271.722 281.415,271.462 281.858,271.202 282.301,270.942 282.743,270.681 283.186,270.42 283.628,270.158 284.071,269.896 284.514,269.634 284.957,269.371 285.399,269.107 285.842,268.844 286.285,268.58 286.728,268.315 287.17,268.05 287.613,267.784 288.056,267.519 288.498,267.252 288.941,266.985 289.384,266.718 289.826,266.451 290.269,266.183 290.712,265.914 291.154,265.646 291.597,265.376 292.04,265.106 292.482,264.836 292.925,264.566 293.368,264.295 293.811,264.024 294.253,263.752 294.696,263.48 295.139,263.208 295.582,262.935 296.024,262.662 296.467,262.388 296.909,262.114 297.352,261.839 297.795,261.564 298.237,261.289 298.68,261.013 299.123,260.737 299.565,260.461 300.008,260.184 300.451,259.907 300.894,259.629 301.336,259.351 301.779,259.072 302.222,258.793 302.665,258.514 303.107,258.234 303.55,257.955 303.993,257.674 304.435,257.393 304.878,257.112 305.321,256.831 305.763,256.548 306.206,256.266 306.648,255.983 307.091,255.7 307.534,255.417 307.977,255.133 308.419,254.849 308.862,254.563 309.305,254.279 309.748,253.993 310.19,253.708 310.633,253.421 311.076,253.135 311.518,252.848 311.961,252.561 312.404,252.272 312.846,251.984 313.289,251.696 313.732,251.407 314.174,251.118 314.617,250.829 315.06,250.539 315.502,250.248 315.945,249.958 316.388,249.667 316.831,249.375 317.273,249.083 317.716,248.791 318.159,248.499 318.602,248.206 319.044,247.912 319.487,247.619 319.929,247.325 320.372,247.03 320.815,246.736 321.257,246.44 321.7,246.145 322.143,245.849 322.585,245.553 323.028,245.257 323.471,244.959 323.914,244.663 324.356,244.365 324.799,244.067 325.242,243.769 325.685,243.47 326.127,243.171 326.57,242.872 327.013,242.572 327.455,242.271 327.898,241.971 328.341,241.67 328.783,241.369 329.226,241.068 329.668,240.766 330.111,240.464 330.554,240.161 330.997,239.858 331.439,239.555 331.882,239.251 332.325,238.947 332.768,238.643 333.21,238.338 333.653,238.034 334.096,237.728 334.538,237.422 334.981,237.117 335.424,236.81 335.866,236.503 336.309,236.196 336.752,235.889 337.194,235.582 337.637,235.273 338.08,234.965 338.522,234.656 338.965,234.347 339.408,234.038 339.851,233.728 340.293,233.418 340.736,233.107 341.179,232.796 341.622,232.485 342.064,232.174 342.507,231.862 342.949,231.55 343.392,231.238 343.835,230.925 344.277,230.612 344.72,230.298 345.163,229.985 345.605,229.671 346.048,229.356 346.491,229.042 346.934,228.727 347.376,228.411 347.819,228.095 348.262,227.779 348.705,227.463 349.147,227.146 349.59,226.829 350.033,226.512 350.475,226.194 350.918,225.876 351.361,225.558 351.803,225.239 352.246,224.92 352.688,224.601 353.131,224.281 353.574,223.961 354.017,223.641 354.459,223.321 354.902,223 355.345,222.679 355.788,222.357 356.23,222.035 356.673,221.713 357.116,221.391 357.558,221.068 358.001,220.745 358.444,220.421 358.886,220.098 359.329,219.773 359.772,219.449 360.214,219.125 360.657,218.8 361.1,218.474 361.542,218.148 361.985,217.823 362.428,217.497 362.871,217.17 363.313,216.843 363.756,216.516 364.199,216.188 364.642,215.861 365.084,215.533 365.527,215.204 365.969,214.875 366.412,214.547 366.855,214.217 367.297,213.888 367.74,213.558 368.183,213.228 368.625,212.897 369.068,212.566 369.511,212.235 369.954,211.904 370.396,211.572 370.839,211.24 371.282,210.908 371.725,210.575 372.167,210.242 372.61,209.909 373.053,209.575 373.495,209.242 373.938,208.907 374.381,208.573 374.823,208.238 375.266,207.903 375.708,207.568 376.151,207.232 376.594,206.896 377.037,206.56 377.479,206.224 377.922,205.887 378.365,205.55 378.808,205.212 379.25,204.875 379.693,204.537 380.136,204.198 380.578,203.86 381.021,203.521 381.464,203.182 381.906,202.842 382.349,202.503 382.792,202.163 383.234,201.822 383.677,201.482 384.12,201.141 384.563,200.8 385.005,200.458 385.448,200.117 385.891,199.775 386.333,199.433 386.776,199.09 387.219,198.747 387.662,198.404 388.104,198.061 388.547,197.717 388.989,197.373 389.432,197.028 389.875,196.684 390.317,196.339 390.76,195.994 391.203,195.648 391.646,195.303 392.088,194.957 392.531,194.61 392.974,194.264 393.417,193.917 393.859,193.57 394.302,193.222 394.745,192.875 395.187,192.527 395.63,192.179 396.073,191.83 396.515,191.481 396.958,191.132 397.401,190.783 397.843,190.433 398.286,190.083 398.729,189.733 399.171,189.383 399.614,189.032 400.057,188.681 400.5,188.33 400.942,187.978 401.385,187.626 401.828,187.274 402.271,186.922 402.713,186.569 403.156,186.216 403.598,185.863 404.041,185.51 404.484,185.156 404.926,184.802 405.369,184.448 405.812,184.093 406.254,183.739 406.697,183.384 407.14,183.028 407.583,182.673 408.025,182.317 408.468,181.961 408.911,181.604 409.354,181.248 409.796,180.891 410.239,180.534 410.682,180.176 411.124,179.818 411.567,179.46 412.009,179.102 412.452,178.744 412.895,178.385 413.337,178.026 413.78,177.667 414.223,177.307 414.666,176.947 415.108,176.587 415.551,176.227 415.994,175.866 416.437,175.505 416.879,175.144 417.322,174.783 417.765,174.421 418.207,174.059 418.65,173.697 419.093,173.334 419.535,172.972 419.978,172.609 420.421,172.246 420.863,171.882 421.306,171.519 421.749,171.154 422.191,170.79 422.634,170.426 423.077,170.061 423.52,169.696 423.962,169.331 424.405,168.965 424.848,168.599 425.291,168.233 425.733,167.867 426.176,167.5 426.618,167.134 427.061,166.767 427.504,166.399 427.946,166.032 428.389,165.664 428.832,165.296 429.274,164.928 429.717,164.559 430.16,164.19 430.603,163.821 431.045,163.452 431.488,163.083 431.931,162.712 432.374,162.343 432.816,161.972 433.259,161.602 433.702,161.231 434.144,160.86 434.587,160.489 435.029,160.117 435.472,159.745 435.915,159.373 436.357,159.001 436.8,158.628 437.243,158.255 437.686,157.883 438.128,157.509 438.571,157.136 439.014,156.762 439.457,156.388 439.899,156.014 440.342,155.639 440.785,155.265 441.227,154.89 441.67,154.514 442.113,154.139 442.555,153.763 442.998,153.387 443.441,153.011 443.883,152.635 444.326,152.258 444.769,151.881 445.211,151.504 445.654,151.126 446.097,150.749 446.54,150.371 446.982,149.993 447.425,149.615 447.868,149.236 448.311,148.857 448.753,148.478 449.196,148.099 449.638,147.719 450.081,147.339 450.524,146.959 450.966,146.579 451.409,146.199 451.852,145.818 452.294,145.437 452.737,145.056 453.18,144.674 453.623,144.293 454.065,143.911 454.508,143.529 454.951,143.146 455.394,142.764 455.836,142.381 456.279,141.998 456.722,141.615 457.164,141.231 457.607,140.847 458.05,140.463 458.492,140.079 458.935,139.694 459.377,139.31 459.82,138.925 460.263,138.54 460.706,138.154 461.148,137.769 461.591,137.383 462.034,136.997 462.477,136.61 462.919,136.224 463.362,135.837 463.805,135.45 464.247,135.063 464.69,134.675 465.133,134.288 465.575,133.9 466.018,133.512 466.461,133.123 466.903,132.735 467.346,132.346 467.789,131.957 468.231,131.567 468.674,131.178 469.117,130.788 469.56,130.398 470.002,130.008 470.445,129.618 470.888,129.227 471.33,128.836 471.773,128.445 472.216,128.054 472.658,127.662 473.101,127.271 473.544,126.878 473.986,126.486 474.429,126.094 474.872,125.701 475.314,125.309 475.757,124.916 476.2,124.522 476.643,124.128 477.085,123.735 477.528,123.341 477.971,122.946 478.414,122.552 478.856,122.157 479.299,121.763 479.742,121.368 480.184,120.972 480.627,120.577 481.069,120.181 481.512,119.785 481.955,119.389 482.397,118.993 482.84,118.596 483.283,118.199 483.726,117.802 484.168,117.405 484.611,117.007 485.054,116.609 485.497,116.211 485.939,115.813 486.382,115.415 486.825,115.017 487.267,114.618 487.71,114.219 488.153,113.819 488.595,113.42 489.038,113.021 489.481,112.621 489.923,112.221 490.366,111.82 490.809,111.42 491.251,111.019 491.694,110.618 492.137,110.217 492.58,109.815 493.022,109.414 493.465,109.012 493.908,108.61 494.351,108.208 494.793,107.806 495.236,107.403 495.678,107 496.121,106.597 496.564,106.194 497.006,105.791 497.449,105.387 497.892,104.983 498.334,104.579 498.777,104.174 499.22,103.77 499.663,103.365 500.105,102.96 500.548,102.555 500.991,102.149 501.434,101.744 501.876,101.338 502.319,100.932 502.762,100.526 503.204,100.12 503.647,99.7129 504.089,99.3062 504.532,98.8989 504.975,98.4917 505.417,98.0845 505.86,97.6768 506.303,97.269 506.746,96.8608 507.188,96.4526 507.631,96.0439 508.074,95.6353 508.517,95.2266 508.959,94.8174 509.402,94.4082 509.845,93.9985 510.287,93.5889 510.73,93.1792 511.173,92.769 511.615,92.3584 512.058,91.9482 512.501,91.5376 512.943,91.1265 513.386,90.7153 513.829,90.3042 514.271,89.8926 514.714,89.4805 515.157,89.0688 515.6,88.6567 516.042,88.2441 516.485,87.8315 516.928,87.4189 517.371,87.0059 517.813,86.5928 518.256,86.1797 518.698,85.7661 519.141,85.3521 519.584,84.9385 520.026,84.5239 520.469,84.1099 520.912,83.6953 521.354,83.2803 521.797,82.8657 522.24,82.4502 522.683,82.0352 523.125,81.6196 523.568,81.2036 524.011,80.7876 524.454,80.3716 524.896,79.9551 525.339,79.5386 525.782,79.1221 526.224,78.7051 526.667,78.2881 527.109,77.8706 527.552,77.4531 527.995,77.0352 528.438,76.6177 528.88,76.1992 529.323,75.7813 529.766,75.3628 530.208,74.9438 530.651,74.5249 531.094,74.106 531.537,73.6865 531.979,73.2671 532.422,72.8477 532.865,72.4277 533.307,72.0073 533.75,71.5874"/>
<polygon fill="#ffffff" points="527.288,60.4502 423.75,96.1499 423.75,60.4502"/>
<polygon fill="#ffffff" points="527.288,96.1499 423.75,96.1499 527.288,60.4502"/>
<polyline fill="none" stroke="#000000" stroke-width="0.5" points="423.75,96.1499 423.75,60.4502 527.288,60.4502 527.288,96.1499 423.75,96.1499"/>
<text fill="#000000" x="487" y="76" transform="rotate(0, 487, 76)" font-size="10" font-family="SansSerif" font-style="normal" font-weight="normal">-log(x)</text>
<text fill="#000000" x="487" y="91" transform="rotate(0, 487, 91)" font-size="10" font-family="SansSerif" font-style="normal" font-weight="normal">x*log(x)</text>
<polyline fill="none" stroke="#00ff00" stroke-width="0.5" stroke-dasharray="11,5" points="429.462,85.5 452.313,85.5 475.163,85.5"/>
<polyline fill="none" stroke="#0000ff" stroke-width="0.5" points="429.462,71.1001 452.313,71.1001 475.163,71.1001"/>
<polyline fill="none" stroke="#000000" stroke-width="0.5" points="76.25,402.5 76.25,57.5"/>
<polyline fill="none" stroke="#000000" stroke-width="0.5" points="76.25,402.5 69.395,402.5"/>
<polyline fill="none" stroke="#000000" stroke-width="0.5" points="76.25,368 69.395,368"/>
<polyline fill="none" stroke="#000000" stroke-width="0.5" points="76.25,333.5 69.395,333.5"/>
<polyline fill="none" stroke="#000000" stroke-width="0.5" points="76.25,299 69.395,299"/>
<polyline fill="none" stroke="#000000" stroke-width="0.5" points="76.25,264.5 69.395,264.5"/>
<polyline fill="none" stroke="#000000" stroke-width="0.5" points="76.25,230 69.395,230"/>
<polyline fill="none" stroke="#000000" stroke-width="0.5" points="76.25,195.5 69.395,195.5"/>
<polyline fill="none" stroke="#000000" stroke-width="0.5" points="76.25,161 69.395,161"/>
<polyline fill="none" stroke="#000000" stroke-width="0.5" points="76.25,126.5 69.395,126.5"/>
<polyline fill="none" stroke="#000000" stroke-width="0.5" points="76.25,92 69.395,92"/>
<polyline fill="none" stroke="#000000" stroke-width="0.5" points="76.25,57.5 69.395,57.5"/>
<polyline fill="none" stroke="#000000" stroke-width="0.5" points="76.25,385.25 72.1372,385.25"/>
<polyline fill="none" stroke="#000000" stroke-width="0.5" points="76.25,350.75 72.1372,350.75"/>
<polyline fill="none" stroke="#000000" stroke-width="0.5" points="76.25,316.25 72.1372,316.25"/>
<polyline fill="none" stroke="#000000" stroke-width="0.5" points="76.25,281.75 72.1372,281.75"/>
<polyline fill="none" stroke="#000000" stroke-width="0.5" points="76.25,247.25 72.1372,247.25"/>
<polyline fill="none" stroke="#000000" stroke-width="0.5" points="76.25,212.75 72.1372,212.75"/>
<polyline fill="none" stroke="#000000" stroke-width="0.5" points="76.25,178.25 72.1372,178.25"/>
<polyline fill="none" stroke="#000000" stroke-width="0.5" points="76.25,143.75 72.1372,143.75"/>
<polyline fill="none" stroke="#000000" stroke-width="0.5" points="76.25,109.25 72.1372,109.25"/>
<polyline fill="none" stroke="#000000" stroke-width="0.5" points="76.25,74.75 72.1372,74.75"/>
<text fill="#000000" x="49" y="408" transform="rotate(-0, 49, 408)" font-size="10" font-family="SansSerif" font-style="normal" font-weight="normal">-1.5</text>
<text fill="#000000" x="49" y="373" transform="rotate(-0, 49, 373)" font-size="10" font-family="SansSerif" font-style="normal" font-weight="normal">-1.0</text>
<text fill="#000000" x="49" y="339" transform="rotate(-0, 49, 339)" font-size="10" font-family="SansSerif" font-style="normal" font-weight="normal">-0.5</text>
<text fill="#000000" x="52" y="304" transform="rotate(-0, 52, 304)" font-size="10" font-family="SansSerif" font-style="normal" font-weight="normal">0.0</text>
<text fill="#000000" x="52" y="270" transform="rotate(-0, 52, 270)" font-size="10" font-family="SansSerif" font-style="normal" font-weight="normal">0.5</text>
<text fill="#000000" x="53" y="235" transform="rotate(-0, 53, 235)" font-size="10" font-family="SansSerif" font-style="normal" font-weight="normal">1.0</text>
<text fill="#000000" x="52" y="200" transform="rotate(-0, 52, 200)" font-size="10" font-family="SansSerif" font-style="normal" font-weight="normal">1.5</text>
<text fill="#000000" x="52" y="166" transform="rotate(-0, 52, 166)" font-size="10" font-family="SansSerif" font-style="normal" font-weight="normal">2.0</text>
<text fill="#000000" x="52" y="131" transform="rotate(-0, 52, 131)" font-size="10" font-family="SansSerif" font-style="normal" font-weight="normal">2.5</text>
<text fill="#000000" x="52" y="97" transform="rotate(-0, 52, 97)" font-size="10" font-family="SansSerif" font-style="normal" font-weight="normal">3.0</text>
<text fill="#000000" x="52" y="62" transform="rotate(-0, 52, 62)" font-size="10" font-family="SansSerif" font-style="normal" font-weight="normal">3.5</text>
<polyline fill="none" stroke="#000000" stroke-width="0.5" points="76.25,402.5 533.75,402.5"/>
<polyline fill="none" stroke="#000000" stroke-width="0.5" points="76.25,402.5 76.25,407.675"/>
<polyline fill="none" stroke="#000000" stroke-width="0.5" points="152.5,402.5 152.5,407.675"/>
<polyline fill="none" stroke="#000000" stroke-width="0.5" points="228.75,402.5 228.75,407.675"/>
<polyline fill="none" stroke="#000000" stroke-width="0.5" points="305,402.5 305,407.675"/>
<polyline fill="none" stroke="#000000" stroke-width="0.5" points="381.25,402.5 381.25,407.675"/>
<polyline fill="none" stroke="#000000" stroke-width="0.5" points="457.5,402.5 457.5,407.675"/>
<polyline fill="none" stroke="#000000" stroke-width="0.5" points="533.75,402.5 533.75,407.675"/>
<polyline fill="none" stroke="#000000" stroke-width="0.5" points="95.3125,402.5 95.3125,405.605"/>
<polyline fill="none" stroke="#000000" stroke-width="0.5" points="114.375,402.5 114.375,405.605"/>
<polyline fill="none" stroke="#000000" stroke-width="0.5" points="133.438,402.5 133.438,405.605"/>
<polyline fill="none" stroke="#000000" stroke-width="0.5" points="171.563,402.5 171.563,405.605"/>
<polyline fill="none" stroke="#000000" stroke-width="0.5" points="190.625,402.5 190.625,405.605"/>
<polyline fill="none" stroke="#000000" stroke-width="0.5" points="209.688,402.5 209.688,405.605"/>
<polyline fill="none" stroke="#000000" stroke-width="0.5" points="247.813,402.5 247.813,405.605"/>
<polyline fill="none" stroke="#000000" stroke-width="0.5" points="266.875,402.5 266.875,405.605"/>
<polyline fill="none" stroke="#000000" stroke-width="0.5" points="285.938,402.5 285.938,405.605"/>
<polyline fill="none" stroke="#000000" stroke-width="0.5" points="324.063,402.5 324.063,405.605"/>
<polyline fill="none" stroke="#000000" stroke-width="0.5" points="343.125,402.5 343.125,405.605"/>
<polyline fill="none" stroke="#000000" stroke-width="0.5" points="362.188,402.5 362.188,405.605"/>
<polyline fill="none" stroke="#000000" stroke-width="0.5" points="400.313,402.5 400.313,405.605"/>
<polyline fill="none" stroke="#000000" stroke-width="0.5" points="419.375,402.5 419.375,405.605"/>
<polyline fill="none" stroke="#000000" stroke-width="0.5" points="438.438,402.5 438.438,405.605"/>
<polyline fill="none" stroke="#000000" stroke-width="0.5" points="476.563,402.5 476.563,405.605"/>
<polyline fill="none" stroke="#000000" stroke-width="0.5" points="495.625,402.5 495.625,405.605"/>
<polyline fill="none" stroke="#000000" stroke-width="0.5" points="514.688,402.5 514.688,405.605"/>
<text fill="#000000" x="68" y="419" transform="rotate(-0, 68, 419)" font-size="10" font-family="SansSerif" font-style="normal" font-weight="normal">0.0</text>
<text fill="#000000" x="145" y="419" transform="rotate(-0, 145, 419)" font-size="10" font-family="SansSerif" font-style="normal" font-weight="normal">0.5</text>
<text fill="#000000" x="221" y="419" transform="rotate(-0, 221, 419)" font-size="10" font-family="SansSerif" font-style="normal" font-weight="normal">1.0</text>
<text fill="#000000" x="297" y="419" transform="rotate(-0, 297, 419)" font-size="10" font-family="SansSerif" font-style="normal" font-weight="normal">1.5</text>
<text fill="#000000" x="373" y="419" transform="rotate(-0, 373, 419)" font-size="10" font-family="SansSerif" font-style="normal" font-weight="normal">2.0</text>
<text fill="#000000" x="450" y="419" transform="rotate(-0, 450, 419)" font-size="10" font-family="SansSerif" font-style="normal" font-weight="normal">2.5</text>
<text fill="#000000" x="526" y="419" transform="rotate(-0, 526, 419)" font-size="10" font-family="SansSerif" font-style="normal" font-weight="normal">3.0</text>
</g>
</svg>
