\relax 
\providecommand\HyperFirstAtBeginDocument{\AtBeginDocument}
\HyperFirstAtBeginDocument{\ifx\hyper@anchor\@undefined
\global\let\oldcontentsline\contentsline
\gdef\contentsline#1#2#3#4{\oldcontentsline{#1}{#2}{#3}}
\global\let\oldnewlabel\newlabel
\gdef\newlabel#1#2{\newlabelxx{#1}#2}
\gdef\newlabelxx#1#2#3#4#5#6{\oldnewlabel{#1}{{#2}{#3}}}
\AtEndDocument{\ifx\hyper@anchor\@undefined
\let\contentsline\oldcontentsline
\let\newlabel\oldnewlabel
\fi}
\fi}
\global\let\hyper@last\relax 
\gdef\HyperFirstAtBeginDocument#1{#1}
\providecommand\HyField@AuxAddToFields[1]{}
\@writefile{toc}{\contentsline {section}{\numberline {1}Discrete random variables}{4}{section.2}}
\newlabel{idp-section-discrandvar}{{1}{4}{Discrete random variables\relax }{section.2}{}}
\@writefile{toc}{\contentsline {subsection}{\numberline {1.1}Sets}{4}{subsection.3}}
\newlabel{introstats-setsrandomvars}{{1.1}{4}{Sets\relax }{subsection.3}{}}
\@writefile{lof}{\contentsline {figure}{\numberline {1}{\ignorespaces Operations on sets -- Upper left, union: $A\cup B$, Upper right, intersection: $A\cap B$, Lower left, complement: $A^c$, Lower right, difference: $A-B$}}{5}{figure.8}}
\newlabel{fig-introstats-operationsonsets}{{1}{5}{Operations on sets -- Upper left, union: $A\cup B$, Upper right, intersection: $A\cap B$, Lower left, complement: $A^c$, Lower right, difference: $A-B$\relax }{figure.8}{}}
\newlabel{introstats-die6faces-sets}{{1.1}{5}{\relax }{example.12}{}}
\@writefile{toc}{\contentsline {subsection}{\numberline {1.2}Distribution function and probability}{5}{subsection.14}}
\newlabel{introstats-die6facesspace}{{1.2}{6}{\relax }{example.15}{}}
\newlabel{introstats-defdistrib}{{1.1}{6}{\relax }{theorem.17}{}}
\newlabel{introstats-fin01}{{10}{6}{\relax }{equation.18}{}}
\newlabel{introstats-sumfeq1}{{11}{6}{\relax }{equation.19}{}}
\newlabel{introstats-die6faces}{{1.3}{6}{\relax }{example.20}{}}
\newlabel{introstats-defproba}{{1.2}{6}{\relax }{theorem.22}{}}
\newlabel{introstats-probasumf}{{13}{6}{\relax }{equation.23}{}}
\newlabel{introstats-die6faces2}{{1.4}{6}{\relax }{example.24}{}}
\@writefile{toc}{\contentsline {subsection}{\numberline {1.3}Properties of discrete probabilities}{7}{subsection.27}}
\newlabel{introstats-probaproperties}{{1.3}{7}{Properties of discrete probabilities\relax }{subsection.27}{}}
\newlabel{introstats-propoproba}{{1.3}{7}{\relax }{theorem.28}{}}
\newlabel{introstats-pomegaone}{{18}{7}{\relax }{equation.29}{}}
\newlabel{introstats-pemptyzero}{{19}{7}{\relax }{equation.30}{}}
\newlabel{introstats-asubsetb}{{20}{7}{\relax }{equation.31}{}}
\newlabel{introstats-pzerone}{{21}{7}{\relax }{equation.32}{}}
\newlabel{introstats-propopdisjoint}{{1.4}{7}{\relax }{theorem.34}{}}
\newlabel{introstats-pdisjointssum}{{23}{7}{\relax }{equation.35}{}}
\@writefile{lof}{\contentsline {figure}{\numberline {2}{\ignorespaces Two disjoint sets.}}{8}{figure.36}}
\newlabel{fig-introstats-disjointsets}{{2}{8}{Two disjoint sets}{figure.36}{}}
\newlabel{introstats-sequencedisjoint}{{1.5}{8}{\relax }{theorem.39}{}}
\newlabel{introstats-pdisjointssumk}{{28}{8}{\relax }{equation.40}{}}
\newlabel{introstats-die6faces3}{{1.5}{8}{\relax }{example.41}{}}
\@writefile{lof}{\contentsline {figure}{\numberline {3}{\ignorespaces Two sets with a non empty intersection.}}{9}{figure.48}}
\newlabel{fig-introstats-jointsets}{{3}{9}{Two sets with a non empty intersection}{figure.48}{}}
\newlabel{introstats-propocomplem}{{1.6}{9}{\relax }{theorem.42}{}}
\newlabel{introstats-theoremcomplem}{{29}{9}{\relax }{equation.43}{}}
\newlabel{introstats-die6faces4}{{1.6}{9}{\relax }{example.45}{}}
\newlabel{introstats-propounion}{{1.7}{9}{\relax }{theorem.46}{}}
\newlabel{eq-propounion}{{31}{9}{\relax }{equation.47}{}}
\citation{Panchenko1805L22005}
\newlabel{introstats-proofaunionb1}{{33}{10}{Properties of discrete probabilities\relax }{equation.50}{}}
\newlabel{introstats-proofaunionb2}{{35}{10}{Properties of discrete probabilities\relax }{equation.52}{}}
\newlabel{introstats-proofaunionb3}{{36}{10}{Properties of discrete probabilities\relax }{equation.53}{}}
\newlabel{introstats-probabactvirus}{{1.7}{10}{\relax }{example.55}{}}
\@writefile{toc}{\contentsline {subsection}{\numberline {1.4}Uniform distribution}{10}{subsection.56}}
\newlabel{introstats-unifdistrib}{{1.8}{10}{\relax }{theorem.57}{}}
\newlabel{introstats-eq-unifdistrib}{{38}{10}{\relax }{equation.58}{}}
\newlabel{introstats-probauniform}{{1.9}{11}{\relax }{theorem.59}{}}
\newlabel{introstats-die6faces5}{{1.8}{11}{\relax }{example.62}{}}
\@writefile{toc}{\contentsline {subsection}{\numberline {1.5}Conditional probability}{11}{subsection.63}}
\newlabel{introstats-conddistribution}{{1.10}{11}{\relax }{theorem.64}{}}
\newlabel{introstats-eq-conddistrib}{{43}{11}{\relax }{equation.65}{}}
\@writefile{lof}{\contentsline {figure}{\numberline {4}{\ignorespaces A set $A$, subset of the sample space $\Omega $.}}{12}{figure.66}}
\newlabel{fig-introstats-onesetA}{{4}{12}{A set $A$, subset of the sample space $\Omega $}{figure.66}{}}
\newlabel{introstats-eq-conddistribproof1}{{44}{12}{Conditional probability\relax }{equation.67}{}}
\newlabel{introstats-condproba}{{1.11}{12}{\relax }{theorem.69}{}}
\newlabel{introstats-eq-pabcond}{{49}{12}{\relax }{equation.70}{}}
\citation{LifeTableWHO2009}
\@writefile{lof}{\contentsline {figure}{\numberline {5}{\ignorespaces The conditionnal probability $P(A|B)$ measures the probability of the set $A\cap B$ with respect to the set $B$.}}{13}{figure.71}}
\newlabel{fig-introstats-setcondproba}{{5}{13}{The conditionnal probability $P(A|B)$ measures the probability of the set $A\cap B$ with respect to the set $B$}{figure.71}{}}
\citation{LifeTableWHO2009}
\@writefile{lof}{\contentsline {figure}{\numberline {6}{\ignorespaces Life table, United States of America, 2009 \cite  {LifeTableWHO2009}.}}{14}{figure.78}}
\newlabel{fig-lifetableUSA2009}{{6}{14}{Life table, United States of America, 2009 \cite {LifeTableWHO2009}}{figure.78}{}}
\@writefile{toc}{\contentsline {subsection}{\numberline {1.6}Life table}{14}{subsection.77}}
\newlabel{section-lifetable}{{1.6}{14}{Life table\relax }{subsection.77}{}}
\@writefile{toc}{\contentsline {subsection}{\numberline {1.7}Bayes' formula}{16}{subsection.140}}
\@writefile{lof}{\contentsline {figure}{\numberline {7}{\ignorespaces Probability that a female live to various ages, given that she is 40.}}{17}{figure.139}}
\newlabel{fig-lifeproba}{{7}{17}{Probability that a female live to various ages, given that she is 40}{figure.139}{}}
\newlabel{introstats-eq-Bayesformula}{{64}{17}{\relax }{equation.143}{}}
\newlabel{proof-introstats-bayesformula1}{{65}{17}{Bayes' formula\relax }{equation.144}{}}
\newlabel{proof-introstats-bayesformula2}{{66}{17}{Bayes' formula\relax }{equation.145}{}}
\citation{Ross1987}
\newlabel{proof-introstats-bayesformula3}{{69}{18}{Bayes' formula\relax }{equation.148}{}}
\citation{introprobasGrinsteadSnell}
\@writefile{toc}{\contentsline {subsection}{\numberline {1.8}Independent events}{19}{subsection.151}}
\newlabel{introstats-indepevents}{{1.13}{19}{\relax }{theorem.152}{}}
\newlabel{introstats-propoindepevents}{{1.14}{19}{\relax }{theorem.155}{}}
\newlabel{introstats-eq-pab}{{75}{19}{\relax }{equation.156}{}}
\citation{Loeve1963}
\citation{introprobasGrinsteadSnell}
\citation{introprobasGrinsteadSnell}
\citation{Ross1987}
\citation{montecarlomethodsHammersleyHandscomb}
\citation{introprobasGrinsteadSnell}
\newlabel{introstats-die6faces6}{{1.10}{20}{\relax }{example.159}{}}
\@writefile{toc}{\contentsline {subsection}{\numberline {1.9}Notes and references}{20}{subsection.164}}
\citation{introprobasGrinsteadSnell}
\citation{Ross1987}
\@writefile{toc}{\contentsline {subsection}{\numberline {1.10}Exercises}{21}{subsection.165}}
\newlabel{exercise-introstats-headtail1}{{1.1}{21}{Head and tail\relax }{exercise.166}{}}
\newlabel{exercise-introstats-twodice1}{{1.2}{21}{Two dice\relax }{exercise.169}{}}
\newlabel{exercise-introstats-mere1}{{1.3}{21}{M\'er\'e's experiments\relax }{exercise.173}{}}
\newlabel{exercise-introstats-indepevent1}{{1.4}{21}{Independent events\relax }{exercise.174}{}}
\newlabel{exercise-introstats-exo-booleineq}{{1.5}{21}{Boole's inequality\relax }{exercise.175}{}}
\newlabel{exercise-introstats-discretecondproba}{{1.6}{21}{Discrete conditional probability\relax }{exercise.177}{}}
\@writefile{toc}{\contentsline {section}{\numberline {2}Combinatorics}{21}{section.178}}
\newlabel{introstats-chap-combinatorics}{{2}{21}{Combinatorics\relax }{section.178}{}}
\@writefile{lof}{\contentsline {figure}{\numberline {8}{\ignorespaces Tree diagram - The task is made with 3 steps. There are 2 choices for the step \#1, 3 choices for step \#2 and 2 choices for step \#3. The total number of ways to perform the full sequence of steps is $n=2\cdot 3\cdot 2 = 12$.}}{22}{figure.180}}
\newlabel{fig-introstats-tree-diagram}{{8}{22}{Tree diagram - The task is made with 3 steps. There are 2 choices for the step \#1, 3 choices for step \#2 and 2 choices for step \#3. The total number of ways to perform the full sequence of steps is $n=2\cdot 3\cdot 2 = 12$}{figure.180}{}}
\@writefile{toc}{\contentsline {subsection}{\numberline {2.1}Tree diagrams}{22}{subsection.179}}
\@writefile{toc}{\contentsline {subsection}{\numberline {2.2}Permutations}{22}{subsection.181}}
\@writefile{lof}{\contentsline {figure}{\numberline {9}{\ignorespaces Tree diagram for the computation of permutations of the set $A=\{1,2,3\}$.}}{23}{figure.185}}
\newlabel{fig-introstats-treediag-permutation}{{9}{23}{Tree diagram for the computation of permutations of the set $A=\{1,2,3\}$}{figure.185}{}}
\newlabel{propo-factorial}{{2.2}{23}{\relax }{theorem.186}{}}
\newlabel{propo-factorial1}{{85}{23}{\relax }{equation.187}{}}
\citation{wiki:Pochhammer}
\newlabel{propo-permutation}{{2.3}{24}{\relax }{theorem.191}{}}
\newlabel{propo-permutation1}{{88}{24}{\relax }{equation.192}{}}
\citation{SebahGourdon2002}
\@writefile{toc}{\contentsline {subsection}{\numberline {2.3}The gamma function}{25}{subsection.197}}
\newlabel{section-gammafun}{{2.3}{25}{The gamma function\relax }{subsection.197}{}}
\newlabel{section-defgammafun}{{2.4}{25}{\relax }{theorem.198}{}}
\newlabel{section-defgammafun1}{{92}{25}{\relax }{equation.199}{}}
\newlabel{prop-gammafun}{{2.5}{25}{\relax }{theorem.200}{}}
\newlabel{prop-gammafun1}{{93}{25}{\relax }{equation.201}{}}
\newlabel{prop-gammafun2}{{94}{26}{The gamma function\relax }{equation.202}{}}
\newlabel{prop-gammafact}{{2.6}{26}{\relax }{theorem.205}{}}
\newlabel{prop-gammafact1}{{97}{26}{\relax }{equation.206}{}}
\newlabel{prop-gammafact2}{{98}{26}{\relax }{equation.207}{}}
\newlabel{prop-gammafact3}{{99}{26}{The gamma function\relax }{equation.208}{}}
\newlabel{prop-gammafact4}{{100}{26}{The gamma function\relax }{equation.209}{}}
\citation{AndrewsAskeyRoy1999}
\newlabel{section-gammafun1}{{103}{27}{The gamma function\relax }{equation.212}{}}
\newlabel{prop-gammaneg}{{2.7}{27}{\relax }{theorem.215}{}}
\newlabel{prop-gammaneg1}{{106}{27}{\relax }{equation.216}{}}
\@writefile{lof}{\contentsline {figure}{\numberline {10}{\ignorespaces Scilab commands for permutations.}}{28}{figure.224}}
\newlabel{fig-introstats-funpermutations}{{10}{28}{Scilab commands for permutations}{figure.224}{}}
\newlabel{prop-gammanegint}{{2.8}{28}{\relax }{theorem.219}{}}
\@writefile{toc}{\contentsline {subsection}{\numberline {2.4}Overview of functions in Scilab}{28}{subsection.223}}
\@writefile{lof}{\contentsline {figure}{\numberline {11}{\ignorespaces The gamma function.}}{29}{figure.235}}
\newlabel{fig-introstats-gamma}{{11}{29}{The gamma function}{figure.235}{}}
\@writefile{toc}{\contentsline {subsection}{\numberline {2.5}The gamma function in Scilab}{29}{subsection.225}}
\@writefile{lof}{\contentsline {figure}{\numberline {12}{\ignorespaces The factorial function.}}{30}{figure.254}}
\newlabel{fig-introstats-fact}{{12}{30}{The factorial function}{figure.254}{}}
\@writefile{toc}{\contentsline {subsection}{\numberline {2.6}The factorial and log-factorial functions}{30}{subsection.250}}
\@writefile{lof}{\contentsline {figure}{\numberline {13}{\ignorespaces Logarithm of the factorial number.}}{31}{figure.263}}
\newlabel{fig-introstats-logfact}{{13}{31}{Logarithm of the factorial number}{figure.263}{}}
\newlabel{exercise-hypergeometric5}{{112}{31}{The factorial and log-factorial functions\relax }{equation.262}{}}
\@writefile{toc}{\contentsline {subsection}{\numberline {2.7}Computing factorial and log-factorial with Scilab}{31}{subsection.264}}
\citation{AndrewsAskeyRoy1999,WhittakerWatson}
\@writefile{toc}{\contentsline {subsection}{\numberline {2.8}Stirling's formula}{33}{subsection.313}}
\newlabel{sec-stirling}{{2.8}{33}{Stirling's formula\relax }{subsection.313}{}}
\citation{AndrewsAskeyRoy1999,WhittakerWatson}
\newlabel{def-asymptotic}{{2.9}{34}{\relax }{theorem.314}{}}
\newlabel{prop-stirlinggamm}{{2.10}{34}{\relax }{theorem.316}{}}
\newlabel{prop-stirlinggamm1}{{116}{34}{\relax }{equation.317}{}}
\newlabel{prop-stirlingfact}{{2.11}{34}{\relax }{theorem.318}{}}
\newlabel{prop-stirlingfact1}{{117}{34}{\relax }{equation.319}{}}
\newlabel{prop-logfactlarge}{{2.12}{35}{\relax }{theorem.338}{}}
\newlabel{prop-logfactlarge1}{{121}{35}{\relax }{equation.339}{}}
\newlabel{prop-logfactlarge2}{{125}{35}{Stirling's formula\relax }{equation.342}{}}
\@writefile{toc}{\contentsline {subsection}{\numberline {2.9}Permutations and log-permutations with Scilab}{36}{subsection.364}}
\newlabel{sec-computeperm}{{2.9}{36}{Permutations and log-permutations with Scilab\relax }{subsection.364}{}}
\newlabel{sec-computeperm1}{{139}{36}{Permutations and log-permutations with Scilab\relax }{equation.365}{}}
\@writefile{toc}{\contentsline {subsection}{\numberline {2.10}The birthday problem}{39}{subsection.443}}
\newlabel{introstats-eq-birthdayomega}{{144}{39}{The birthday problem\relax }{equation.445}{}}
\newlabel{introstats-eq-birthdayec}{{145}{39}{The birthday problem\relax }{equation.446}{}}
\newlabel{introstats-eq-birthdaype}{{148}{40}{The birthday problem\relax }{equation.449}{}}
\@writefile{toc}{\contentsline {subsection}{\numberline {2.11}A modified birthday problem}{41}{subsection.486}}
\citation{WWWWolframAlpha}
\@writefile{toc}{\contentsline {subsection}{\numberline {2.12}Combinations}{43}{subsection.561}}
\newlabel{section-combinaison}{{2.12}{43}{Combinations\relax }{subsection.561}{}}
\newlabel{introstats-eq-binomial}{{152}{44}{\relax }{equation.563}{}}
\newlabel{section-combinaison1}{{154}{44}{Combinations\relax }{equation.565}{}}
\newlabel{introstats-recurrencebinomial}{{2.14}{44}{\relax }{theorem.567}{}}
\@writefile{toc}{\contentsline {subsection}{\numberline {2.13}Computing combinations and log-combinations with Scilab}{44}{subsection.569}}
\newlabel{introstats-computingcombinations}{{2.13}{44}{Computing combinations and log-combinations with Scilab\relax }{subsection.569}{}}
\@writefile{lof}{\contentsline {figure}{\numberline {14}{\ignorespaces Cards of a 52 cards deck - "J" stands for Jack, "Q" stands for Queen and "K" stands for King}}{47}{figure.630}}
\newlabel{fig-introstats-52cards}{{14}{47}{Cards of a 52 cards deck - "J" stands for Jack, "Q" stands for Queen and "K" stands for King\relax }{figure.630}{}}
\newlabel{exercise-hypergeometric4}{{159}{47}{Computing combinations and log-combinations with Scilab\relax }{equation.622}{}}
\newlabel{exercise-hypergeometric6}{{160}{47}{Computing combinations and log-combinations with Scilab\relax }{equation.623}{}}
\newlabel{exercise-hypergeometric7}{{161}{47}{Computing combinations and log-combinations with Scilab\relax }{equation.624}{}}
\@writefile{toc}{\contentsline {subsection}{\numberline {2.14}The poker game}{47}{subsection.629}}
\@writefile{lof}{\contentsline {figure}{\numberline {15}{\ignorespaces Winning combinations at the Poker}}{48}{figure.631}}
\newlabel{fig-introstats-winpoker}{{15}{48}{Winning combinations at the Poker\relax }{figure.631}{}}
\@writefile{lof}{\contentsline {figure}{\numberline {16}{\ignorespaces A Bernoulli process with 3 trials. -- The letter "S" indicates "success" and the letter "F" indicates "failure".}}{49}{figure.639}}
\newlabel{fig-introstats-bernouillitree}{{16}{49}{A Bernoulli process with 3 trials. -- The letter "S" indicates "success" and the letter "F" indicates "failure"}{figure.639}{}}
\@writefile{toc}{\contentsline {subsection}{\numberline {2.15}Bernoulli trials}{49}{subsection.635}}
\@writefile{lof}{\contentsline {figure}{\numberline {17}{\ignorespaces Probabilities of a Bernoulli process with 3 trials}}{50}{figure.641}}
\newlabel{fig-introstats-probabernouilli}{{17}{50}{Probabilities of a Bernoulli process with 3 trials\relax }{figure.641}{}}
\newlabel{introstats-prop-binomialdist}{{2.16}{50}{\relax }{theorem.644}{}}
\newlabel{introstats-prop-binomialdist1}{{174}{50}{\relax }{equation.645}{}}
\newlabel{introstats-eq-bnpj}{{176}{51}{Bernoulli trials\relax }{equation.647}{}}
\@writefile{toc}{\contentsline {subsection}{\numberline {2.16}Computing the binomial distribution}{51}{subsection.650}}
\newlabel{introstats-section-binopdf}{{2.16}{51}{Computing the binomial distribution\relax }{subsection.650}{}}
\citation{WWWWolframAlpha}
\@writefile{toc}{\contentsline {subsection}{\numberline {2.17}The hypergeometric distribution}{54}{subsection.739}}
\newlabel{introstats-section-hypergeometric}{{2.17}{54}{The hypergeometric distribution\relax }{subsection.739}{}}
\newlabel{exercise-hypergeometric1}{{180}{55}{The hypergeometric distribution\relax }{equation.740}{}}
\@writefile{toc}{\contentsline {subsection}{\numberline {2.18}The hypergeometric distribution with Scilab}{55}{subsection.741}}
\citation{Yalta2008}
\newlabel{exercise-hypergeometric2}{{182}{56}{The hypergeometric distribution with Scilab\relax }{equation.761}{}}
\newlabel{exercise-hypergeometric3}{{183}{56}{The hypergeometric distribution with Scilab\relax }{equation.762}{}}
\citation{introprobasGrinsteadSnell}
\citation{introprobasGrinsteadSnell}
\citation{wiki:pokerprobas}
\citation{introprobasGrinsteadSnell}
\citation{introprobasGrinsteadSnell}
\citation{AbramowitzStegun1972}
\citation{SebahGourdon2002}
\citation{introprobasGrinsteadSnell}
\citation{seriesNoiresJanvresseRue}
\@writefile{toc}{\contentsline {subsection}{\numberline {2.19}Notes and references}{57}{subsection.776}}
\@writefile{toc}{\contentsline {subsection}{\numberline {2.20}Exercises}{57}{subsection.777}}
\newlabel{exercise-introstats-recurrencebinomial}{{2.1}{57}{Recurrence relation of binomial\relax }{exercise.778}{}}
\newlabel{exercise-introstats-subsetnumber}{{2.2}{57}{Number of subsets\relax }{exercise.780}{}}
\newlabel{exercise-introstats-pokerhand}{{2.3}{57}{Probabilities of Poker hands\relax }{exercise.781}{}}
\newlabel{exercise-introstats-bernouilliedie}{{2.4}{57}{Bernoulli trial for a die experiment\relax }{exercise.782}{}}
\newlabel{exercise-introstats-flightcrash}{{2.5}{57}{Probability of a flight crash\relax }{exercise.783}{}}
\citation{introprobasGrinsteadSnell}
\citation{introprobasGrinsteadSnell}
\citation{introprobasGrinsteadSnell}
\citation{devenezsorciez2002}
\newlabel{exercise-introstats-maxbinomial}{{2.6}{58}{Binomial function maximum\relax }{exercise.784}{}}
\newlabel{exercise-introstats-pascal}{{2.7}{58}{Binomial coefficients and Pascal's triangle\relax }{exercise.787}{}}
\newlabel{introstats-eq-pascaltriangle}{{188}{58}{Binomial coefficients and Pascal's triangle\relax }{equation.789}{}}
\newlabel{introstats-eq-pascalmatrix}{{189}{58}{Binomial coefficients and Pascal's triangle\relax }{equation.790}{}}
\newlabel{exercise-introstats-binomialidentity}{{2.8}{58}{Binomial identity\relax }{exercise.791}{}}
\newlabel{introstats-exercise-earthquakes}{{2.9}{58}{Earthquakes and predictions\relax }{exercise.793}{}}
\citation{artcomputerKnuthVol2}
\newlabel{introstats-exercise-factlogsum}{{2.10}{59}{Log-factorial function\relax }{exercise.794}{}}
\newlabel{exercise-hypergeometric8}{{191}{59}{Log-factorial function\relax }{equation.795}{}}
\newlabel{exercise-hypergeometric9}{{193}{59}{Log-factorial function\relax }{equation.796}{}}
\@writefile{toc}{\contentsline {section}{\numberline {3}Simulation of discrete random variables with Scilab}{59}{section.797}}
\newlabel{introstats-simulation}{{3}{59}{Simulation of discrete random variables with Scilab\relax }{section.797}{}}
\@writefile{toc}{\contentsline {subsection}{\numberline {3.1}Overview}{59}{subsection.798}}
\citation{891980}
\@writefile{toc}{\contentsline {subsection}{\numberline {3.2}Generating uniform random numbers}{60}{subsection.803}}
\@writefile{toc}{\contentsline {subsection}{\numberline {3.3}Simulating random discrete events}{61}{subsection.834}}
\@writefile{lof}{\contentsline {figure}{\numberline {18}{\ignorespaces Distribution of random integers from $0$ to $4$.}}{62}{figure.861}}
\newlabel{fig-introstats-distributionrandints}{{18}{62}{Distribution of random integers from $0$ to $4$}{figure.861}{}}
\@writefile{toc}{\contentsline {subsection}{\numberline {3.4}Simulation of a coin}{63}{subsection.871}}
\newlabel{introstats-simulatecoin}{{3.4}{63}{Simulation of a coin\relax }{subsection.871}{}}
\newlabel{eq-exactproba}{{201}{64}{Simulation of a coin\relax }{equation.896}{}}
\@writefile{toc}{\contentsline {subsection}{\numberline {3.5}Simulation of a Galton board}{64}{subsection.911}}
\newlabel{introstats-prop-binomialdef}{{3.1}{64}{\relax }{theorem.912}{}}
\@writefile{lof}{\contentsline {figure}{\numberline {19}{\ignorespaces A Galton board.}}{65}{figure.913}}
\newlabel{fig-introstats-galtonboard}{{19}{65}{A Galton board}{figure.913}{}}
\@writefile{lof}{\contentsline {figure}{\numberline {20}{\ignorespaces Simulation of a Galton board with $n=10$ stages and 100 simulations. -- The line is the binomial distribution function. }}{66}{figure.952}}
\newlabel{fig-introstats-simulationgaltonboard100}{{20}{66}{Simulation of a Galton board with $n=10$ stages and 100 simulations. -- The line is the binomial distribution function}{figure.952}{}}
\@writefile{lof}{\contentsline {figure}{\numberline {21}{\ignorespaces Simulation of a Galton board with $n=10$ stages and 1000 simulations.}}{67}{figure.953}}
\newlabel{fig-introstats-simulationgaltonboard1000}{{21}{67}{Simulation of a Galton board with $n=10$ stages and 1000 simulations}{figure.953}{}}
\@writefile{lof}{\contentsline {figure}{\numberline {22}{\ignorespaces Simulation of a Galton board with $n=10$ stages and 10 000 simulations.}}{67}{figure.954}}
\newlabel{fig-introstats-simulationgaltonboard10000}{{22}{67}{Simulation of a Galton board with $n=10$ stages and 10 000 simulations}{figure.954}{}}
\@writefile{lof}{\contentsline {figure}{\numberline {23}{\ignorespaces Scilab commands for the binomial distribution function}}{67}{figure.955}}
\newlabel{fig-introstats-funbinomial}{{23}{67}{Scilab commands for the binomial distribution function\relax }{figure.955}{}}
\@writefile{lof}{\contentsline {figure}{\numberline {24}{\ignorespaces Scilab commands to generate random permutations}}{68}{figure.960}}
\newlabel{fig-introstats-fungrandperm}{{24}{68}{Scilab commands to generate random permutations\relax }{figure.960}{}}
\@writefile{toc}{\contentsline {subsection}{\numberline {3.6}Generate random permutations}{68}{subsection.959}}
\citation{artcomputerKnuthVol2}
\citation{MosesOakford1963}
\citation{Durstenfeld1964}
\citation{artcomputerKnuthVol2}
\@writefile{toc}{\contentsline {subsection}{\numberline {3.7}References and notes}{70}{subsection.1024}}
\@writefile{toc}{\contentsline {section}{\numberline {4}Acknowledgments}{70}{section.1025}}
\@writefile{toc}{\contentsline {section}{\numberline {5}Answers to exercises}{71}{section.1026}}
\@writefile{toc}{\contentsline {subsection}{\numberline {5.1}Answers for section \ref  {idp-section-discrandvar}}{71}{subsection.1027}}
\newlabel{exercise-introstats-iev2}{{212}{72}{Answers for section \ref {idp-section-discrandvar}\relax }{equation.1057}{}}
\newlabel{eq-introstats-exo-booleineq}{{213}{72}{Answers for section \ref {idp-section-discrandvar}\relax }{equation.1058}{}}
\newlabel{eq-introstats-exo-aunionb}{{214}{73}{Answers for section \ref {idp-section-discrandvar}\relax }{equation.1059}{}}
\newlabel{introstats-exo-boole2}{{216}{73}{Answers for section \ref {idp-section-discrandvar}\relax }{equation.1061}{}}
\newlabel{introstats-exo-boole3}{{217}{73}{Answers for section \ref {idp-section-discrandvar}\relax }{equation.1062}{}}
\@writefile{lof}{\contentsline {figure}{\numberline {25}{\ignorespaces Probabilities of having the disease, given that the test is positive -- $P(E|D)= 0.99$ , $P(D) = 0.005$. The bold data is the data presented in the text of the exercise, which corresponds to $P(E|D^c)=0.01$. The lower the probability of a "false positive", the more the result is accurate. }}{74}{figure.1067}}
\newlabel{fig-introstats-tabledisease1}{{25}{74}{Probabilities of having the disease, given that the test is positive -- $P(E|D)= 0.99$ , $P(D) = 0.005$. The bold data is the data presented in the text of the exercise, which corresponds to $P(E|D^c)=0.01$. The lower the probability of a "false positive", the more the result is accurate}{figure.1067}{}}
\@writefile{lof}{\contentsline {figure}{\numberline {26}{\ignorespaces Probabilities of having the disease, given that the test is positive -- $P(E|D)= 0.99$ , $P(E|D^c) = 0.01$. The bold data is the data presented in the text of the exercise, which corresponds to $P(D)=0.005$. The more disease is rare, the more the result is accurate. }}{74}{figure.1068}}
\newlabel{fig-introstats-tabledisease2}{{26}{74}{Probabilities of having the disease, given that the test is positive -- $P(E|D)= 0.99$ , $P(E|D^c) = 0.01$. The bold data is the data presented in the text of the exercise, which corresponds to $P(D)=0.005$. The more disease is rare, the more the result is accurate}{figure.1068}{}}
\@writefile{toc}{\contentsline {subsection}{\numberline {5.2}Answers for section \ref  {introstats-chap-combinatorics}}{75}{subsection.1070}}
\newlabel{introstats-exo-recurrencebinomial}{{227}{75}{Answers for section \ref {introstats-chap-combinatorics}\relax }{equation.1071}{}}
\@writefile{lof}{\contentsline {figure}{\numberline {27}{\ignorespaces Probabilities of Poker hands}}{78}{figure.1085}}
\newlabel{fig-introstats-winpokerprobas}{{27}{78}{Probabilities of Poker hands\relax }{figure.1085}{}}
\@writefile{lof}{\contentsline {figure}{\numberline {28}{\ignorespaces Crash probabilities for 22 days with one crash every 500 000 flights and 20000 flights each day}}{80}{figure.1118}}
\newlabel{fig-introstats-flightcrash22days}{{28}{80}{Crash probabilities for 22 days with one crash every 500 000 flights and 20000 flights each day\relax }{figure.1118}{}}
\@writefile{lof}{\contentsline {figure}{\numberline {29}{\ignorespaces Crash probabilities for 42 days with one crash every 500 000 flights and 20 000 flights each day}}{80}{figure.1120}}
\newlabel{fig-introstats-flightcrash42days}{{29}{80}{Crash probabilities for 42 days with one crash every 500 000 flights and 20 000 flights each day\relax }{figure.1120}{}}
\citation{seriesNoiresJanvresseRue,scansStatistics2000}
\@writefile{lof}{\contentsline {figure}{\numberline {30}{\ignorespaces Probability of having exactly 5 crash in 22 days with one crash every 500 000 flights and 20 000 flights each day - Different approaches}}{82}{figure.1131}}
\newlabel{fig-introstats-22daysapproaches}{{30}{82}{Probability of having exactly 5 crash in 22 days with one crash every 500 000 flights and 20 000 flights each day - Different approaches\relax }{figure.1131}{}}
\newlabel{introstats-eq-flightcrash1}{{267}{82}{Answers for section \ref {introstats-chap-combinatorics}\relax }{equation.1132}{}}
\newlabel{introstats-eq-flightcrash2}{{268}{82}{Answers for section \ref {introstats-chap-combinatorics}\relax }{equation.1133}{}}
\newlabel{introstats-eq-flightcrash3}{{269}{82}{Answers for section \ref {introstats-chap-combinatorics}\relax }{equation.1134}{}}
\newlabel{introstats-eq-flightcrash4}{{270}{82}{Answers for section \ref {introstats-chap-combinatorics}\relax }{equation.1135}{}}
\newlabel{introstats-maxbinomial0}{{276}{83}{Answers for section \ref {introstats-chap-combinatorics}\relax }{equation.1139}{}}
\newlabel{introstats-maxbinomial1}{{278}{83}{Answers for section \ref {introstats-chap-combinatorics}\relax }{equation.1141}{}}
\newlabel{introstats-maxbinomial2}{{279}{83}{Answers for section \ref {introstats-chap-combinatorics}\relax }{equation.1142}{}}
\newlabel{introstats-eq-pascaltriangle2}{{292}{85}{Answers for section \ref {introstats-chap-combinatorics}\relax }{equation.1183}{}}
\newlabel{introstats-eq-pascalmatrix2}{{302}{86}{Answers for section \ref {introstats-chap-combinatorics}\relax }{equation.1188}{}}
\newlabel{introstats-eq-binomialidentity2}{{303}{87}{Answers for section \ref {introstats-chap-combinatorics}\relax }{equation.1245}{}}
\newlabel{introstats-eq-binomialidentity3}{{309}{87}{Answers for section \ref {introstats-chap-combinatorics}\relax }{equation.1249}{}}
\citation{BurkardtProb}
\bibstyle{plain}
\bibdata{introdiscreteprobas}
\bibcite{AbramowitzStegun1972}{{1}{}{{}}{{}}}
\@writefile{lof}{\contentsline {figure}{\numberline {31}{\ignorespaces Probability of having $x$ earthquake days while choosing $n=169$ days from $m=1096$ days, where $k=196$ days are earthquake days.}}{89}{figure.1278}}
\newlabel{fig-introstats-earthquakes}{{31}{89}{Probability of having $x$ earthquake days while choosing $n=169$ days from $m=1096$ days, where $k=196$ days are earthquake days}{figure.1278}{}}
\@writefile{toc}{\contentsline {section}{Bibliography}{89}{lstnumber.1282}}
\bibcite{AndrewsAskeyRoy1999}{{2}{}{{}}{{}}}
\bibcite{BurkardtProb}{{3}{}{{}}{{}}}
\bibcite{devenezsorciez2002}{{4}{}{{}}{{}}}
\bibcite{Durstenfeld1964}{{5}{}{{}}{{}}}
\bibcite{scansStatistics2000}{{6}{}{{}}{{}}}
\bibcite{introprobasGrinsteadSnell}{{7}{}{{}}{{}}}
\bibcite{montecarlomethodsHammersleyHandscomb}{{8}{}{{}}{{}}}
\bibcite{seriesNoiresJanvresseRue}{{9}{}{{}}{{}}}
\bibcite{artcomputerKnuthVol2}{{10}{}{{}}{{}}}
\bibcite{Loeve1963}{{11}{}{{}}{{}}}
\bibcite{891980}{{12}{}{{}}{{}}}
\bibcite{MosesOakford1963}{{13}{}{{}}{{}}}
\bibcite{LifeTableWHO2009}{{14}{}{{}}{{}}}
\bibcite{Panchenko1805L22005}{{15}{}{{}}{{}}}
\bibcite{WWWWolframAlpha}{{16}{}{{}}{{}}}
\bibcite{Ross1987}{{17}{}{{}}{{}}}
\bibcite{SebahGourdon2002}{{18}{}{{}}{{}}}
\bibcite{WhittakerWatson}{{19}{}{{}}{{}}}
\bibcite{wiki:pokerprobas}{{20}{}{{}}{{}}}
\bibcite{wiki:Pochhammer}{{21}{}{{}}{{}}}
\bibcite{Yalta2008}{{22}{}{{}}{{}}}
\@writefile{toc}{\contentsline {section}{Index}{91}{section*.1283}}
\providecommand\NAT@force@numbers{}\NAT@force@numbers
