f0;tmax;npp;N;; fmin;lpwl;;twl;fwl;nf;;fmin;lpwl;;twl;fwl;nf;;e
1;10;25;251;;0.0002;-0.0305;;-0.0968;0.0014;-0.3107;;0.0005;115;;57;77;128;;0.3742
1;10;55;551;;0.0000;-0.0039;;-0.0360;0.0015;-0.1778;;0.0005;115;;57;79;128;;0.4186
1;15;25;376;;0.0000;-0.0236;;-0.0361;0.0025;-0.4717;;0.0005;115;;57;73;128;;0.4034
1;15;55;826;;-0.0000;0.0015;;-0.0248;0.0016;-0.1757;;0.0200;95;;37;79;128;;0.4195
5;10;25;1251;;0.0000;0.0000;;-0.0011;0.0026;-0.5514;;0.0200;115;;57;79;128;;0.4209
5;10;55;2751;;0.0000;-0.0009;;-0.0265;0.0016;-0.1749;;0.0100;115;;57;79;128;;0.4212
5;15;25;1876;;0.0000;-0.0007;;-0.0014;0.0027;-0.5570;;0.0005;115;;57;79;128;;0.4227
5;15;55;4126;;0.0000;-0.0002;;-0.0222;0.0016;-0.1781;;0.0100;95;;57;79;128;;0.4215
11;10;25;2751;;0.0000;0.0001;;-0.0004;0.0027;-0.5570;;0.0200;115;;57;79;128;;0.4207
11;10;55;6051;;0.0000;-0.0012;;-0.0283;0.0016;-0.1781;;0.0005;115;;57;79;128;;0.4214
11;15;25;4126;;-0.0000;0.0006;;0.0004;0.0027;-0.5582;;0.0200;115;;27;79;128;;0.4209
11;15;55;9076;;0.0000;-0.0004;;-0.0263;0.0016;-0.1792;;0.0020;95;;57;79;128;;0.4219
20;10;25;5001;;0.0000;-0.0011;;-0.0016;0.0027;-0.5607;;0.0005;115;;57;79;128;;0.4216
20;10;55;11001;;0.0000;-0.0022;;-0.0292;0.0016;-0.1829;;0.0005;115;;57;79;128;;0.4224
20;15;25;7501;;0.0000;-0.0004;;-0.0009;0.0029;-0.5573;;0.0005;95;;37;79;128;;0.4207
20;15;55;16501;;0.0000;-0.0019;;-0.0270;0.0017;-0.1756;;0.0050;115;;57;79;128;;0.4216
