//
//  Copyright (C) 2010 - 2012 - DIGITEO - Allan CORNET
//
//  This file must be used under the terms of the CeCILL.
//  This source file is licensed as described in the file COPYING, which
//  you should have received as part of this distribution.  The terms
//  are also available at
//  http://www.cecill.info/licences/Licence_CeCILL_V2-en.txt
//
// =============================================================================
r = csv_read(csv_getToolboxPath() + "tests/nonreg_tests/bug_1.csv", ",", [], "string");
// =============================================================================
assert_checkequal(size(r, "c"), 2);
assert_checkequal(size(r, "r"), 7534);
assert_checkequal(r(1,1), "Time");
assert_checkequal(r(1,2), "ecart");
assert_checkequal(r(7534,1), "0.05");
assert_checkequal(r(7534,2), "-0.000237359");
// =============================================================================
