<?xml version="1.0" encoding="UTF-8" standalone="no"?>
<svg
   xmlns:dc="http://purl.org/dc/elements/1.1/"
   xmlns:cc="http://creativecommons.org/ns#"
   xmlns:rdf="http://www.w3.org/1999/02/22-rdf-syntax-ns#"
   xmlns:svg="http://www.w3.org/2000/svg"
   xmlns="http://www.w3.org/2000/svg"
   xmlns:sodipodi="http://sodipodi.sourceforge.net/DTD/sodipodi-0.dtd"
   xmlns:inkscape="http://www.inkscape.org/namespaces/inkscape"
   width="114px"
   height="40px"
   viewBox="0 0 114 40"
   style="stroke:none"
   id="svg2"
   version="1.1"
   inkscape:version="0.48.2 r9819"
   sodipodi:docname="PARAM_VAR.svg">
  <metadata
     id="metadata28">
    <rdf:RDF>
      <cc:Work
         rdf:about="">
        <dc:format>image/svg+xml</dc:format>
        <dc:type
           rdf:resource="http://purl.org/dc/dcmitype/StillImage" />
      </cc:Work>
    </rdf:RDF>
  </metadata>
  <sodipodi:namedview
     pagecolor="#ffffff"
     bordercolor="#666666"
     borderopacity="1"
     objecttolerance="10"
     gridtolerance="10"
     guidetolerance="10"
     inkscape:pageopacity="0"
     inkscape:pageshadow="2"
     inkscape:window-width="1920"
     inkscape:window-height="1178"
     id="namedview26"
     showgrid="false"
     inkscape:zoom="3.0789474"
     inkscape:cx="57"
     inkscape:cy="20"
     inkscape:window-x="-8"
     inkscape:window-y="-8"
     inkscape:window-maximized="1"
     inkscape:current-layer="svg2" />
  <title
     id="title4">Figure n°0</title>
  <desc
     id="desc6">
Creator: GL2PS 1.3.2, (C) 1999-2006 Christophe Geuzaine (geuz@geuz.org)
For: Scilab
CreationDate: Sat Nov 05 23:20:26 2011
</desc>
  <defs
     id="defs8" />
  <polygon
     fill="#ffffff"
     points="0,0 114,0 114,40 0,40"
     id="polygon10" />
  <g
     id="g12">
    <polygon
       fill="#ffffff"
       points="37.4,39.6 37.4,0.400002 37.4,39.6"
       id="polygon14" />
    <polygon
       fill="#ffffff"
       points="37.4,0.400002 37.4,0.400002 37.4,39.6"
       id="polygon16" />
    <polygon
       fill="#ffffff"
       points="37.4,39.6 76.6,39.6 37.4,39.6"
       id="polygon18" />
    <polygon
       fill="#ffffff"
       points="76.6,39.6 76.6,39.6 37.4,39.6"
       id="polygon20" />
    <polygon
       fill="#ffffff"
       points="37.4,39.6 76.6,39.6 37.4,0.400002"
       id="polygon22" />
    <polygon
       fill="#ffffff"
       points="76.6,39.6 76.6,0.400002 37.4,0.400002"
       id="polygon24" />
  </g>
  <rect
     style="fill:none;fill-opacity:1;stroke:#000000;stroke-width:1.20428359999999990;stroke-opacity:1"
     id="rect3005"
     width="110.87263"
     height="37.470932"
     x="2.7004321"
     y="2.426928" />
</svg>
