// ============================================================================
// Scilab ( http://www.scilab.org/ ) - This file is part of Scilab
// Copyright (C) 2013 - Scilab Enterprises - Bruno JOFRET
//
//  This file is distributed under the same license as the Scilab package.
// ============================================================================
//
// <-- ENGLISH IMPOSED -->
//
// <-- Short Description -->
// REP_FREQ
loadXcosLibs();
// Check where REP_FREQ block is defined
assert_checkequal(whereis("REP_FREQ"), "cpgelib");
funcprot(0);
needcompile = 0;
alreadyran = %f;
%scicos_context = struct();
[status, message] = xcosValidateBlockSet("REP_FREQ");
if status == %f
    disp(message);
end
assert_checktrue(status);
disp(REP_FREQ("define"));
  graphics: (graphics mlist) with fields:
      orig = [0,0]
      sz = [2,2]
      exprs = "Bode"
      pin = []
      pout = []
      pein = []
      peout = []
      gr_i = []
      id = ""
      in_implicit = []
      out_implicit = []
      in_style = ""
      out_style = ""
      in_label = ""
      out_label = ""
      style: [1x1 string]
  model: (model mlist) with fields:
      sim: (2-elements list)
          (1) = "REP_FREQ_sim"
          (2) = 99
      in = []
      in2 = []
      intyp = 1
      out = []
      out2 = []
      outtyp = 1
      evtin = []
      evtout = []
      state = []
      dstate = []
      odstate: (empty list)
      rpar = [0.01;100;1000;0;0;0]
      ipar = 1
      opar: (2-elements list)
          (1) = "E"
          (2) = "S"
      blocktype = "c"
      firing = []
      dep_ut = [%f,%f]
      label = ""
      nzcross = 0
      nmode = 0
      equations: (empty list)
      uid = ""
  gui = "REP_FREQ"
  doc: (empty list)
