<?xml version="1.0" encoding="UTF-8" standalone="no"?>
<!-- Created with Inkscape (http://www.inkscape.org/) -->

<svg
   xmlns:dc="http://purl.org/dc/elements/1.1/"
   xmlns:cc="http://creativecommons.org/ns#"
   xmlns:rdf="http://www.w3.org/1999/02/22-rdf-syntax-ns#"
   xmlns:svg="http://www.w3.org/2000/svg"
   xmlns="http://www.w3.org/2000/svg"
   xmlns:xlink="http://www.w3.org/1999/xlink"
   xmlns:sodipodi="http://sodipodi.sourceforge.net/DTD/sodipodi-0.dtd"
   xmlns:inkscape="http://www.inkscape.org/namespaces/inkscape"
   id="svg11300"
   height="44.822"
   width="41.062"
   version="1.1"
   inkscape:version="0.48.2 r9819"
   sodipodi:docname="SCOPE.svg">
  <metadata
     id="metadata23">
    <rdf:RDF>
      <cc:Work
         rdf:about="">
        <dc:format>image/svg+xml</dc:format>
        <dc:type
           rdf:resource="http://purl.org/dc/dcmitype/StillImage" />
        <dc:title>base scilan</dc:title>
      </cc:Work>
    </rdf:RDF>
  </metadata>
  <sodipodi:namedview
     pagecolor="#ffffff"
     bordercolor="#666666"
     borderopacity="1"
     objecttolerance="10"
     gridtolerance="10"
     guidetolerance="10"
     inkscape:pageopacity="0"
     inkscape:pageshadow="2"
     inkscape:window-width="1280"
     inkscape:window-height="962"
     id="namedview21"
     showgrid="false"
     inkscape:zoom="5.2652717"
     inkscape:cx="46.822321"
     inkscape:cy="-0.75003434"
     inkscape:window-x="-8"
     inkscape:window-y="-8"
     inkscape:window-maximized="1"
     inkscape:current-layer="svg11300" />
  <title
     id="title3289">base scilan</title>
  <defs
     id="defs3">
    <radialGradient
       id="radialGradient20899"
       gradientUnits="userSpaceOnUse"
       cy="32.267"
       cx="23.994"
       gradientTransform="matrix(2.2986117,0,0,1.8027614,-75.446386,-24.554065)"
       r="19.089">
      <stop
         id="stop2224"
         stop-color="#5187d6"
         offset="0" />
      <stop
         id="stop2227"
         stop-color="#1e4580"
         offset="1" />
    </radialGradient>
    <linearGradient
       id="linearGradient2854"
       y2="24.238"
       gradientUnits="userSpaceOnUse"
       x2="12.499"
       gradientTransform="matrix(0,-5.2061514,2.5688251,0,-79.265723,164.6207)"
       y1="12.538"
       x1="8.8208">
      <stop
         id="stop2182"
         stop-color="#FFF"
         offset="0" />
      <stop
         id="stop2184"
         stop-color="#FFF"
         stop-opacity="0"
         offset="1" />
    </linearGradient>
    <linearGradient
       id="linearGradient11324-7">
      <stop
         style="stop-color:#a7adab;stop-opacity:1;"
         offset="0"
         id="stop11326-2" />
      <stop
         id="stop11362-9"
         offset="0.00003052"
         style="stop-color:#a6acaa;stop-opacity:1;" />
      <stop
         id="stop11360-7"
         offset="0.00006103"
         style="stop-color:#a6acaa;stop-opacity:1;" />
      <stop
         id="stop11358-5"
         offset="0.00012207"
         style="stop-color:#a6acaa;stop-opacity:1;" />
      <stop
         id="stop11356-6"
         offset="0.00024414"
         style="stop-color:#a6acaa;stop-opacity:1;" />
      <stop
         id="stop11354-5"
         offset="0.00048828"
         style="stop-color:#a6acaa;stop-opacity:1;" />
      <stop
         id="stop11352-3"
         offset="0.00097656"
         style="stop-color:#a6acaa;stop-opacity:1;" />
      <stop
         id="stop11350-0"
         offset="0.00195312"
         style="stop-color:#a6acaa;stop-opacity:1;" />
      <stop
         id="stop11348-4"
         offset="0.00390625"
         style="stop-color:#a6acaa;stop-opacity:1;" />
      <stop
         id="stop11346-8"
         offset="0.0078125"
         style="stop-color:#a6acaa;stop-opacity:1;" />
      <stop
         id="stop11344-5"
         offset="0.015625"
         style="stop-color:#a5aba9;stop-opacity:1;" />
      <stop
         id="stop11342-5"
         offset="0.03125"
         style="stop-color:#a3a9a7;stop-opacity:1;" />
      <stop
         id="stop11340-5"
         offset="0.0625"
         style="stop-color:#a0a6a4;stop-opacity:1;" />
      <stop
         id="stop11338-4"
         offset="0.63176101"
         style="stop-color:#999f9e;stop-opacity:1;" />
      <stop
         id="stop11336-2"
         offset="0.64674318"
         style="stop-color:#8c9191;stop-opacity:1;" />
      <stop
         id="stop11334-1"
         offset="0.66131109"
         style="stop-color:#727577;stop-opacity:1;" />
      <stop
         style="stop-color:#3d3e43;stop-opacity:1;"
         offset="1"
         id="stop11328-9" />
    </linearGradient>
    <filter
       color-interpolation-filters="sRGB"
       inkscape:collect="always"
       id="filter11462-7-1">
      <feGaussianBlur
         inkscape:collect="always"
         stdDeviation="6.6932271"
         id="feGaussianBlur11464-5-7" />
    </filter>
    <radialGradient
       inkscape:collect="always"
       xlink:href="#linearGradient11324-7-0"
       id="radialGradient5331-4"
       gradientUnits="userSpaceOnUse"
       gradientTransform="matrix(1.4857328,-0.00883656,0.0087941,1.4785944,3879.0038,-285.22306)"
       cx="-7994"
       cy="448.36218"
       fx="-7994"
       fy="448.36218"
       r="140" />
    <linearGradient
       id="linearGradient11324-7-0">
      <stop
         style="stop-color:#a7adab;stop-opacity:1;"
         offset="0"
         id="stop11326-2-9" />
      <stop
         id="stop11362-9-4"
         offset="0.00003052"
         style="stop-color:#a6acaa;stop-opacity:1;" />
      <stop
         id="stop11360-7-8"
         offset="0.00006103"
         style="stop-color:#a6acaa;stop-opacity:1;" />
      <stop
         id="stop11358-5-8"
         offset="0.00012207"
         style="stop-color:#a6acaa;stop-opacity:1;" />
      <stop
         id="stop11356-6-2"
         offset="0.00024414"
         style="stop-color:#a6acaa;stop-opacity:1;" />
      <stop
         id="stop11354-5-4"
         offset="0.00048828"
         style="stop-color:#a6acaa;stop-opacity:1;" />
      <stop
         id="stop11352-3-5"
         offset="0.00097656"
         style="stop-color:#a6acaa;stop-opacity:1;" />
      <stop
         id="stop11350-0-5"
         offset="0.00195312"
         style="stop-color:#a6acaa;stop-opacity:1;" />
      <stop
         id="stop11348-4-1"
         offset="0.00390625"
         style="stop-color:#a6acaa;stop-opacity:1;" />
      <stop
         id="stop11346-8-7"
         offset="0.0078125"
         style="stop-color:#a6acaa;stop-opacity:1;" />
      <stop
         id="stop11344-5-1"
         offset="0.015625"
         style="stop-color:#a5aba9;stop-opacity:1;" />
      <stop
         id="stop11342-5-1"
         offset="0.03125"
         style="stop-color:#a3a9a7;stop-opacity:1;" />
      <stop
         id="stop11340-5-5"
         offset="0.0625"
         style="stop-color:#a0a6a4;stop-opacity:1;" />
      <stop
         id="stop11338-4-2"
         offset="0.63176101"
         style="stop-color:#999f9e;stop-opacity:1;" />
      <stop
         id="stop11336-2-7"
         offset="0.64674318"
         style="stop-color:#8c9191;stop-opacity:1;" />
      <stop
         id="stop11334-1-6"
         offset="0.66131109"
         style="stop-color:#727577;stop-opacity:1;" />
      <stop
         style="stop-color:#3d3e43;stop-opacity:1;"
         offset="1"
         id="stop11328-9-1" />
    </linearGradient>
    <filter
       color-interpolation-filters="sRGB"
       inkscape:collect="always"
       id="filter11468-2-4">
      <feGaussianBlur
         inkscape:collect="always"
         stdDeviation="3.9043825"
         id="feGaussianBlur11470-4-2" />
    </filter>
    <radialGradient
       inkscape:collect="always"
       xlink:href="#linearGradient5198"
       id="radialGradient5333"
       gradientUnits="userSpaceOnUse"
       gradientTransform="matrix(2.468411,1.3914804e-7,-1.1057391e-7,1.9615215,11738.479,-431.10879)"
       cx="-7994"
       cy="448.36218"
       fx="-7994"
       fy="448.36218"
       r="140" />
    <linearGradient
       id="linearGradient5198">
      <stop
         style="stop-color:#a00000;stop-opacity:1;"
         offset="0"
         id="stop5200" />
      <stop
         id="stop5214"
         offset="0.0625"
         style="stop-color:#9e0000;stop-opacity:1;" />
      <stop
         id="stop5212"
         offset="0.125"
         style="stop-color:#9c0000;stop-opacity:1;" />
      <stop
         id="stop5210"
         offset="0.25"
         style="stop-color:#990000;stop-opacity:1;" />
      <stop
         id="stop5208"
         offset="0.5"
         style="stop-color:#920000;stop-opacity:1;" />
      <stop
         style="stop-color:#840000;stop-opacity:1;"
         offset="1"
         id="stop5202" />
    </linearGradient>
    <filter
       color-interpolation-filters="sRGB"
       inkscape:collect="always"
       id="filter5232-3">
      <feGaussianBlur
         inkscape:collect="always"
         stdDeviation="9.3680297"
         id="feGaussianBlur5234-2" />
    </filter>
    <filter
       color-interpolation-filters="sRGB"
       inkscape:collect="always"
       id="filter5242-2">
      <feGaussianBlur
         inkscape:collect="always"
         stdDeviation="2.0817844"
         id="feGaussianBlur5244-1" />
    </filter>
    <filter
       color-interpolation-filters="sRGB"
       inkscape:collect="always"
       id="filter5280-6">
      <feGaussianBlur
         inkscape:collect="always"
         stdDeviation="4.350419"
         id="feGaussianBlur5282-8" />
    </filter>
    <filter
       color-interpolation-filters="sRGB"
       inkscape:collect="always"
       id="filter5298-5">
      <feGaussianBlur
         inkscape:collect="always"
         stdDeviation="2.1252832"
         id="feGaussianBlur5300-7" />
    </filter>
  </defs>
  <g
     id="g5320"
     transform="matrix(0.17849128,0,0,0.17935407,1977.9458,-158.7873)"
     inkscape:export-filename="/Users/nico/Dropbox/Challengein/graphics/Game/Go_Fast/botton_pushed.png"
     inkscape:export-xdpi="90"
     inkscape:export-ydpi="90">
    <path
       sodipodi:type="arc"
       style="fill:#333333;fill-opacity:1;stroke:none;filter:url(#filter11462-7-1)"
       id="path4397"
       sodipodi:cx="-7994"
       sodipodi:cy="448.36218"
       sodipodi:rx="140"
       sodipodi:ry="140"
       d="m -7854,448.36218 c 0,77.31987 -62.6801,140 -140,140 -77.3199,0 -140,-62.68013 -140,-140 0,-77.31986 62.6801,-140 140,-140 77.3199,0 140,62.68014 140,140 z"
       transform="matrix(0.70524865,0,0,0.70524865,-5330.9759,696.19552)" />
    <path
       transform="matrix(0.70524865,0,0,0.70524865,-5335.2074,689.14303)"
       d="m -7854,448.36218 c 0,77.31987 -62.6801,140 -140,140 -77.3199,0 -140,-62.68013 -140,-140 0,-77.31986 62.6801,-140 140,-140 77.3199,0 140,62.68014 140,140 z"
       sodipodi:ry="140"
       sodipodi:rx="140"
       sodipodi:cy="448.36218"
       sodipodi:cx="-7994"
       id="path4399"
       style="fill:url(#radialGradient5331-4);fill-opacity:1;stroke:none"
       sodipodi:type="arc" />
    <path
       sodipodi:type="arc"
       style="fill:#caf2eb;fill-opacity:1;stroke:none"
       id="path4401"
       sodipodi:cx="-7994"
       sodipodi:cy="448.36218"
       sodipodi:rx="140"
       sodipodi:ry="140"
       d="m -7854,448.36218 c 0,77.31987 -62.6801,140 -140,140 -77.3199,0 -140,-62.68013 -140,-140 0,-77.31986 62.6801,-140 140,-140 77.3199,0 140,62.68014 140,140 z"
       transform="matrix(0.62968629,0,0,0.62968629,-5939.2529,723.02233)" />
    <path
       sodipodi:type="arc"
       style="fill:#1a1a1a;fill-opacity:1;stroke:none;filter:url(#filter11468-2-4)"
       id="path4403"
       sodipodi:cx="-7994"
       sodipodi:cy="448.36218"
       sodipodi:rx="140"
       sodipodi:ry="140"
       d="m -7854,448.36218 c 0,77.31987 -62.6801,140 -140,140 -77.3199,0 -140,-62.68013 -140,-140 0,-77.31986 62.6801,-140 140,-140 77.3199,0 140,62.68014 140,140 z"
       transform="matrix(0.60118995,0,0,0.60118995,-6164.2317,741.441)" />
    <path
       transform="matrix(0.60118995,0,0,0.60118995,-6167.0527,735.79901)"
       d="m -7854,448.36218 c 0,77.31987 -62.6801,140 -140,140 -77.3199,0 -140,-62.68013 -140,-140 0,-77.31986 62.6801,-140 140,-140 77.3199,0 140,62.68014 140,140 z"
       sodipodi:ry="140"
       sodipodi:rx="140"
       sodipodi:cy="448.36218"
       sodipodi:cx="-7994"
       id="path4405"
       style="fill:#c91b12;fill-opacity:1;stroke:none"
       sodipodi:type="arc" />
    <path
       sodipodi:type="arc"
       style="fill:url(#radialGradient5333);fill-opacity:1;stroke:none;filter:url(#filter5232-3)"
       id="path4428"
       sodipodi:cx="-7994"
       sodipodi:cy="448.36218"
       sodipodi:rx="140"
       sodipodi:ry="140"
       d="m -7854,448.36218 c 0,77.31987 -62.6801,140 -140,140 -77.3199,0 -140,-62.68013 -140,-140 0,-77.31986 62.6801,-140 140,-140 77.3199,0 140,62.68014 140,140 z"
       transform="matrix(0.49286872,0,0,0.49286872,-7032.9725,784.36615)" />
    <path
       transform="matrix(0.46483746,0,0,0.46483746,-7257.0544,796.93431)"
       d="m -7854,448.36218 c 0,77.31987 -62.6801,140 -140,140 -77.3199,0 -140,-62.68013 -140,-140 0,-77.31986 62.6801,-140 140,-140 77.3199,0 140,62.68014 140,140 z"
       sodipodi:ry="140"
       sodipodi:rx="140"
       sodipodi:cy="448.36218"
       sodipodi:cx="-7994"
       id="path5236"
       style="fill:none;stroke:#a00000;stroke-width:5.33055162;stroke-miterlimit:4;stroke-opacity:1;stroke-dasharray:none;filter:url(#filter5242-2)"
       sodipodi:type="arc" />
    <path
       sodipodi:nodetypes="ccssc"
       inkscape:connector-curvature="0"
       id="path5246"
       d="m -10900.224,961.48652 c 24.286,90.61848 -50.933,161.31278 -144.641,92.10968 13.889,27.3782 41.908,41.56 74.709,41.56 46.484,0 84.187,-37.6723 84.187,-84.1562 0,-19.30139 -3.329,-35.31465 -14.255,-49.51348 z"
       style="opacity:0.77735847;fill:#1a1a1a;fill-opacity:1;stroke:none;filter:url(#filter5280-6)" />
    <path
       sodipodi:nodetypes="cscc"
       inkscape:connector-curvature="0"
       id="path5284"
       d="m -10975.344,928.28125 c -10.255,0.14507 -28.284,-0.43373 -49.742,17.35111 -29.082,24.10431 -25.757,63.50004 -25.757,63.50004 5.745,-50.09119 35.168,-76.49083 75.499,-80.85115 z"
       style="fill:#ffeeaa;fill-opacity:1;stroke:none;filter:url(#filter5298-5)" />
  </g>
</svg>
