// ============================================================================
// Scilab ( http://www.scilab.org/ ) - This file is part of Scilab
// Copyright (C) 2013 - Scilab Enterprises - Bruno JOFRET
//
//  This file is distributed under the same license as the Scilab package.
// ============================================================================
//
// <-- ENGLISH IMPOSED -->
//
// <-- Short Description -->
// Test Exemple livret
[a, cpgeMacrosPath] = libraryinfo("cpgelib");
assert_checktrue(importXcosDiagram(cpgeMacrosPath + "/../examples/Livret_CPGE_Exemple5.zcos"));
xcos_simulate(scs_m, 4);
  "Scilab a réussi à extraire une fonction de transfert du schéma bloc : (2.510D+12+8.657D+10*%s+6.147D+08*%s^2)/(2.772D+08*%s^2+3660533.3*%s^3+4383.3333*%s^4+%s^5)"
         column 1
  "Extreme root removed : -5.813D+08"
         column 2
  "Extreme root removed : 5.813D+08"
  "Extreme root removed : 2.826D-16"
  "Scilab a réussi à extraire une fonction de transfert du schéma bloc : (245000+2450*%s)/(32200+933.33333*%s+%s^2)"
// Une fenetre doit s'ouvrir
assert_checktrue(~isempty(winsid()));
// TODO : Check des donnees dans la fenetre
