// ============================================================================
// Scilab ( http://www.scilab.org/ ) - This file is part of Scilab
// Copyright (C) 2013 - Scilab Enterprises - Charlotte HECQUET
//
//  This file is distributed under the same license as the Scilab package.
// ============================================================================
//
// <-- ENGLISH IMPOSED -->
//
// <-- Short Description -->
// Test MMT_Damper
[a, coselicaMacrosPath] = libraryinfo(whereis(getCoselicaVersion));
try
    ilib_verbose(0);
    assert_checktrue(importXcosDiagram(fullfile(coselicaMacrosPath, "/../../tests/unit_tests/Mechanics/Translational/MMT_Damper.zcos")));
    xcos_simulate(scs_m, 4);
    velocity = res.values(:,1);
    force = res.values(:,2);
    d=2;
    assert_checktrue(force - d*velocity < 1d-7);
catch
   disp(lasterror())
   assert_checktrue(%f);
end
--------------------------------------------\
 Main Modelica : TMPDIR\MMT_Damper_im.mo
 Flat Modelica : TMPDIR\MMT_Damper_imf.mo
 Simulation C code :TMPDIR\MMT_Damper_im.c
  "Modelica blocks are reduced to a block with:"                       
  "Number of differential states: 1"                                   
  "Number of algebraic states: 0"                                      
  "Number of discrete time states  : 0"                                
  "Number of zero-crossing surfaces: 2"                                
  "Number of modes  : 2"                                               
  "Number of inputs : 0"                                               
  "Number of outputs: 2"                                               
  "Input/output dependency:[T]"                                        
  "Analytical Jacobian: enabled  (%Jacobian=%t)"                       
  "Parameter embedding mode: enabled (%Modelica_ParEmb=%t)"            
  ""                                                                   
  "Generated files path: TMPDIR\"
  ""                                                                   
WARNING: Diagram contains implicit blocks, compiling for implicit Solver.
WARNING: Diagram has been compiled for implicit solver
WARNING: switching to implicit Solver
