// ============================================================================
// Scilab ( http://www.scilab.org/ ) - This file is part of Scilab
// Copyright (C) 2013 - Scilab Enterprises - Charlotte HECQUET
//
//  This file is distributed under the same license as the Scilab package.
// ============================================================================
//
// <-- ENGLISH IMPOSED -->
//
// <-- Short Description -->
// Test CMTC_Lever
[a, coselicaMacrosPath] = libraryinfo(whereis(getCoselicaVersion));
try
    ilib_verbose(0);
    assert_checktrue(importXcosDiagram(fullfile(coselicaMacrosPath, "/../../tests/unit_tests/Mechanics/Translational/CMTC_Lever.zcos")));
    xcos_simulate(scs_m, 4);
    force_a = res.values(:,1);
    force_b1 = res.values(:,2);
    force_b2 = res.values(:,3);
    L1=2;
    L2=1;
    assert_checkequal(force_a*L1-force_b2*(L1+L2), zeros(force_a));
    assert_checkequal(force_a*L2-force_b1*(L1+L2), zeros(force_a));
catch
    disp(lasterror())
    assert_checktrue(%f);
end
--------------------------------------------\
 Main Modelica : TMPDIR\CMTC_Lever_im.mo
 Flat Modelica : TMPDIR\CMTC_Lever_imf.mo
 Simulation C code :TMPDIR\CMTC_Lever_im.c
  "Modelica blocks are reduced to a block with:"                       
  "Number of differential states: 2"                                   
  "Number of algebraic states: 2"                                      
  "Number of discrete time states  : 0"                                
  "Number of zero-crossing surfaces: 0"                                
  "Number of modes  : 0"                                               
  "Number of inputs : 0"                                               
  "Number of outputs: 3"                                               
  "Input/output dependency:[T]"                                        
  "Analytical Jacobian: enabled  (%Jacobian=%t)"                       
  "Parameter embedding mode: enabled (%Modelica_ParEmb=%t)"            
  ""                                                                   
  "Generated files path: TMPDIR\"
  ""                                                                   
WARNING: Diagram contains implicit blocks, compiling for implicit Solver.
WARNING: Diagram has been compiled for implicit solver
WARNING: switching to implicit Solver
