// Copyright (C) 2010 - DIGITEO - Michael Baudin
//
// This file must be used under the terms of the CeCILL.
// This source file is licensed as described in the file COPYING, which
// you should have received as part of this distribution.  The terms
// are also available at
// http://www.cecill.info/licences/Licence_CeCILL_V2-en.txt
// <-- CLI SHELL MODE -->
// <-- ENGLISH IMPOSED -->
[c,y] =  condnb_expcond ( 1 );
assert_checkalmostequal ( y , 2.718281828459045091 , 10*%eps );
assert_checkalmostequal ( c , 1 , 10*%eps );
//
[c,y] = condnb_expcond ( 1.e2 );
assert_checkalmostequal ( y , 2.688117141816135114D+43 , 10*%eps );
assert_checkalmostequal ( c , 1.e2 , 10*%eps );
