// Copyright (C) 2010 - 2011 - Michael Baudin
//
// This file must be used under the terms of the CeCILL.
// This source file is licensed as described in the file COPYING, which
// you should have received as part of this distribution.  The terms
// are also available at
// http://www.cecill.info/licences/Licence_CeCILL_V2-en.txt
// <-- JVM NOT MANDATORY -->
// Some attempts to improve Smith's algorithm
ieee(2);
function [msg,digits] = fmtdig ( x , y , expected , divfunc , headermsg , footermsg )
    // Performs the complex division x/y, compare to expected, and produve a message 
    // containing the number of digits in the real and imaginary parts.
    r = divfunc ( a + %i * b , c + %i * d );
    digits = compdiv_computedigits(r,expectedR,basis);
    msg = msprintf("%s=%2d%s\n", headermsg , digits , footermsg )
endfunction
////////////////////////////////////////////////////////////////////////
// 
// Check accuracy
format("e",10);
path=compdiv_getpath (  );
basis = 2;
msg=[];
dg=[];
dataset = fullfile(path,"tests","unit_tests","cdiv.dataset.csv");
table = compdiv_datasetread ( dataset , "#" , "," , %t );
Dataset : /home/mb/Forge/compdiv/compdiv/tests/unit_tests/cdiv.dataset.csv
Number of lines : 333
ntests = size(table,"r");
atable = evstr(table(:,1));
btable = evstr(table(:,2));
ctable = evstr(table(:,3));
dtable = evstr(table(:,4));
etable = evstr(table(:,5));
ftable = evstr(table(:,6));
for k = 1 : ntests
    a = atable(k);
    b = btable(k);
    c = ctable(k);
    d = dtable(k);
    e = etable(k);
    f = ftable(k);
    //
    expectedR = complex(e,f);
    x = complex(a,b);
    y = complex(c,d);
    msg(1) = msprintf("Test #%3d/%d, %70s, ",  k,ntests,sci2exp([a b c d e f]) );
    dg(k,1)=0;
    j=2;
    [msg(j),dg(k,j)] = fmtdig ( x , y , expectedR , compdiv_scilab , "Sc" , ", " );
    j=j+1;
    [msg(j),dg(k,j)] = fmtdig ( x , y , expectedR , compdiv_naive , "Na" , ", " );
    j=j+1;
    [msg(j),dg(k,j)] = fmtdig ( x , y , expectedR , compdiv_smith , "Sm" , ", " );
    j=j+1;
    [msg(j),dg(k,j)] = fmtdig ( x , y , expectedR , compdiv_stewart , "St" , ", " );
    j=j+1;
    [msg(j),dg(k,j)] = fmtdig ( x , y , expectedR , compdiv_improved , "IM" , ", " );
    j=j+1;
    [msg(j),dg(k,j)] = fmtdig ( x , y , expectedR , compdiv_ansiisoc , "AC", ", "  );
    j=j+1;
    [msg(j),dg(k,j)] = fmtdig ( x , y , expectedR , compdiv_smithLi , "Li" , ", " );
    j=j+1;
    [msg(j),dg(k,j)] = fmtdig ( x , y , expectedR , compdiv_priest , "PR" , ", " );
    j=j+1;
    [msg(j),dg(k,j)] = fmtdig ( x , y , expectedR , compdiv_smithR , "SR" , ", " );
    j=j+1;
    [msg(j),dg(k,j)] = fmtdig ( x , y , expectedR , compdiv_robust , "RO" , ", " );
    j=j+1;
    mprintf("%s\n",strcat(msg,""));
end
Test #  1/282,      [-1.000D+00,-1.000D+00,-1.000D+00,-1.000D+00,1.000D+00,0.000D+00], Sc=53, Na=53, Sm=53, St=53, IM=53, AC=53, Li=53, PR=53, SR=53, RO=53, 
Test #  2/282,       [-1.000D+00,-1.000D+00,-1.000D+00,0.000D+00,1.000D+00,1.000D+00], Sc=53, Na=53, Sm=53, St=53, IM=53, AC=53, Li=53, PR=53, SR=53, RO=53, 
Test #  3/282,       [-1.000D+00,-1.000D+00,-1.000D+00,1.000D+00,0.000D+00,1.000D+00], Sc=53, Na=53, Sm=53, St=53, IM=53, AC=53, Li=53, PR=53, SR=53, RO=53, 
Test #  4/282,      [-1.000D+00,-1.000D+00,0.000D+00,-1.000D+00,1.000D+00,-1.000D+00], Sc=53, Na=53, Sm=53, St=53, IM=53, AC=53, Li=53, PR=53, SR=53, RO=53, 
Test #  5/282,       [-1.000D+00,-1.000D+00,0.000D+00,1.000D+00,-1.000D+00,1.000D+00], Sc=53, Na=53, Sm=53, St=53, IM=53, AC=53, Li=53, PR=53, SR=53, RO=53, 
Test #  6/282,      [-1.000D+00,-1.000D+00,1.000D+00,-1.000D+00,0.000D+00,-1.000D+00], Sc=53, Na=53, Sm=53, St=53, IM=53, AC=53, Li=53, PR=53, SR=53, RO=53, 
Test #  7/282,      [-1.000D+00,-1.000D+00,1.000D+00,0.000D+00,-1.000D+00,-1.000D+00], Sc=53, Na=53, Sm=53, St=53, IM=53, AC=53, Li=53, PR=53, SR=53, RO=53, 
Test #  8/282,       [-1.000D+00,-1.000D+00,1.000D+00,1.000D+00,-1.000D+00,0.000D+00], Sc=53, Na=53, Sm=53, St=53, IM=53, AC=53, Li=53, PR=53, SR=53, RO=53, 
Test #  9/282,      [-1.000D+00,0.000D+00,-1.000D+00,-1.000D+00,5.000D-01,-5.000D-01], Sc=53, Na=53, Sm=53, St=53, IM=53, AC=53, Li=53, PR=53, SR=53, RO=53, 
Test # 10/282,        [-1.000D+00,0.000D+00,-1.000D+00,0.000D+00,1.000D+00,0.000D+00], Sc=53, Na=53, Sm=53, St=53, IM=53, AC=53, Li=53, PR=53, SR=53, RO=53, 
Test # 11/282,        [-1.000D+00,0.000D+00,-1.000D+00,1.000D+00,5.000D-01,5.000D-01], Sc=53, Na=53, Sm=53, St=53, IM=53, AC=53, Li=53, PR=53, SR=53, RO=53, 
Test # 12/282,       [-1.000D+00,0.000D+00,0.000D+00,-1.000D+00,0.000D+00,-1.000D+00], Sc=53, Na=53, Sm=53, St=53, IM=53, AC=53, Li=53, PR=53, SR=53, RO=53, 
Test # 13/282,         [-1.000D+00,0.000D+00,0.000D+00,1.000D+00,0.000D+00,1.000D+00], Sc=53, Na=53, Sm=53, St=53, IM=53, AC=53, Li=53, PR=53, SR=53, RO=53, 
Test # 14/282,      [-1.000D+00,0.000D+00,1.000D+00,-1.000D+00,-5.000D-01,-5.000D-01], Sc=53, Na=53, Sm=53, St=53, IM=53, AC=53, Li=53, PR=53, SR=53, RO=53, 
Test # 15/282,        [-1.000D+00,0.000D+00,1.000D+00,0.000D+00,-1.000D+00,0.000D+00], Sc=53, Na=53, Sm=53, St=53, IM=53, AC=53, Li=53, PR=53, SR=53, RO=53, 
Test # 16/282,        [-1.000D+00,0.000D+00,1.000D+00,1.000D+00,-5.000D-01,5.000D-01], Sc=53, Na=53, Sm=53, St=53, IM=53, AC=53, Li=53, PR=53, SR=53, RO=53, 
Test # 17/282,      [-1.000D+00,1.000D+00,-1.000D+00,-1.000D+00,0.000D+00,-1.000D+00], Sc=53, Na=53, Sm=53, St=53, IM=53, AC=53, Li=53, PR=53, SR=53, RO=53, 
Test # 18/282,       [-1.000D+00,1.000D+00,-1.000D+00,0.000D+00,1.000D+00,-1.000D+00], Sc=53, Na=53, Sm=53, St=53, IM=53, AC=53, Li=53, PR=53, SR=53, RO=53, 
Test # 19/282,        [-1.000D+00,1.000D+00,-1.000D+00,1.000D+00,1.000D+00,0.000D+00], Sc=53, Na=53, Sm=53, St=53, IM=53, AC=53, Li=53, PR=53, SR=53, RO=53, 
Test # 20/282,      [-1.000D+00,1.000D+00,0.000D+00,-1.000D+00,-1.000D+00,-1.000D+00], Sc=53, Na=53, Sm=53, St=53, IM=53, AC=53, Li=53, PR=53, SR=53, RO=53, 
Test # 21/282,         [-1.000D+00,1.000D+00,0.000D+00,1.000D+00,1.000D+00,1.000D+00], Sc=53, Na=53, Sm=53, St=53, IM=53, AC=53, Li=53, PR=53, SR=53, RO=53, 
Test # 22/282,       [-1.000D+00,1.000D+00,1.000D+00,-1.000D+00,-1.000D+00,0.000D+00], Sc=53, Na=53, Sm=53, St=53, IM=53, AC=53, Li=53, PR=53, SR=53, RO=53, 
Test # 23/282,        [-1.000D+00,1.000D+00,1.000D+00,0.000D+00,-1.000D+00,1.000D+00], Sc=53, Na=53, Sm=53, St=53, IM=53, AC=53, Li=53, PR=53, SR=53, RO=53, 
Test # 24/282,         [-1.000D+00,1.000D+00,1.000D+00,1.000D+00,0.000D+00,1.000D+00], Sc=53, Na=53, Sm=53, St=53, IM=53, AC=53, Li=53, PR=53, SR=53, RO=53, 
Test # 25/282,       [0.000D+00,-1.000D+00,-1.000D+00,-1.000D+00,5.000D-01,5.000D-01], Sc=53, Na=53, Sm=53, St=53, IM=53, AC=53, Li=53, PR=53, SR=53, RO=53, 
Test # 26/282,        [0.000D+00,-1.000D+00,-1.000D+00,0.000D+00,0.000D+00,1.000D+00], Sc=53, Na=53, Sm=53, St=53, IM=53, AC=53, Li=53, PR=53, SR=53, RO=53, 
Test # 27/282,       [0.000D+00,-1.000D+00,-1.000D+00,1.000D+00,-5.000D-01,5.000D-01], Sc=53, Na=53, Sm=53, St=53, IM=53, AC=53, Li=53, PR=53, SR=53, RO=53, 
Test # 28/282,        [0.000D+00,-1.000D+00,0.000D+00,-1.000D+00,1.000D+00,0.000D+00], Sc=53, Na=53, Sm=53, St=53, IM=53, AC=53, Li=53, PR=53, SR=53, RO=53, 
Test # 29/282,        [0.000D+00,-1.000D+00,0.000D+00,1.000D+00,-1.000D+00,0.000D+00], Sc=53, Na=53, Sm=53, St=53, IM=53, AC=53, Li=53, PR=53, SR=53, RO=53, 
Test # 30/282,       [0.000D+00,-1.000D+00,1.000D+00,-1.000D+00,5.000D-01,-5.000D-01], Sc=53, Na=53, Sm=53, St=53, IM=53, AC=53, Li=53, PR=53, SR=53, RO=53, 
Test # 31/282,        [0.000D+00,-1.000D+00,1.000D+00,0.000D+00,0.000D+00,-1.000D+00], Sc=53, Na=53, Sm=53, St=53, IM=53, AC=53, Li=53, PR=53, SR=53, RO=53, 
Test # 32/282,       [0.000D+00,-1.000D+00,1.000D+00,1.000D+00,-5.000D-01,-5.000D-01], Sc=53, Na=53, Sm=53, St=53, IM=53, AC=53, Li=53, PR=53, SR=53, RO=53, 
Test # 33/282,        [0.000D+00,0.000D+00,-1.000D+00,-1.000D+00,0.000D+00,0.000D+00], Sc=53, Na=53, Sm=53, St=53, IM=53, AC=53, Li=53, PR=53, SR=53, RO=53, 
Test # 34/282,         [0.000D+00,0.000D+00,-1.000D+00,0.000D+00,0.000D+00,0.000D+00], Sc=53, Na=53, Sm=53, St=53, IM=53, AC=53, Li=53, PR=53, SR=53, RO=53, 
Test # 35/282,         [0.000D+00,0.000D+00,-1.000D+00,1.000D+00,0.000D+00,0.000D+00], Sc=53, Na=53, Sm=53, St=53, IM=53, AC=53, Li=53, PR=53, SR=53, RO=53, 
Test # 36/282,         [0.000D+00,0.000D+00,0.000D+00,-1.000D+00,0.000D+00,0.000D+00], Sc=53, Na=53, Sm=53, St=53, IM=53, AC=53, Li=53, PR=53, SR=53, RO=53, 
Test # 37/282,          [0.000D+00,0.000D+00,0.000D+00,1.000D+00,0.000D+00,0.000D+00], Sc=53, Na=53, Sm=53, St=53, IM=53, AC=53, Li=53, PR=53, SR=53, RO=53, 
Test # 38/282,         [0.000D+00,0.000D+00,1.000D+00,-1.000D+00,0.000D+00,0.000D+00], Sc=53, Na=53, Sm=53, St=53, IM=53, AC=53, Li=53, PR=53, SR=53, RO=53, 
Test # 39/282,          [0.000D+00,0.000D+00,1.000D+00,0.000D+00,0.000D+00,0.000D+00], Sc=53, Na=53, Sm=53, St=53, IM=53, AC=53, Li=53, PR=53, SR=53, RO=53, 
Test # 40/282,          [0.000D+00,0.000D+00,1.000D+00,1.000D+00,0.000D+00,0.000D+00], Sc=53, Na=53, Sm=53, St=53, IM=53, AC=53, Li=53, PR=53, SR=53, RO=53, 
Test # 41/282,      [0.000D+00,1.000D+00,-1.000D+00,-1.000D+00,-5.000D-01,-5.000D-01], Sc=53, Na=53, Sm=53, St=53, IM=53, AC=53, Li=53, PR=53, SR=53, RO=53, 
Test # 42/282,        [0.000D+00,1.000D+00,-1.000D+00,0.000D+00,0.000D+00,-1.000D+00], Sc=53, Na=53, Sm=53, St=53, IM=53, AC=53, Li=53, PR=53, SR=53, RO=53, 
Test # 43/282,        [0.000D+00,1.000D+00,-1.000D+00,1.000D+00,5.000D-01,-5.000D-01], Sc=53, Na=53, Sm=53, St=53, IM=53, AC=53, Li=53, PR=53, SR=53, RO=53, 
Test # 44/282,        [0.000D+00,1.000D+00,0.000D+00,-1.000D+00,-1.000D+00,0.000D+00], Sc=53, Na=53, Sm=53, St=53, IM=53, AC=53, Li=53, PR=53, SR=53, RO=53, 
Test # 45/282,          [0.000D+00,1.000D+00,0.000D+00,1.000D+00,1.000D+00,0.000D+00], Sc=53, Na=53, Sm=53, St=53, IM=53, AC=53, Li=53, PR=53, SR=53, RO=53, 
Test # 46/282,        [0.000D+00,1.000D+00,1.000D+00,-1.000D+00,-5.000D-01,5.000D-01], Sc=53, Na=53, Sm=53, St=53, IM=53, AC=53, Li=53, PR=53, SR=53, RO=53, 
Test # 47/282,          [0.000D+00,1.000D+00,1.000D+00,0.000D+00,0.000D+00,1.000D+00], Sc=53, Na=53, Sm=53, St=53, IM=53, AC=53, Li=53, PR=53, SR=53, RO=53, 
Test # 48/282,          [0.000D+00,1.000D+00,1.000D+00,1.000D+00,5.000D-01,5.000D-01], Sc=53, Na=53, Sm=53, St=53, IM=53, AC=53, Li=53, PR=53, SR=53, RO=53, 
Test # 49/282,       [1.000D+00,-1.000D+00,-1.000D+00,-1.000D+00,0.000D+00,1.000D+00], Sc=53, Na=53, Sm=53, St=53, IM=53, AC=53, Li=53, PR=53, SR=53, RO=53, 
Test # 50/282,       [1.000D+00,-1.000D+00,-1.000D+00,0.000D+00,-1.000D+00,1.000D+00], Sc=53, Na=53, Sm=53, St=53, IM=53, AC=53, Li=53, PR=53, SR=53, RO=53, 
Test # 51/282,       [1.000D+00,-1.000D+00,-1.000D+00,1.000D+00,-1.000D+00,0.000D+00], Sc=53, Na=53, Sm=53, St=53, IM=53, AC=53, Li=53, PR=53, SR=53, RO=53, 
Test # 52/282,        [1.000D+00,-1.000D+00,0.000D+00,-1.000D+00,1.000D+00,1.000D+00], Sc=53, Na=53, Sm=53, St=53, IM=53, AC=53, Li=53, PR=53, SR=53, RO=53, 
Test # 53/282,       [1.000D+00,-1.000D+00,0.000D+00,1.000D+00,-1.000D+00,-1.000D+00], Sc=53, Na=53, Sm=53, St=53, IM=53, AC=53, Li=53, PR=53, SR=53, RO=53, 
Test # 54/282,        [1.000D+00,-1.000D+00,1.000D+00,-1.000D+00,1.000D+00,0.000D+00], Sc=53, Na=53, Sm=53, St=53, IM=53, AC=53, Li=53, PR=53, SR=53, RO=53, 
Test # 55/282,        [1.000D+00,-1.000D+00,1.000D+00,0.000D+00,1.000D+00,-1.000D+00], Sc=53, Na=53, Sm=53, St=53, IM=53, AC=53, Li=53, PR=53, SR=53, RO=53, 
Test # 56/282,        [1.000D+00,-1.000D+00,1.000D+00,1.000D+00,0.000D+00,-1.000D+00], Sc=53, Na=53, Sm=53, St=53, IM=53, AC=53, Li=53, PR=53, SR=53, RO=53, 
Test # 57/282,       [1.000D+00,0.000D+00,-1.000D+00,-1.000D+00,-5.000D-01,5.000D-01], Sc=53, Na=53, Sm=53, St=53, IM=53, AC=53, Li=53, PR=53, SR=53, RO=53, 
Test # 58/282,        [1.000D+00,0.000D+00,-1.000D+00,0.000D+00,-1.000D+00,0.000D+00], Sc=53, Na=53, Sm=53, St=53, IM=53, AC=53, Li=53, PR=53, SR=53, RO=53, 
Test # 59/282,       [1.000D+00,0.000D+00,-1.000D+00,1.000D+00,-5.000D-01,-5.000D-01], Sc=53, Na=53, Sm=53, St=53, IM=53, AC=53, Li=53, PR=53, SR=53, RO=53, 
Test # 60/282,         [1.000D+00,0.000D+00,0.000D+00,-1.000D+00,0.000D+00,1.000D+00], Sc=53, Na=53, Sm=53, St=53, IM=53, AC=53, Li=53, PR=53, SR=53, RO=53, 
Test # 61/282,         [1.000D+00,0.000D+00,0.000D+00,1.000D+00,0.000D+00,-1.000D+00], Sc=53, Na=53, Sm=53, St=53, IM=53, AC=53, Li=53, PR=53, SR=53, RO=53, 
Test # 62/282,         [1.000D+00,0.000D+00,1.000D+00,-1.000D+00,5.000D-01,5.000D-01], Sc=53, Na=53, Sm=53, St=53, IM=53, AC=53, Li=53, PR=53, SR=53, RO=53, 
Test # 63/282,          [1.000D+00,0.000D+00,1.000D+00,0.000D+00,1.000D+00,0.000D+00], Sc=53, Na=53, Sm=53, St=53, IM=53, AC=53, Li=53, PR=53, SR=53, RO=53, 
Test # 64/282,         [1.000D+00,0.000D+00,1.000D+00,1.000D+00,5.000D-01,-5.000D-01], Sc=53, Na=53, Sm=53, St=53, IM=53, AC=53, Li=53, PR=53, SR=53, RO=53, 
Test # 65/282,       [1.000D+00,1.000D+00,-1.000D+00,-1.000D+00,-1.000D+00,0.000D+00], Sc=53, Na=53, Sm=53, St=53, IM=53, AC=53, Li=53, PR=53, SR=53, RO=53, 
Test # 66/282,       [1.000D+00,1.000D+00,-1.000D+00,0.000D+00,-1.000D+00,-1.000D+00], Sc=53, Na=53, Sm=53, St=53, IM=53, AC=53, Li=53, PR=53, SR=53, RO=53, 
Test # 67/282,        [1.000D+00,1.000D+00,-1.000D+00,1.000D+00,0.000D+00,-1.000D+00], Sc=53, Na=53, Sm=53, St=53, IM=53, AC=53, Li=53, PR=53, SR=53, RO=53, 
Test # 68/282,        [1.000D+00,1.000D+00,0.000D+00,-1.000D+00,-1.000D+00,1.000D+00], Sc=53, Na=53, Sm=53, St=53, IM=53, AC=53, Li=53, PR=53, SR=53, RO=53, 
Test # 69/282,         [1.000D+00,1.000D+00,0.000D+00,1.000D+00,1.000D+00,-1.000D+00], Sc=53, Na=53, Sm=53, St=53, IM=53, AC=53, Li=53, PR=53, SR=53, RO=53, 
Test # 70/282,         [1.000D+00,1.000D+00,1.000D+00,-1.000D+00,0.000D+00,1.000D+00], Sc=53, Na=53, Sm=53, St=53, IM=53, AC=53, Li=53, PR=53, SR=53, RO=53, 
Test # 71/282,          [1.000D+00,1.000D+00,1.000D+00,0.000D+00,1.000D+00,1.000D+00], Sc=53, Na=53, Sm=53, St=53, IM=53, AC=53, Li=53, PR=53, SR=53, RO=53, 
Test # 72/282,          [1.000D+00,1.000D+00,1.000D+00,1.000D+00,1.000D+00,0.000D+00], Sc=53, Na=53, Sm=53, St=53, IM=53, AC=53, Li=53, PR=53, SR=53, RO=53, 
Test # 73/282,      [-2.000D+00,-2.000D+00,-2.000D+00,-2.000D+00,1.000D+00,0.000D+00], Sc=53, Na=53, Sm=53, St=53, IM=53, AC=53, Li=53, PR=53, SR=53, RO=53, 
Test # 74/282,       [-2.000D+00,-2.000D+00,-2.000D+00,2.000D+00,0.000D+00,1.000D+00], Sc=53, Na=53, Sm=53, St=53, IM=53, AC=53, Li=53, PR=53, SR=53, RO=53, 
Test # 75/282,      [-2.000D+00,-2.000D+00,2.000D+00,-2.000D+00,0.000D+00,-1.000D+00], Sc=53, Na=53, Sm=53, St=53, IM=53, AC=53, Li=53, PR=53, SR=53, RO=53, 
Test # 76/282,       [-2.000D+00,-2.000D+00,2.000D+00,2.000D+00,-1.000D+00,0.000D+00], Sc=53, Na=53, Sm=53, St=53, IM=53, AC=53, Li=53, PR=53, SR=53, RO=53, 
Test # 77/282,      [-2.000D+00,2.000D+00,-2.000D+00,-2.000D+00,0.000D+00,-1.000D+00], Sc=53, Na=53, Sm=53, St=53, IM=53, AC=53, Li=53, PR=53, SR=53, RO=53, 
Test # 78/282,        [-2.000D+00,2.000D+00,-2.000D+00,2.000D+00,1.000D+00,0.000D+00], Sc=53, Na=53, Sm=53, St=53, IM=53, AC=53, Li=53, PR=53, SR=53, RO=53, 
Test # 79/282,       [-2.000D+00,2.000D+00,2.000D+00,-2.000D+00,-1.000D+00,0.000D+00], Sc=53, Na=53, Sm=53, St=53, IM=53, AC=53, Li=53, PR=53, SR=53, RO=53, 
Test # 80/282,         [-2.000D+00,2.000D+00,2.000D+00,2.000D+00,0.000D+00,1.000D+00], Sc=53, Na=53, Sm=53, St=53, IM=53, AC=53, Li=53, PR=53, SR=53, RO=53, 
Test # 81/282,       [2.000D+00,-2.000D+00,-2.000D+00,-2.000D+00,0.000D+00,1.000D+00], Sc=53, Na=53, Sm=53, St=53, IM=53, AC=53, Li=53, PR=53, SR=53, RO=53, 
Test # 82/282,       [2.000D+00,-2.000D+00,-2.000D+00,2.000D+00,-1.000D+00,0.000D+00], Sc=53, Na=53, Sm=53, St=53, IM=53, AC=53, Li=53, PR=53, SR=53, RO=53, 
Test # 83/282,        [2.000D+00,-2.000D+00,2.000D+00,-2.000D+00,1.000D+00,0.000D+00], Sc=53, Na=53, Sm=53, St=53, IM=53, AC=53, Li=53, PR=53, SR=53, RO=53, 
Test # 84/282,        [2.000D+00,-2.000D+00,2.000D+00,2.000D+00,0.000D+00,-1.000D+00], Sc=53, Na=53, Sm=53, St=53, IM=53, AC=53, Li=53, PR=53, SR=53, RO=53, 
Test # 85/282,       [2.000D+00,2.000D+00,-2.000D+00,-2.000D+00,-1.000D+00,0.000D+00], Sc=53, Na=53, Sm=53, St=53, IM=53, AC=53, Li=53, PR=53, SR=53, RO=53, 
Test # 86/282,        [2.000D+00,2.000D+00,-2.000D+00,2.000D+00,0.000D+00,-1.000D+00], Sc=53, Na=53, Sm=53, St=53, IM=53, AC=53, Li=53, PR=53, SR=53, RO=53, 
Test # 87/282,         [2.000D+00,2.000D+00,2.000D+00,-2.000D+00,0.000D+00,1.000D+00], Sc=53, Na=53, Sm=53, St=53, IM=53, AC=53, Li=53, PR=53, SR=53, RO=53, 
Test # 88/282,          [2.000D+00,2.000D+00,2.000D+00,2.000D+00,1.000D+00,0.000D+00], Sc=53, Na=53, Sm=53, St=53, IM=53, AC=53, Li=53, PR=53, SR=53, RO=53, 
Test # 89/282,        [1.000D+00,0.000D+00,0.000D+00,0.000D+00,D+%infinity,0.000D+00], Sc= 0, Na= 0, Sm= 0, St= 0, IM= 0, AC= 0, Li= 0, PR= 0, SR= 0, RO= 0, 
Test # 90/282,        [1.000D+00,0.000D+00,0.000D+00,0.000D+00,D+%infinity,0.000D+00], Sc= 0, Na= 0, Sm= 0, St= 0, IM= 0, AC= 0, Li= 0, PR= 0, SR= 0, RO= 0, 
Test # 91/282,        [1.000D+00,0.000D+00,0.000D+00,0.000D+00,D+%infinity,0.000D+00], Sc= 0, Na= 0, Sm= 0, St= 0, IM= 0, AC= 0, Li= 0, PR= 0, SR= 0, RO= 0, 
Test # 92/282,        [1.000D+00,0.000D+00,0.000D+00,0.000D+00,-+%infinity,0.000D+00], Sc= 0, Na= 0, Sm= 0, St= 0, IM= 0, AC= 0, Li= 0, PR= 0, SR= 0, RO= 0, 
Test # 93/282,      [1.000D+00,1.000D+00,0.000D+00,0.000D+00,D+%infinity,D+%infinity], Sc= 0, Na= 0, Sm= 0, St= 0, IM= 0, AC=53, Li= 0, PR= 0, SR= 0, RO= 0, 
Test # 94/282,     [1.000D+00,-1.000D+00,0.000D+00,0.000D+00,D+%infinity,-+%infinity], Sc= 0, Na= 0, Sm= 0, St= 0, IM= 0, AC=53, Li= 0, PR= 0, SR= 0, RO= 0, 
Test # 95/282,     [-1.000D+00,1.000D+00,0.000D+00,0.000D+00,-+%infinity,D+%infinity], Sc= 0, Na= 0, Sm= 0, St= 0, IM= 0, AC=53, Li= 0, PR= 0, SR= 0, RO= 0, 
Test # 96/282,    [-1.000D+00,-1.000D+00,0.000D+00,0.000D+00,-+%infinity,-+%infinity], Sc= 0, Na= 0, Sm= 0, St= 0, IM= 0, AC=53, Li= 0, PR= 0, SR= 0, RO= 0, 
Test # 97/282,      [1.000D+00,1.000D+00,0.000D+00,0.000D+00,D+%infinity,D+%infinity], Sc= 0, Na= 0, Sm= 0, St= 0, IM= 0, AC=53, Li= 0, PR= 0, SR= 0, RO= 0, 
Test # 98/282,      [1.000D+00,1.000D+00,0.000D+00,0.000D+00,D+%infinity,D+%infinity], Sc= 0, Na= 0, Sm= 0, St= 0, IM= 0, AC=53, Li= 0, PR= 0, SR= 0, RO= 0, 
Test # 99/282,      [1.000D+00,1.000D+00,0.000D+00,0.000D+00,D+%infinity,D+%infinity], Sc= 0, Na= 0, Sm= 0, St= 0, IM= 0, AC=53, Li= 0, PR= 0, SR= 0, RO= 0, 
Test #100/282,      [1.000D+00,1.000D+00,0.000D+00,0.000D+00,-+%infinity,-+%infinity], Sc= 0, Na= 0, Sm= 0, St= 0, IM= 0, AC= 0, Li= 0, PR= 0, SR= 0, RO= 0, 
Test #101/282,          [1.00D-308,1.000D+00,1.000D+00,1.000D+00,5.000D-01,5.000D-01], Sc=53, Na=53, Sm=53, St=53, IM=53, AC=53, Li=53, PR=53, SR=53, RO=53, 
Test #102/282,          [1.00D-231,1.000D+00,1.000D+00,1.000D+00,5.000D-01,5.000D-01], Sc=53, Na=53, Sm=53, St=53, IM=53, AC=53, Li=53, PR=53, SR=53, RO=53, 
Test #103/282,          [1.00D-155,1.000D+00,1.000D+00,1.000D+00,5.000D-01,5.000D-01], Sc=53, Na=53, Sm=53, St=53, IM=53, AC=53, Li=53, PR=53, SR=53, RO=53, 
Test #104/282,          [1.000D-78,1.000D+00,1.000D+00,1.000D+00,5.000D-01,5.000D-01], Sc=53, Na=53, Sm=53, St=53, IM=53, AC=53, Li=53, PR=53, SR=53, RO=53, 
Test #105/282,         [1.000D+78,1.000D+00,1.000D+00,1.000D+00,5.000D+77,-5.000D+77], Sc=53, Na=53, Sm=53, St=53, IM=53, AC=53, Li=53, PR=53, SR=53, RO=53, 
Test #106/282,         [1.00D+155,1.000D+00,1.000D+00,1.000D+00,5.00D+154,-5.00D+154], Sc=53, Na=53, Sm=53, St=53, IM=53, AC=53, Li=53, PR=53, SR=53, RO=53, 
Test #107/282,         [1.00D+231,1.000D+00,1.000D+00,1.000D+00,5.00D+230,-5.00D+230], Sc=53, Na=53, Sm=53, St=53, IM=53, AC=53, Li=53, PR=53, SR=53, RO=53, 
Test #108/282,         [1.00D+308,1.000D+00,1.000D+00,1.000D+00,5.00D+307,-5.00D+307], Sc=53, Na=53, Sm=53, St=53, IM=53, AC=53, Li=53, PR=53, SR=53, RO=53, 
Test #109/282,         [1.000D+00,1.00D-308,1.000D+00,1.000D+00,5.000D-01,-5.000D-01], Sc=53, Na=53, Sm=53, St=53, IM=53, AC=53, Li=53, PR=53, SR=53, RO=53, 
Test #110/282,         [1.000D+00,1.00D-231,1.000D+00,1.000D+00,5.000D-01,-5.000D-01], Sc=53, Na=53, Sm=53, St=53, IM=53, AC=53, Li=53, PR=53, SR=53, RO=53, 
Test #111/282,         [1.000D+00,1.00D-155,1.000D+00,1.000D+00,5.000D-01,-5.000D-01], Sc=53, Na=53, Sm=53, St=53, IM=53, AC=53, Li=53, PR=53, SR=53, RO=53, 
Test #112/282,         [1.000D+00,1.000D-78,1.000D+00,1.000D+00,5.000D-01,-5.000D-01], Sc=53, Na=53, Sm=53, St=53, IM=53, AC=53, Li=53, PR=53, SR=53, RO=53, 
Test #113/282,          [1.000D+00,1.000D+78,1.000D+00,1.000D+00,5.000D+77,5.000D+77], Sc=53, Na=53, Sm=53, St=53, IM=53, AC=53, Li=53, PR=53, SR=53, RO=53, 
Test #114/282,          [1.000D+00,1.00D+155,1.000D+00,1.000D+00,5.00D+154,5.00D+154], Sc=53, Na=53, Sm=53, St=53, IM=53, AC=53, Li=53, PR=53, SR=53, RO=53, 
Test #115/282,          [1.000D+00,1.00D+231,1.000D+00,1.000D+00,5.00D+230,5.00D+230], Sc=53, Na=53, Sm=53, St=53, IM=53, AC=53, Li=53, PR=53, SR=53, RO=53, 
Test #116/282,          [1.000D+00,1.00D+308,1.000D+00,1.000D+00,5.00D+307,5.00D+307], Sc=53, Na=53, Sm=53, St=53, IM=53, AC=53, Li=53, PR=53, SR=53, RO=53, 
Test #117/282,         [1.000D+00,1.000D+00,1.00D-308,1.000D+00,1.000D+00,-1.000D+00], Sc=53, Na=53, Sm=53, St=53, IM=53, AC=53, Li=53, PR=53, SR=53, RO=53, 
Test #118/282,         [1.000D+00,1.000D+00,1.00D-231,1.000D+00,1.000D+00,-1.000D+00], Sc=53, Na=53, Sm=53, St=53, IM=53, AC=53, Li=53, PR=53, SR=53, RO=53, 
Test #119/282,         [1.000D+00,1.000D+00,1.00D-155,1.000D+00,1.000D+00,-1.000D+00], Sc=53, Na=53, Sm=53, St=53, IM=53, AC=53, Li=53, PR=53, SR=53, RO=53, 
Test #120/282,         [1.000D+00,1.000D+00,1.000D-78,1.000D+00,1.000D+00,-1.000D+00], Sc=53, Na=53, Sm=53, St=53, IM=53, AC=53, Li=53, PR=53, SR=53, RO=53, 
Test #121/282,          [1.000D+00,1.000D+00,1.000D+78,1.000D+00,1.000D-78,1.000D-78], Sc=53, Na=53, Sm=53, St=53, IM=53, AC=53, Li=53, PR=53, SR=53, RO=53, 
Test #122/282,          [1.000D+00,1.000D+00,1.00D+155,1.000D+00,1.00D-155,1.00D-155], Sc=53, Na= 0, Sm=53, St=53, IM=53, AC=53, Li=53, PR=53, SR=53, RO=53, 
Test #123/282,          [1.000D+00,1.000D+00,1.00D+231,1.000D+00,1.00D-231,1.00D-231], Sc=53, Na= 0, Sm=53, St=53, IM=53, AC=53, Li=53, PR=53, SR=53, RO=53, 
Test #124/282,          [1.000D+00,1.000D+00,1.00D+308,1.000D+00,1.00D-308,1.00D-308], Sc=53, Na= 0, Sm=53, St=53, IM=53, AC=53, Li=53, PR=53, SR=53, RO=53, 
Test #125/282,          [1.000D+00,1.000D+00,1.000D+00,1.00D-308,1.000D+00,1.000D+00], Sc=53, Na=53, Sm=53, St=53, IM=53, AC=53, Li=53, PR=53, SR=53, RO=53, 
Test #126/282,          [1.000D+00,1.000D+00,1.000D+00,1.00D-231,1.000D+00,1.000D+00], Sc=53, Na=53, Sm=53, St=53, IM=53, AC=53, Li=53, PR=53, SR=53, RO=53, 
Test #127/282,          [1.000D+00,1.000D+00,1.000D+00,1.00D-155,1.000D+00,1.000D+00], Sc=53, Na=53, Sm=53, St=53, IM=53, AC=53, Li=53, PR=53, SR=53, RO=53, 
Test #128/282,          [1.000D+00,1.000D+00,1.000D+00,1.000D-78,1.000D+00,1.000D+00], Sc=53, Na=53, Sm=53, St=53, IM=53, AC=53, Li=53, PR=53, SR=53, RO=53, 
Test #129/282,         [1.000D+00,1.000D+00,1.000D+00,1.000D+78,1.000D-78,-1.000D-78], Sc=53, Na=53, Sm=53, St=53, IM=53, AC=53, Li=53, PR=53, SR=53, RO=53, 
Test #130/282,         [1.000D+00,1.000D+00,1.000D+00,1.00D+155,1.00D-155,-1.00D-155], Sc=53, Na= 0, Sm=53, St=53, IM=53, AC=53, Li=53, PR=53, SR=53, RO=53, 
Test #131/282,         [1.000D+00,1.000D+00,1.000D+00,1.00D+231,1.00D-231,-1.00D-231], Sc=53, Na= 0, Sm=53, St=53, IM=53, AC=53, Li=53, PR=53, SR=53, RO=53, 
Test #132/282,         [1.000D+00,1.000D+00,1.000D+00,1.00D+308,1.00D-308,-1.00D-308], Sc=53, Na= 0, Sm=53, St=53, IM=53, AC=53, Li=53, PR=53, SR=53, RO=53, 
Test #133/282,         [1.00D+210,1.00D-210,1.00D+170,1.00D-170,1.000D+40,-1.00D-300], Sc=52, Na= 0, Sm= 0, St=52, IM=52, AC= 0, Li= 0, PR= 0, SR= 0, RO=52, 
Test #134/282,         [1.00D+220,1.00D-220,1.00D+170,1.00D-170,1.000D+50,-1.00D-290], Sc=52, Na= 0, Sm= 0, St=52, IM=51, AC= 0, Li= 0, PR= 0, SR= 0, RO=51, 
Test #135/282,         [1.00D+230,1.00D-230,1.00D+170,1.00D-170,1.000D+60,-1.00D-280], Sc=52, Na= 0, Sm= 0, St=52, IM=52, AC= 0, Li= 0, PR= 0, SR= 0, RO=52, 
Test #136/282,         [1.00D+240,1.00D-240,1.00D+170,1.00D-170,1.000D+70,-1.00D-270], Sc=52, Na= 0, Sm= 0, St=53, IM=52, AC= 0, Li= 0, PR= 0, SR= 0, RO=52, 
Test #137/282,         [1.00D+250,1.00D-250,1.00D+170,1.00D-170,1.000D+80,-1.00D-260], Sc=52, Na= 0, Sm= 0, St=52, IM=52, AC= 0, Li= 0, PR= 0, SR= 0, RO=52, 
Test #138/282,         [1.00D+260,1.00D-260,1.00D+170,1.00D-170,1.000D+90,-1.00D-250], Sc=52, Na= 0, Sm= 0, St=52, IM=52, AC= 0, Li= 0, PR= 0, SR= 0, RO=52, 
Test #139/282,         [1.00D+270,1.00D-270,1.00D+170,1.00D-170,1.00D+100,-1.00D-240], Sc=53, Na= 0, Sm= 0, St=53, IM=53, AC= 0, Li= 0, PR= 0, SR= 0, RO=53, 
Test #140/282,         [1.00D+280,1.00D-280,1.00D+170,1.00D-170,1.00D+110,-1.00D-230], Sc=53, Na= 0, Sm= 0, St=52, IM=52, AC= 0, Li= 0, PR= 0, SR= 0, RO=52, 
Test #141/282,         [1.00D+290,1.00D-290,1.00D+170,1.00D-170,1.00D+120,-1.00D-220], Sc=52, Na= 0, Sm= 0, St=53, IM=53, AC= 0, Li= 0, PR= 0, SR= 0, RO=53, 
Test #142/282,         [1.00D+300,1.00D-300,1.00D+170,1.00D-170,1.00D+130,-1.00D-210], Sc=53, Na= 0, Sm= 0, St=53, IM=53, AC= 0, Li= 0, PR= 0, SR= 0, RO=53, 
Test #143/282,         [1.00D+240,1.00D-240,1.00D+180,1.00D-180,1.000D+60,-1.00D-300], Sc=53, Na= 0, Sm= 0, St=53, IM=53, AC= 0, Li= 0, PR= 0, SR= 0, RO=53, 
Test #144/282,         [1.00D+250,1.00D-250,1.00D+180,1.00D-180,1.000D+70,-1.00D-290], Sc=52, Na= 0, Sm= 0, St=52, IM=52, AC= 0, Li= 0, PR= 0, SR= 0, RO=52, 
Test #145/282,         [1.00D+260,1.00D-260,1.00D+180,1.00D-180,1.000D+80,-1.00D-280], Sc=53, Na= 0, Sm= 0, St=51, IM=52, AC= 0, Li= 0, PR= 0, SR= 0, RO=52, 
Test #146/282,         [1.00D+270,1.00D-270,1.00D+180,1.00D-180,1.000D+90,-1.00D-270], Sc=52, Na= 0, Sm= 0, St=52, IM=52, AC= 0, Li= 0, PR= 0, SR= 0, RO=52, 
Test #147/282,         [1.00D+280,1.00D-280,1.00D+180,1.00D-180,1.00D+100,-1.00D-260], Sc=53, Na= 0, Sm= 0, St=53, IM=53, AC= 0, Li= 0, PR= 0, SR= 0, RO=53, 
Test #148/282,         [1.00D+290,1.00D-290,1.00D+180,1.00D-180,1.00D+110,-1.00D-250], Sc=53, Na= 0, Sm= 0, St=53, IM=53, AC= 0, Li= 0, PR= 0, SR= 0, RO=53, 
Test #149/282,         [1.00D+300,1.00D-300,1.00D+180,1.00D-180,1.00D+120,-1.00D-240], Sc=52, Na= 0, Sm= 0, St=52, IM=52, AC= 0, Li= 0, PR= 0, SR= 0, RO=52, 
Test #150/282,         [1.00D+270,1.00D-270,1.00D+190,1.00D-190,1.000D+80,-1.00D-300], Sc=53, Na= 0, Sm= 0, St=53, IM=53, AC= 0, Li= 0, PR= 0, SR= 0, RO=53, 
Test #151/282,         [1.00D+280,1.00D-280,1.00D+190,1.00D-190,1.000D+90,-1.00D-290], Sc=52, Na= 0, Sm= 0, St=52, IM=52, AC= 0, Li= 0, PR= 0, SR= 0, RO=52, 
Test #152/282,         [1.00D+290,1.00D-290,1.00D+190,1.00D-190,1.00D+100,-1.00D-280], Sc=53, Na= 0, Sm= 0, St=52, IM=52, AC= 0, Li= 0, PR= 0, SR= 0, RO=52, 
Test #153/282,         [1.00D+300,1.00D-300,1.00D+190,1.00D-190,1.00D+110,-1.00D-270], Sc=53, Na= 0, Sm= 0, St=52, IM=52, AC= 0, Li= 0, PR= 0, SR= 0, RO=52, 
Test #154/282,         [1.00D+300,1.00D-300,1.00D+200,1.00D-200,1.00D+100,-1.00D-300], Sc=53, Na= 0, Sm= 0, St=53, IM=53, AC= 0, Li= 0, PR= 0, SR= 0, RO=53, 
Test #155/282,          [1.00D+308,1.00D+308,1.000D+00,1.000D+00,1.00D+308,0.000D+00], Sc=53, Na= 0, Sm= 0, St= 0, IM= 0, AC= 0, Li=53, PR=53, SR= 0, RO=53, 
Test #156/282,          [1.00D+308,1.00D+308,1.000D+01,1.000D+01,1.00D+307,0.000D+00], Sc=53, Na= 0, Sm= 0, St= 0, IM= 0, AC=53, Li=53, PR=53, SR= 0, RO=52, 
Test #157/282,          [1.00D+308,1.00D+308,1.000D+02,1.000D+02,1.00D+306,0.000D+00], Sc=53, Na= 0, Sm= 0, St= 0, IM= 0, AC=53, Li=53, PR=53, SR= 0, RO=53, 
Test #158/282,          [1.00D+308,1.00D+308,1.000D+03,1.000D+03,1.00D+305,0.000D+00], Sc=53, Na= 0, Sm= 0, St= 0, IM= 0, AC= 0, Li=53, PR=53, SR= 0, RO=53, 
Test #159/282,          [1.00D+308,1.00D+308,1.000D+04,1.000D+04,1.00D+304,0.000D+00], Sc=52, Na= 0, Sm= 0, St= 0, IM= 0, AC=53, Li=52, PR=53, SR= 0, RO=52, 
Test #160/282,          [1.00D+308,1.00D+308,1.000D+05,1.000D+05,1.00D+303,0.000D+00], Sc=53, Na= 0, Sm= 0, St= 0, IM= 0, AC=53, Li=53, PR=53, SR= 0, RO=52, 
Test #161/282,          [1.00D+308,1.00D+308,1.000D+06,1.000D+06,1.00D+302,0.000D+00], Sc=53, Na= 0, Sm= 0, St= 0, IM= 0, AC= 0, Li=53, PR=53, SR= 0, RO=52, 
Test #162/282,          [1.00D+308,1.00D+308,1.000D+07,1.000D+07,1.00D+301,0.000D+00], Sc=53, Na= 0, Sm= 0, St= 0, IM= 0, AC=53, Li=53, PR=53, SR= 0, RO=52, 
Test #163/282,          [1.00D+308,1.00D+308,1.000D+08,1.000D+08,1.00D+300,0.000D+00], Sc=53, Na= 0, Sm= 0, St= 0, IM= 0, AC=53, Li=53, PR=52, SR= 0, RO=53, 
Test #164/282,          [1.00D+308,1.00D+308,1.000D+09,1.000D+09,1.00D+299,0.000D+00], Sc=53, Na= 0, Sm= 0, St= 0, IM= 0, AC= 0, Li=53, PR=53, SR= 0, RO=53, 
Test #165/282,          [1.00D+308,1.00D+308,1.000D+10,1.000D+10,1.00D+298,0.000D+00], Sc=53, Na= 0, Sm= 0, St= 0, IM= 0, AC=53, Li=53, PR=53, SR= 0, RO=52, 
Test #166/282,          [1.00D+308,1.00D+308,1.000D+20,1.000D+20,1.00D+288,0.000D+00], Sc=53, Na= 0, Sm= 0, St= 0, IM= 0, AC=52, Li=53, PR=52, SR= 0, RO=53, 
Test #167/282,          [1.00D+308,1.00D+308,1.000D+30,1.000D+30,1.00D+278,0.000D+00], Sc=53, Na= 0, Sm= 0, St= 0, IM= 0, AC=53, Li=53, PR=52, SR= 0, RO=53, 
Test #168/282,          [1.00D+308,1.00D+308,1.000D+40,1.000D+40,1.00D+268,0.000D+00], Sc=53, Na= 0, Sm= 0, St= 0, IM= 0, AC= 0, Li=53, PR=53, SR= 0, RO=53, 
Test #169/282,          [1.00D+308,1.00D+308,1.000D+50,1.000D+50,1.00D+258,0.000D+00], Sc=52, Na= 0, Sm= 0, St= 0, IM= 0, AC= 0, Li=52, PR=52, SR= 0, RO=52, 
Test #170/282,          [1.00D+308,1.00D+308,1.000D+60,1.000D+60,1.00D+248,0.000D+00], Sc=53, Na= 0, Sm= 0, St= 0, IM= 0, AC=52, Li=53, PR=52, SR= 0, RO=52, 
Test #171/282,          [1.00D+308,1.00D+308,1.000D+70,1.000D+70,1.00D+238,0.000D+00], Sc=52, Na= 0, Sm= 0, St= 0, IM= 0, AC=53, Li=52, PR=52, SR= 0, RO=53, 
Test #172/282,          [1.00D+308,1.00D+308,1.000D+80,1.000D+80,1.00D+228,0.000D+00], Sc=52, Na= 0, Sm= 0, St= 0, IM= 0, AC=52, Li=52, PR=52, SR= 0, RO=53, 
Test #173/282,          [1.00D+308,1.00D+308,1.000D+90,1.000D+90,1.00D+218,0.000D+00], Sc=53, Na= 0, Sm= 0, St= 0, IM= 0, AC= 0, Li=53, PR=53, SR= 0, RO=53, 
Test #174/282,          [1.00D+308,1.00D+308,1.00D+100,1.00D+100,1.00D+208,0.000D+00], Sc=53, Na= 0, Sm= 0, St= 0, IM= 0, AC=52, Li=53, PR=53, SR= 0, RO=53, 
Test #175/282,          [1.00D+308,1.00D+308,1.00D+110,1.00D+110,1.00D+198,0.000D+00], Sc=53, Na= 0, Sm= 0, St= 0, IM= 0, AC=53, Li=53, PR=53, SR= 0, RO=52, 
Test #176/282,          [1.00D+308,1.00D+308,1.00D+120,1.00D+120,1.00D+188,0.000D+00], Sc=53, Na= 0, Sm= 0, St= 0, IM= 0, AC=53, Li=53, PR=53, SR= 0, RO=53, 
Test #177/282,          [1.00D+308,1.00D+308,1.00D+130,1.00D+130,1.00D+178,0.000D+00], Sc=52, Na= 0, Sm= 0, St= 0, IM= 0, AC= 0, Li=52, PR=52, SR= 0, RO=52, 
Test #178/282,          [1.00D+308,1.00D+308,1.00D+140,1.00D+140,1.00D+168,0.000D+00], Sc=53, Na= 0, Sm= 0, St= 0, IM= 0, AC= 0, Li=53, PR=52, SR= 0, RO=53, 
Test #179/282,          [1.00D+308,1.00D+308,1.00D+150,1.00D+150,1.00D+158,0.000D+00], Sc=52, Na= 0, Sm= 0, St= 0, IM= 0, AC=52, Li=52, PR=52, SR= 0, RO=52, 
Test #180/282,          [1.00D+308,1.00D+308,1.00D+160,1.00D+160,1.00D+148,0.000D+00], Sc=53, Na= 0, Sm= 0, St= 0, IM= 0, AC=52, Li=53, PR=52, SR= 0, RO=53, 
Test #181/282,          [1.00D+308,1.00D+308,1.00D+170,1.00D+170,1.00D+138,0.000D+00], Sc=53, Na= 0, Sm= 0, St= 0, IM= 0, AC=53, Li=53, PR=53, SR= 0, RO=53, 
Test #182/282,          [1.00D+308,1.00D+308,1.00D+180,1.00D+180,1.00D+128,0.000D+00], Sc=53, Na= 0, Sm= 0, St= 0, IM= 0, AC= 0, Li=53, PR=52, SR= 0, RO=53, 
Test #183/282,          [1.00D+308,1.00D+308,1.00D+190,1.00D+190,1.00D+118,0.000D+00], Sc=53, Na= 0, Sm= 0, St= 0, IM= 0, AC=53, Li=53, PR=52, SR= 0, RO=52, 
Test #184/282,          [1.00D+308,1.00D+308,1.00D+200,1.00D+200,1.00D+108,0.000D+00], Sc=53, Na= 0, Sm= 0, St= 0, IM= 0, AC=53, Li=53, PR=52, SR= 0, RO=53, 
Test #185/282,          [1.00D+308,1.00D+308,1.00D+210,1.00D+210,1.000D+98,0.000D+00], Sc=52, Na= 0, Sm= 0, St= 0, IM= 0, AC=53, Li=52, PR=53, SR= 0, RO=53, 
Test #186/282,          [1.00D+308,1.00D+308,1.00D+220,1.00D+220,1.000D+88,0.000D+00], Sc=53, Na= 0, Sm= 0, St= 0, IM= 0, AC=53, Li=53, PR=53, SR= 0, RO=53, 
Test #187/282,          [1.00D+308,1.00D+308,1.00D+230,1.00D+230,1.000D+78,0.000D+00], Sc=53, Na= 0, Sm= 0, St= 0, IM= 0, AC= 0, Li=53, PR=52, SR= 0, RO=53, 
Test #188/282,          [1.00D+308,1.00D+308,1.00D+240,1.00D+240,1.000D+68,0.000D+00], Sc=53, Na= 0, Sm= 0, St= 0, IM= 0, AC=52, Li=53, PR=52, SR= 0, RO=53, 
Test #189/282,          [1.00D+308,1.00D+308,1.00D+250,1.00D+250,1.000D+58,0.000D+00], Sc=52, Na= 0, Sm= 0, St= 0, IM= 0, AC=52, Li=52, PR=52, SR= 0, RO=52, 
Test #190/282,          [1.00D+308,1.00D+308,1.00D+260,1.00D+260,1.000D+48,0.000D+00], Sc=52, Na= 0, Sm= 0, St= 0, IM= 0, AC=52, Li=52, PR=52, SR= 0, RO=53, 
Test #191/282,          [1.00D+308,1.00D+308,1.00D+270,1.00D+270,1.000D+38,0.000D+00], Sc=53, Na= 0, Sm= 0, St= 0, IM= 0, AC= 0, Li=53, PR=53, SR= 0, RO=53, 
Test #192/282,          [1.00D+308,1.00D+308,1.00D+280,1.00D+280,1.000D+28,0.000D+00], Sc=53, Na= 0, Sm= 0, St= 0, IM= 0, AC= 0, Li=53, PR=53, SR= 0, RO=53, 
Test #193/282,          [1.00D+308,1.00D+308,1.00D+290,1.00D+290,1.000D+18,0.000D+00], Sc=53, Na= 0, Sm= 0, St= 0, IM= 0, AC=52, Li=53, PR=53, SR= 0, RO=53, 
Test #194/282,          [1.00D+308,1.00D+308,1.00D+300,1.00D+300,1.000D+08,0.000D+00], Sc=53, Na= 0, Sm= 0, St= 0, IM= 0, AC=53, Li=53, PR=53, SR= 0, RO=53, 
Test #195/282,          [1.00D+308,1.00D+308,1.00D+308,1.00D+308,1.000D+00,0.000D+00], Sc=53, Na= 0, Sm= 0, St= 0, IM= 0, AC= 0, Li=53, PR=53, SR= 0, RO=53, 
Test #196/282,          [1.000D+00,1.000D+00,1.00D+308,1.00D+308,1.00D-308,0.000D+00], Sc=53, Na= 0, Sm= 0, St= 0, IM= 0, AC=53, Li=53, PR=53, SR= 0, RO=53, 
Test #197/282,          [1.000D+01,1.000D+01,1.00D+308,1.00D+308,1.00D-307,0.000D+00], Sc=53, Na= 0, Sm= 0, St= 0, IM= 0, AC=53, Li=53, PR=53, SR= 0, RO=53, 
Test #198/282,          [1.000D+02,1.000D+02,1.00D+308,1.00D+308,1.00D-306,0.000D+00], Sc=53, Na= 0, Sm= 0, St= 0, IM= 0, AC=53, Li=53, PR=52, SR= 0, RO=52, 
Test #199/282,          [1.000D+03,1.000D+03,1.00D+308,1.00D+308,1.00D-305,0.000D+00], Sc=53, Na= 0, Sm= 0, St= 0, IM= 0, AC=52, Li=53, PR=52, SR= 0, RO=52, 
Test #200/282,          [1.000D+04,1.000D+04,1.00D+308,1.00D+308,1.00D-304,0.000D+00], Sc=53, Na= 0, Sm= 0, St= 0, IM= 0, AC=53, Li=53, PR=53, SR= 0, RO=53, 
Test #201/282,          [1.000D+05,1.000D+05,1.00D+308,1.00D+308,1.00D-303,0.000D+00], Sc=53, Na= 0, Sm= 0, St= 0, IM= 0, AC=53, Li=53, PR=53, SR= 0, RO=53, 
Test #202/282,          [1.000D+06,1.000D+06,1.00D+308,1.00D+308,1.00D-302,0.000D+00], Sc=53, Na= 0, Sm= 0, St= 0, IM= 0, AC=53, Li=53, PR=53, SR= 0, RO=53, 
Test #203/282,          [1.000D+07,1.000D+07,1.00D+308,1.00D+308,1.00D-301,0.000D+00], Sc=53, Na= 0, Sm= 0, St= 0, IM= 0, AC=53, Li=53, PR=53, SR= 0, RO=52, 
Test #204/282,          [1.000D+08,1.000D+08,1.00D+308,1.00D+308,1.00D-300,0.000D+00], Sc=53, Na= 0, Sm= 0, St= 0, IM= 0, AC=52, Li=53, PR=52, SR= 0, RO=52, 
Test #205/282,          [1.000D+09,1.000D+09,1.00D+308,1.00D+308,1.00D-299,0.000D+00], Sc=53, Na= 0, Sm= 0, St= 0, IM= 0, AC=52, Li=53, PR=52, SR= 0, RO=52, 
Test #206/282,          [1.000D+10,1.000D+10,1.00D+308,1.00D+308,1.00D-298,0.000D+00], Sc=53, Na= 0, Sm= 0, St= 0, IM= 0, AC=53, Li=53, PR=53, SR= 0, RO=53, 
Test #207/282,          [1.000D+20,1.000D+20,1.00D+308,1.00D+308,1.00D-288,0.000D+00], Sc=53, Na= 0, Sm= 0, St= 0, IM= 0, AC=52, Li=53, PR=52, SR= 0, RO=52, 
Test #208/282,          [1.000D+30,1.000D+30,1.00D+308,1.00D+308,1.00D-278,0.000D+00], Sc=53, Na= 0, Sm= 0, St= 0, IM= 0, AC=53, Li=53, PR=53, SR= 0, RO=53, 
Test #209/282,          [1.000D+40,1.000D+40,1.00D+308,1.00D+308,1.00D-268,0.000D+00], Sc=53, Na= 0, Sm= 0, St= 0, IM= 0, AC=53, Li=53, PR=53, SR= 0, RO=53, 
Test #210/282,          [1.000D+50,1.000D+50,1.00D+308,1.00D+308,1.00D-258,0.000D+00], Sc=52, Na= 0, Sm= 0, St= 0, IM= 0, AC=52, Li=52, PR=52, SR= 0, RO=53, 
Test #211/282,          [1.000D+60,1.000D+60,1.00D+308,1.00D+308,1.00D-248,0.000D+00], Sc=53, Na= 0, Sm= 0, St= 0, IM= 0, AC=53, Li=53, PR=53, SR= 0, RO=52, 
Test #212/282,          [1.000D+70,1.000D+70,1.00D+308,1.00D+308,1.00D-238,0.000D+00], Sc=53, Na= 0, Sm= 0, St= 0, IM= 0, AC=52, Li=53, PR=52, SR= 0, RO=53, 
Test #213/282,          [1.000D+80,1.000D+80,1.00D+308,1.00D+308,1.00D-228,0.000D+00], Sc=53, Na= 0, Sm= 0, St= 0, IM= 0, AC=53, Li=53, PR=53, SR= 0, RO=52, 
Test #214/282,          [1.000D+90,1.000D+90,1.00D+308,1.00D+308,1.00D-218,0.000D+00], Sc=52, Na= 0, Sm= 0, St= 0, IM= 0, AC=52, Li=52, PR=52, SR= 0, RO=52, 
Test #215/282,          [1.00D+100,1.00D+100,1.00D+308,1.00D+308,1.00D-208,0.000D+00], Sc=53, Na= 0, Sm= 0, St= 0, IM= 0, AC=52, Li=53, PR=52, SR= 0, RO=52, 
Test #216/282,          [1.00D+110,1.00D+110,1.00D+308,1.00D+308,1.00D-198,0.000D+00], Sc=52, Na= 0, Sm= 0, St= 0, IM= 0, AC=53, Li=52, PR=53, SR= 0, RO=53, 
Test #217/282,          [1.00D+120,1.00D+120,1.00D+308,1.00D+308,1.00D-188,0.000D+00], Sc=53, Na= 0, Sm= 0, St= 0, IM= 0, AC=53, Li=53, PR=53, SR= 0, RO=53, 
Test #218/282,          [1.00D+130,1.00D+130,1.00D+308,1.00D+308,1.00D-178,0.000D+00], Sc=52, Na= 0, Sm= 0, St= 0, IM= 0, AC=53, Li=52, PR=53, SR= 0, RO=53, 
Test #219/282,          [1.00D+140,1.00D+140,1.00D+308,1.00D+308,1.00D-168,0.000D+00], Sc=53, Na= 0, Sm= 0, St= 0, IM= 0, AC=53, Li=53, PR=53, SR= 0, RO=52, 
Test #220/282,          [1.00D+150,1.00D+150,1.00D+308,1.00D+308,1.00D-158,0.000D+00], Sc=53, Na= 0, Sm= 0, St= 0, IM= 0, AC=53, Li=53, PR=52, SR= 0, RO=52, 
Test #221/282,          [1.00D+160,1.00D+160,1.00D+308,1.00D+308,1.00D-148,0.000D+00], Sc=53, Na= 0, Sm= 0, St= 0, IM= 0, AC=53, Li=53, PR=53, SR= 0, RO=53, 
Test #222/282,          [1.00D+170,1.00D+170,1.00D+308,1.00D+308,1.00D-138,0.000D+00], Sc=53, Na= 0, Sm= 0, St= 0, IM= 0, AC=52, Li=53, PR=52, SR= 0, RO=52, 
Test #223/282,          [1.00D+180,1.00D+180,1.00D+308,1.00D+308,1.00D-128,0.000D+00], Sc=53, Na= 0, Sm= 0, St= 0, IM= 0, AC=52, Li=53, PR=52, SR= 0, RO=52, 
Test #224/282,          [1.00D+190,1.00D+190,1.00D+308,1.00D+308,1.00D-118,0.000D+00], Sc=53, Na= 0, Sm= 0, St= 0, IM= 0, AC=53, Li=53, PR=53, SR= 0, RO=53, 
Test #225/282,          [1.00D+200,1.00D+200,1.00D+308,1.00D+308,1.00D-108,0.000D+00], Sc=53, Na= 0, Sm= 0, St= 0, IM= 0, AC=53, Li=53, PR=53, SR= 0, RO=52, 
Test #226/282,          [1.00D+210,1.00D+210,1.00D+308,1.00D+308,1.000D-98,0.000D+00], Sc=53, Na= 0, Sm= 0, St= 0, IM= 0, AC=53, Li=53, PR=52, SR= 0, RO=52, 
Test #227/282,          [1.00D+220,1.00D+220,1.00D+308,1.00D+308,1.000D-88,0.000D+00], Sc=53, Na= 0, Sm= 0, St= 0, IM= 0, AC=53, Li=53, PR=53, SR= 0, RO=53, 
Test #228/282,          [1.00D+230,1.00D+230,1.00D+308,1.00D+308,1.000D-78,0.000D+00], Sc=52, Na= 0, Sm= 0, St= 0, IM= 0, AC=53, Li=52, PR=53, SR= 0, RO=53, 
Test #229/282,          [1.00D+240,1.00D+240,1.00D+308,1.00D+308,1.000D-68,0.000D+00], Sc=53, Na= 0, Sm= 0, St= 0, IM= 0, AC=53, Li=53, PR=53, SR= 0, RO=52, 
Test #230/282,          [1.00D+250,1.00D+250,1.00D+308,1.00D+308,1.000D-58,0.000D+00], Sc=52, Na= 0, Sm= 0, St= 0, IM= 0, AC=52, Li=52, PR=52, SR= 0, RO=52, 
Test #231/282,          [1.00D+260,1.00D+260,1.00D+308,1.00D+308,1.000D-48,0.000D+00], Sc=52, Na= 0, Sm= 0, St= 0, IM= 0, AC=52, Li=52, PR=52, SR= 0, RO=53, 
Test #232/282,          [1.00D+270,1.00D+270,1.00D+308,1.00D+308,1.000D-38,0.000D+00], Sc=52, Na= 0, Sm= 0, St= 0, IM= 0, AC=53, Li=52, PR=53, SR= 0, RO=53, 
Test #233/282,          [1.00D+280,1.00D+280,1.00D+308,1.00D+308,1.000D-28,0.000D+00], Sc=53, Na= 0, Sm= 0, St= 0, IM= 0, AC=53, Li=53, PR=53, SR= 0, RO=53, 
Test #234/282,          [1.00D+290,1.00D+290,1.00D+308,1.00D+308,1.000D-18,0.000D+00], Sc=53, Na= 0, Sm= 0, St= 0, IM= 0, AC=52, Li=53, PR=52, SR= 0, RO=52, 
Test #235/282,          [1.00D+300,1.00D+300,1.00D+308,1.00D+308,1.000D-08,0.000D+00], Sc=53, Na= 0, Sm= 0, St= 0, IM= 0, AC=53, Li=53, PR=53, SR= 0, RO=53, 
Test #236/282,          [1.00D+308,1.00D+308,1.00D+308,1.00D+308,1.000D+00,0.000D+00], Sc=53, Na= 0, Sm= 0, St= 0, IM= 0, AC= 0, Li=53, PR=53, SR= 0, RO=53, 
Test #237/282,          [4.235D-22,2.24D+307,2.14D+301,5.852D-98,1.97D-323,1.049D+06], Sc=53, Na= 0, Sm=53, St=53, IM=53, AC=53, Li= 0, PR=53, SR=53, RO=53, 
Test #238/282,         [9.88D-324,1.16D-156,3.87D-267,5.852D-98,1.991D-59,-1.67D-226], Sc=53, Na= 0, Sm= 6, St= 6, IM= 6, AC= 6, Li= 6, PR=53, SR= 6, RO=53, 
Test #239/282,          [3.81D-152,3.95D-323,1.593D-58,4.68D-243,2.397D-94,2.48D-265], Sc=53, Na= 0, Sm=44, St=44, IM=44, AC=44, Li=44, PR=53, SR=44, RO=53, 
Test #240/282,         [2.26D-218,3.16D-322,2.40D-240,2.88D-129,1.09D-193,-7.855D-90], Sc=53, Na= 0, Sm=24, St=24, IM=24, AC=24, Li=24, PR=53, SR=24, RO=53, 
Test #241/282,         [1.47D-272,1.58D-322,1.23D-119,1.274D-57,1.24D-265,-1.16D-215], Sc=53, Na= 0, Sm=40, St=40, IM=40, AC=40, Li=40, PR=53, SR=40, RO=53, 
Test #242/282,         [6.47D-319,1.51D-123,2.84D-306,5.58D-104,2.711D-20,-1.16D-215], Sc=53, Na= 0, Sm=22, St=22, IM=22, AC=22, Li=22, PR=53, SR=22, RO=53, 
Test #243/282,         [1.92D-239,7.90D-323,7.18D-189,1.11D-103,7.19D-220,-1.72D-136], Sc=53, Na= 0, Sm= 6, St= 6, IM= 6, AC= 6, Li= 6, PR=53, SR= 6, RO=53, 
Test #244/282,         [3.66D-245,8.32D-258,1.70D-254,1.06D-255,2.139D+09,-1.337D+08], Sc=53, Na= 0, Sm=53, St=52, IM=52, AC=53, Li=53, PR=52, SR=53, RO=52, 
Test #245/282,         [2.12D-314,1.99D-205,6.91D-223,1.829D-99,1.09D-106,-1.16D-215], Sc=53, Na= 0, Sm=48, St=48, IM=48, AC=48, Li=48, PR=53, SR=48, RO=53, 
Test #246/282,          [1.25D-293,2.53D-321,5.00D-147,1.88D-183,2.50D-147,5.05D-175], Sc=53, Na= 0, Sm=28, St=28, IM=28, AC=28, Li=53, PR=53, SR=28, RO=53, 
Test #247/282,         [4.94D-324,6.05D-269,2.19D-193,1.51D-123,4.00D-146,-3.26D-201], Sc=53, Na= 0, Sm=49, St=49, IM=49, AC= 0, Li=49, PR=53, SR=49, RO=53, 
Test #248/282,          [2.00D-292,1.01D-320,3.74D-242,2.15D-283,5.346D-51,2.699D-79], Sc=53, Na= 0, Sm=42, St=42, IM=42, AC=42, Li=42, PR=53, SR=42, RO=53, 
Test #249/282,         [1.97D-323,6.84D-195,2.87D-188,1.711D-49,4.00D-146,-1.15D-274], Sc=53, Na= 0, Sm=33, St=33, IM=33, AC=33, Li=33, PR=53, SR=33, RO=53, 
Test #250/282,          [4.88D-150,4.94D-324,1.776D-15,1.71D-195,2.75D-135,2.78D-309], Sc=53, Na= 0, Sm=19, St=19, IM=19, AC= 0, Li=19, PR=53, SR=19, RO=53, 
Test #251/282,          [9.88D-324,1.28D-290,1.257D-88,7.38D-127,7.86D-236,1.02D-202], Sc=53, Na= 0, Sm=17, St=17, IM=17, AC=17, Li=17, PR=53, SR=17, RO=53, 
Test #252/282,          [1.61D-319,1.00D-292,8.20D-143,6.31D-176,1.97D-177,1.22D-150], Sc=53, Na= 0, Sm=21, St=21, IM=21, AC=21, Li=53, PR=53, SR=21, RO=53, 
Test #253/282,         [7.57D-270,5.05D-321,4.217D-81,8.272D-25,6.11D-297,-9.15D-246], Sc=53, Na= 0, Sm=17, St=17, IM=17, AC=17, Li=17, PR=53, SR=17, RO=53, 
Test #254/282,         [1.12D+307,8.52D-255,2.99D+197,1.57D-235,3.75D+109,-1.97D-323], Sc=53, Na= 0, Sm= 0, St=53, IM=53, AC= 0, Li= 0, PR= 0, SR= 0, RO=53, 
Test #255/282,         [1.29D-318,1.33D-256,3.31D-316,5.72D-247,2.328D-10,-2.264D-72], Sc=53, Na= 0, Sm=23, St=23, IM=23, AC=23, Li=23, PR=53, SR=23, RO=53, 
Test #256/282,         [9.28D-215,2.02D-320,5.94D-213,9.14D-100,2.21D-221,-1.01D-115], Sc=53, Na= 0, Sm=25, St=25, IM=25, AC=25, Li=25, PR=53, SR=25, RO=53, 
Test #257/282,         [5.40D-225,8.09D-320,4.61D-128,2.585D-26,3.13D-294,-2.09D-199], Sc=53, Na= 0, Sm=23, St=23, IM=23, AC=23, Li=23, PR=53, SR=23, RO=53, 
Test #258/282,          [4.94D-324,1.10D-221,2.74D-194,2.91D-303,1.80D-130,4.039D-28], Sc=53, Na= 0, Sm=22, St=22, IM=22, AC= 0, Li=22, PR=53, SR=22, RO=53, 
Test #259/282,         [4.04D-320,1.72D-223,1.74D-251,1.56D-148,1.105D-75,-2.58D-172], Sc=53, Na= 0, Sm=20, St=20, IM=20, AC=20, Li=20, PR=53, SR=20, RO=53, 
Test #260/282,          [2.05D-289,4.14D-317,9.77D-150,1.17D-184,2.09D-140,4.24D-168], Sc=53, Na= 0, Sm=23, St=23, IM=23, AC=23, Li=23, PR=53, SR=23, RO=53, 
Test #261/282,          [7.90D-323,1.16D-215,2.673D-51,5.42D-166,2.95D-272,4.34D-165], Sc=53, Na= 0, Sm=25, St=25, IM=25, AC=25, Li=25, PR=53, SR=25, RO=53, 
Test #262/282,         [1.69D-167,1.58D-322,3.10D-266,8.51D-109,1.86D-214,-1.991D-59], Sc=53, Na= 0, Sm= 8, St= 8, IM= 8, AC= 8, Li= 8, PR=53, SR= 8, RO=53, 
Test #263/282,          [1.01D-320,7.12D-307,4.28D-196,3.71D-214,2.36D-125,1.66D-111], Sc=53, Na= 0, Sm=14, St=14, IM=14, AC=14, Li=53, PR=53, SR=14, RO=53, 
Test #264/282,          [4.94D-324,2.84D-306,6.163D-33,2.673D-51,1.00D-291,4.62D-274], Sc=53, Na= 0, Sm= 2, St= 2, IM= 2, AC= 0, Li=53, PR=53, SR= 2, RO=53, 
Test #265/282,          [3.96D-118,5.18D-318,2.159D-78,4.20D-286,1.837D-40,2.40D-240], Sc=53, Na= 0, Sm=25, St=25, IM=25, AC=25, Li=25, PR=53, SR=25, RO=53, 
Test #266/282,          [2.07D-112,5.05D-321,4.022D-87,1.86D-301,5.170D-26,1.25D-234], Sc=53, Na= 0, Sm=18, St=18, IM=18, AC=18, Li=18, PR=53, SR=18, RO=53, 
Test #267/282,          [1.23D-178,6.136D-92,4.99D+145,3.065D+54,4.94D-324,1.22D-237], Sc=53, Na=53, Sm=53, St=53, IM=53, AC= 0, Li=53, PR=53, SR=53, RO=53, 
Test #268/282,          [1.10D-221,1.014D+31,5.73D+104,8.00D-146,4.94D-324,1.769D-74], Sc=53, Na=53, Sm=53, St=53, IM=53, AC= 0, Li=53, PR=53, SR=53, RO=53, 
Test #269/282,         [7.006D-46,1.21D-268,1.72D-136,2.209D+71,4.94D-324,-3.17D-117], Sc=53, Na=53, Sm=53, St=53, IM=53, AC= 0, Li=53, PR=53, SR=53, RO=53, 
Test #270/282,         [2.43D+142,1.355D-20,4.33D+127,5.48D+303,4.94D-324,-4.44D-162], Sc=53, Na= 0, Sm=53, St=53, IM=53, AC= 0, Li=53, PR= 0, SR=53, RO=53, 
Test #271/282,         [3.065D+54,7.245D-71,3.04D+141,6.15D+259,4.94D-324,-4.98D-206], Sc=53, Na= 0, Sm=53, St=53, IM=53, AC= 0, Li=53, PR=53, SR=53, RO=53, 
Test #272/282,         [4.19D-140,1.03D-317,7.28D-158,3.518D+13,4.94D-324,-1.19D-153], Sc=53, Na=53, Sm=53, St=53, IM=53, AC= 0, Li=53, PR= 0, SR=53, RO=53, 
Test #273/282,          [4.039D-28,6.45D+119,1.75D+305,1.17D+167,4.94D-324,3.67D-186], Sc=53, Na= 0, Sm=53, St=53, IM=53, AC= 0, Li=53, PR=53, SR=53, RO=53, 
Test #274/282,          [5.03D-234,1.084D-19,4.375D+99,4.36D-106,4.94D-324,2.47D-119], Sc=53, Na=53, Sm=53, St=53, IM=53, AC= 0, Li=53, PR=53, SR=53, RO=53, 
Test #275/282,          [6.104D-05,5.243D+05,8.51D-109,6.81D-108,7.57D+112,9.47D+111], Sc=53, Na=53, Sm=53, St=52, IM=52, AC=53, Li=53, PR=52, SR=53, RO=52, 
Test #276/282,         [5.243D+05,8.000D+00,1.77D-220,7.08D-220,1.74D+224,-6.96D+224], Sc=53, Na= 0, Sm=53, St=52, IM=52, AC=53, Li=53, PR=52, SR=53, RO=52, 
Test #277/282,         [4.02D-233,6.29D-235,6.08D-210,3.98D-205,1.579D-30,-1.010D-28], Sc=53, Na= 0, Sm=53, St=52, IM=52, AC=53, Li=53, PR=52, SR=53, RO=52, 
Test #278/282,          [4.32D+273,6.09D+287,1.916D+53,3.831D+53,1.27D+234,6.35D+233], Sc=53, Na= 0, Sm=53, St=52, IM=52, AC=53, Li=53, PR=52, SR=53, RO=52, 
Test #279/282,         [3.42D-195,1.30D-200,5.340D+95,2.734D+98,2.45D-296,-1.25D-293], Sc=53, Na=53, Sm=53, St=52, IM=52, AC=53, Li=53, PR=52, SR=53, RO=52, 
Test #280/282,          [1.68D-285,1.18D-271,5.88D-185,2.94D-185,8.043D-88,1.609D-87], Sc=53, Na= 0, Sm=53, St=52, IM=52, AC=53, Li=53, PR=52, SR=53, RO=52, 
Test #281/282,          [5.421D-20,3.553D-15,5.80D-216,1.16D-215,2.44D+200,1.22D+200], Sc=53, Na= 0, Sm=53, St=52, IM=52, AC=53, Li=53, PR=52, SR=53, RO=52, 
Test #282/282,         [2.88D-275,1.73D-310,1.881D-37,7.037D+13,4.94D-324,-4.10D-289], Sc=53, Na=53, Sm= 0, St= 0, IM= 0, AC= 0, Li= 0, PR=53, SR= 0, RO= 0, 
mprintf("Average:\n");
Average:
j=2;
mprintf("Sc=%d\n",mean(dg(:,j)));
Sc=50
j=j+1;
mprintf("Na=%d\n",mean(dg(:,j)));
Na=22
j=j+1;
mprintf("Sm=%d\n",mean(dg(:,j)));
Sm=28
j=j+1;
mprintf("ST=%d\n",mean(dg(:,j)));
ST=32
j=j+1;
mprintf("IM=%d\n",mean(dg(:,j)));
IM=32
j=j+1;
mprintf("AC=%d\n",mean(dg(:,j)));
AC=40
j=j+1;
mprintf("Li=%d\n",mean(dg(:,j)));
Li=43
j=j+1;
mprintf("PR=%d\n",mean(dg(:,j)));
PR=45
j=j+1;
mprintf("SR=%d\n",mean(dg(:,j)));
SR=28
j=j+1;
mprintf("RO=%d\n",mean(dg(:,j)));
RO=50
j=j+1;
// Discovered Issues:
// (0+%i*1 )/(0+%i*0)    Scilab=Nan+Nan i Octave=NaN+Inf i Matlab=NaN+Inf i
// (1+%i*1)/(0+%i*0)     Scilab=NaN+NaN i Octave=Inf+Inf i Matlab=Inf+Inf i
// (1+%i*-1)/(0+%i*0)    Scilab=Nan+Nan i Octave=Inf-Inf i Matlab=Inf-Inf i
// (%inf+%i*1)/(1+%i*1)  Scilab=NaN-Inf i Octave=Inf-Inf i Matlab=Inf-Inf i 
//
// smith3-improved Smith method, with an exp-log product-does not improve much.
// Li improves for some case, but not all.
// Only smith5 works in all the current test cases.
//
