//<-- JVM NOT MANDATORY -->
//=================================
// tests with integers <10^16 
n=bigint(2^3*5*17^4)
 n  =
 
 
 3340840   
 [str,P,A]=factorize(n)
 A  =
 
    3.    1.    4.  
 P  =
 
    2.    5.    17.  
 str  =
 
 2^(3)*5*17^(4)   
 assert_checktrue(evstr(str)==n)
 ans  =
 
  T  
 assert_checktrue(prod(P.^A)==n)
 ans  =
 
  T  
 n=bigint(43691)
 n  =
 
 
 43691   
 [str,P,A]=factorize(n)
 A  =
 
    1.  
 P  =
 
    43691.  
 str  =
 
 43691   
 assert_checktrue(evstr(str)==n)
 ans  =
 
  T  
 assert_checktrue(prod(P.^A)==n)
 ans  =
 
  T  
 n=prod(primes(17))*prod(primes(9))*bigint(1e8)
 n  =
 
 
 10720710000000000   
 [str,P,A]=factorize(n)
 A  =
 
 
!10  2  10  2  1  1  1  !
 P  =
 
 
!2  3  5  7  11  13  17  !
 str  =
 
 2^(10)*3^(2)*5^(10)*7^(2)*11*13*17   
 assert_checktrue(prod(P.^A)==n)
 ans  =
 
  T  
  // stop search when p^2 >n 
 n=(bigint(2)^53)*bigint(51061)
 n  =
 
 
 459916601146329792512   
 [str,P,A]=factorize(n)
 A  =
 
 
!53  1  !
 P  =
 
 
!2  51061  !
 str  =
 
 2^(53)*51061   
 assert_checktrue(prod(P.^A)==n)
 ans  =
 
  T  
