//<-- JVM NOT MANDATORY -->
//=================================
x=bigint('1234567890');;
assert_checkequal(x,abs(x))
 ans  =
 
  T  
y=bigint('-1234567890');
assert_checkequal(x,abs(y))
 ans  =
 
  T  
