//<-- JVM NOT MANDATORY -->
//=================================
x=123456
 x  =
 
    123456.  
y=456789
 y  =
 
    456789.  
z=987654
 z  =
 
    987654.  
MM=[x y; z x-z]
 MM  =
 
    123456.    456789.  
    987654.  - 864198.  
M=mbigint(MM)
 M  =
 
 
!123456  456789   !
!                 !
!987654  -864198  !
NN=[x -z; -y x-z]
 NN  =
 
    123456.  - 987654.  
  - 456789.  - 864198.  
N=mbigint(NN)
 N  =
 
 
!123456   -987654  !
!                  !
!-456789  -864198  !
P1=M.*N
 P1  =
 
 
!15241383936    -451149483006  !
!                              !
!-451149483006  746838183204   !
P2=M.*NN
 P2  =
 
 
!15241383936    -451149483006  !
!                              !
!-451149483006  746838183204   !
P3=MM.*N
 P3  =
 
 
!15241383936    -451149483006  !
!                              !
!-451149483006  746838183204   !
P4=MM.*NN //double verification
 P4  =
 
 10^10 *
 
    1.5241384  - 45.114948  
  - 45.114948    74.683818  
 assert_checktrue(and(P1==P4))
 ans  =
 
  T  
 assert_checktrue(and(P2==P4))
 ans  =
 
  T  
 assert_checktrue(and(P3==P4))
 ans  =
 
  T  
 // mixed bigint/double/mbigint
Q1=M.*x
 Q1  =
 
 
!15241383936   56393342784    !
!                             !
!121931812224  -106690428288  !
Q2=x.*M
 Q2  =
 
 
!15241383936   56393342784    !
!                             !
!121931812224  -106690428288  !
Q3=M.*bigint(x)
 Q3  =
 
 
!15241383936   56393342784    !
!                             !
!121931812224  -106690428288  !
Q4=bigint(x).*M
 Q4  =
 
 
!15241383936   56393342784    !
!                             !
!121931812224  -106690428288  !
Q=x.*MM// double verification
 Q  =
 
 10^10 *
 
    1.5241384    5.6393343  
    12.193181  - 10.669043  
 assert_checktrue(and(Q1==Q))
 ans  =
 
  T  
 assert_checktrue(and(Q2==Q))
 ans  =
 
  T  
 assert_checktrue(and(Q3==Q))
 ans  =
 
  T  
 assert_checktrue(and(Q4==Q))
 ans  =
 
  T  
