//<-- JVM NOT MANDATORY -->
//=================================
// tests with integers <10^16 
x=bigint('12345678') ;
y=bigint('98765432') ;
z=x*y;
zz=12345678*98765432;
// tests with  integers <0 
x=bigint('-12345678') ;
y=bigint('98765432') ;
z=x*y;
zz=-98765432*12345678;
zzz=bigint(zz)
 zzz  =
 
 
 -1219326221002896   
assert_checkequal(z,zzz)
 ans  =
 
  T  
z=y*x;
assert_checkequal(z,zzz)
 ans  =
 
  T  
x=bigint('-12345678') ;
y=bigint('-98765432') ;
z=x*y;
zz=98765432*12345678;
zzz=bigint(zz)
 zzz  =
 
 
 1219326221002896   
assert_checkequal(z,zzz)
 ans  =
 
  T  
// tests with integers >10^16 
x=bigint('123456789987654321');
y=bigint('987654321123456789');
z=x*y;
assert_checkequal(z,bigint('121932632103337905662094193112635269'))
 ans  =
 
  T  
// mixed tests double/bigint
x=bigint('123456789987654321');
y=987654321;
z=x*y;
assert_checkequal(z,bigint('121932632088096326789971041'))
 ans  =
 
  T  
z=y*x
 z  =
 
 
 121932632088096326789971041   
assert_checkequal(z,bigint('121932632088096326789971041'))
 ans  =
 
  T  
y=987654321*ones(2,2);
z=x*y;
assert_checkequal(z,bigint('121932632088096326789971041')*ones(2,2))
 ans  =
 
  T  
z=y*x
 z  =
 
 
!121932632088096326789971041  121932632088096326789971041  !
!                                                          !
!121932632088096326789971041  121932632088096326789971041  !
assert_checkequal(z,bigint('121932632088096326789971041')*ones(2,2))
 ans  =
 
  T  
