//<-- JVM NOT MANDATORY -->
//=================================
// tests with integers <10^16 
x=bigint('98765432') 
 x  =
 
 
 98765432   
y=bigint('12345678') 
 y  =
 
 
 12345678   
[d,a,b]=Bezout(x,y) 
 b  =
 
 
 -12345681   
 a  =
 
 
 1543210   
 d  =
 
 
 2   
assert_checktrue(d==a*x+b*y)
 ans  =
 
  T  
// tests with integers >10^16 
x=bigint('123456789987654321')
 x  =
 
 
 123456789987654321   
y=bigint('987654321123456789')
 y  =
 
 
 987654321123456789   
[d,a,b]=Bezout(x,y) 
 b  =
 
 
 1   
 a  =
 
 
 -8   
 d  =
 
 
 1222222221   
assert_checktrue(d==a*x+b*y)
 ans  =
 
  T  
// tests negatives integers 
x=bigint('123456789987654321')
 x  =
 
 
 123456789987654321   
y=bigint('-987654321123456789')
 y  =
 
 
 -987654321123456789   
[d,a,b]=Bezout(x,y) 
 b  =
 
 
 -1   
 a  =
 
 
 -8   
 d  =
 
 
 1222222221   
assert_checktrue(d==a*x+b*y)
 ans  =
 
  T  
