//<-- JVM NOT MANDATORY -->
//=================================
x=bigint('1234567890');
assert_checkfalse(x<>x)
 ans  =
 
  T  
y=bigint('-1234567890');
assert_checktrue(x<>y)
 ans  =
 
  T  
//mixed case
assert_checktrue(y<>1234567890)
 ans  =
 
  T  
assert_checktrue(1234567890<>y)
 ans  =
 
  T  
assert_checkfalse(1234567890<>x)
 ans  =
 
  T  
assert_checkfalse(x<>1234567890)
 ans  =
 
  T  
//matrix case
assert_checktrue(and(y<>1234567890*ones(2,2)))
 ans  =
 
  T  
assert_checktrue(and((1234567890*ones(2,2))<>y))
 ans  =
 
  T  
assert_checkfalse(and((1234567890*ones(2,2))<>x))
 ans  =
 
  T  
assert_checkfalse(and(x<>(1234567890*ones(2,2))))
 ans  =
 
  T  
