//<-- JVM NOT MANDATORY -->
//=================================
 x=bigint('123456789') 
 x  =
 
 
 123456789   
 y=bigint('02345678') 
 y  =
 
 
 2345678   
 z=bigint('1234567890') 
 z  =
 
 
 1234567890   
 M=[x y; z x-z]
 M  =
 
 
!123456789   2345678      !
!                         !
!1234567890  -1111111101  !
 N=[x x; x x]
 N  =
 
 
!123456789  123456789  !
!                      !
!123456789  123456789  !
 assert_checkequal((M<N),[%F %T;%F %T])
 ans  =
 
  T  
 N=[y y; y y]
 N  =
 
 
!2345678  2345678  !
!                  !
!2345678  2345678  !
 assert_checkequal((M<N),[%F %F;%F %T])
 ans  =
 
  T  
 N=[z z; z z]
 N  =
 
 
!1234567890  1234567890  !
!                        !
!1234567890  1234567890  !
 assert_checkequal((M<N),[%T %T;%F %T])
 ans  =
 
  T  
 N=[x-z x-z; x-z x-z]
 N  =
 
 
!-1111111101  -1111111101  !
!                          !
!-1111111101  -1111111101  !
 assert_checkequal((M<N),[%F %F;%F %F])
 ans  =
 
  T  
// mixed bigint / mbigint
 assert_checkequal((M<x),[%F %T;%F %T])
 ans  =
 
  T  
 assert_checkequal((M<y),[%F %F;%F %T])
 ans  =
 
  T  
 assert_checkequal((M<z),[%T %T;%F %T])
 ans  =
 
  T  
 assert_checkequal((M<x-z),[%F %F;%F %F])
 ans  =
 
  T  
 assert_checkequal((x<M),[%f %f;%t %f])
 ans  =
 
  T  
 assert_checkequal((y<M),[%t %f;%t %f])
 ans  =
 
  T  
 assert_checkequal((z<M),[%f %f;%f %f])
 ans  =
 
  T  
 assert_checkequal((x-z<M),[%t %t;%t %f])
 ans  =
 
  T  
// mixed bigint / double expressions
 assert_checkequal((M<123456789),[%F %T;%F %T])
 ans  =
 
  T  
 assert_checkequal((M<02345678),[%F %F;%F %T])
 ans  =
 
  T  
 assert_checkequal((M<1234567890),[%T %T;%F %T])
 ans  =
 
  T  
 assert_checkequal((M<-1111111101),[%F %F;%F %F])
 ans  =
 
  T  
 assert_checkequal((123456789<M),[%f %f;%t %f])
 ans  =
 
  T  
 assert_checkequal((02345678<M),[%t %f;%t %f])
 ans  =
 
  T  
 assert_checkequal((1234567890<M),[%f %f;%f %f])
 ans  =
 
  T  
 assert_checkequal((-1111111101<M),[%t %t;%t %f])
 ans  =
 
  T  
