//<-- JVM NOT MANDATORY -->
//=================================
x=123456789
 x  =
 
    1.235D+08  
xx=bigint(x)
 xx  =
 
 
 123456789   
y=987654321
 y  =
 
    9.877D+08  
yy=bigint(y)
 yy  =
 
 
 987654321   
M=[y x; -x -y]
 M  =
 
 10^8 *
 
    9.8765432    1.2345679  
  - 1.2345679  - 9.8765432  
MM=mbigint(M)
 MM  =
 
 
!987654321   123456789   !
!                        !
!-123456789  -987654321  !
N=[x x 1 0]
 N  =
 
    1.235D+08    1.235D+08    1.    0.  
NN=mbigint(N)
 NN  =
 
 
!123456789  123456789  1  0  !
assert_checkequal(mbigint(floor(x\M)),xx\MM)
 ans  =
 
  T  
assert_checkequal(mbigint(floor(x\N)),xx\NN)
 ans  =
 
  T  
//overloading compatibility
assert_checkequal(mbigint(floor(x\M)),x\MM)
 ans  =
 
  T  
assert_checkequal(mbigint(floor(x\N)),x\NN)
 ans  =
 
  T  
//overloading compatibility
assert_checkequal(mbigint(floor(x\M)),xx\M)
 ans  =
 
  T  
assert_checkequal(mbigint(floor(x\N)),xx\N)
 ans  =
 
  T  
