//<-- JVM NOT MANDATORY -->
//=================================
// tests with bigint
a=bigint(2)
 a  =
 
 
 2   
e=bigint(100) 
 e  =
 
 
 100   
n=bigint('100000000')
 n  =
 
 
 100000000   
r=powermod(a,e,n)
 r  =
 
 
 3205376   
b=a^e
 b  =
 
 
 1267650600228229401496703205376   
[q,rr]=divide(b,n)
 rr  =
 
 
 3205376   
 q  =
 
 
 12676506002282294014967   
assert_checktrue(r==rr)
 ans  =
 
  T  
// tests mixed double/bigint
a=2
 a  =
 
    2.  
e=bigint(100) 
 e  =
 
 
 100   
n=bigint(100000000)
 n  =
 
 
 100000000   
r=powermod(a,e,n)
 r  =
 
 
 3205376   
[q,rr]=divide(a^e,n)
 rr  =
 
 
 3205376   
 q  =
 
 
 12676506002282294014967   
assert_checktrue(r==rr)
 ans  =
 
  T  
//
a=bigint(2)
 a  =
 
 
 2   
e=100
 e  =
 
    100.  
n=bigint(100000000)
 n  =
 
 
 100000000   
r=powermod(a,e,n)
 r  =
 
 
 3205376   
[q,rr]=divide(a^e,n)
 rr  =
 
 
 3205376   
 q  =
 
 
 12676506002282294014967   
assert_checktrue(r==rr)
 ans  =
 
  T  
//
a=bigint(2)
 a  =
 
 
 2   
e=bigint(100) 
 e  =
 
 
 100   
n=100000000
 n  =
 
    1.000D+08  
r=powermod(a,e,n)
 r  =
 
 
 3205376   
[q,rr]=divide(a^e,n)
 rr  =
 
 
 3205376   
 q  =
 
 
 12676506002282294014967   
assert_checktrue(r==rr)
 ans  =
 
  T  
