//<-- JVM NOT MANDATORY -->
//=================================
 x=bigint('123456789') 
 x  =
 
 
 123456789   
 y=bigint('02345678') 
 y  =
 
 
 2345678   
 z=bigint('1234567890') 
 z  =
 
 
 1234567890   
 M=[x y; z x-z]
 M  =
 
 
!123456789   2345678      !
!                         !
!1234567890  -1111111101  !
 N=[x x; x x]
 N  =
 
 
!123456789  123456789  !
!                      !
!123456789  123456789  !
 assert_checkequal((M==N),[%T %F;%F %F])
 ans  =
 
  T  
 N=[y y; y y]
 N  =
 
 
!2345678  2345678  !
!                  !
!2345678  2345678  !
 assert_checkequal((M==N),[%F %T;%F %F])
 ans  =
 
  T  
 N=[z z; z z]
 N  =
 
 
!1234567890  1234567890  !
!                        !
!1234567890  1234567890  !
 assert_checkequal((M==N),[%F %F;%T %F])
 ans  =
 
  T  
 N=[x-z x-z; x-z x-z]
 N  =
 
 
!-1111111101  -1111111101  !
!                          !
!-1111111101  -1111111101  !
 assert_checkequal((M==N),[%F %F;%F %T])
 ans  =
 
  T  
// mixed bigint / mbigint
 assert_checkequal((M==x),[%T %F;%F %F])
 ans  =
 
  T  
 assert_checkequal((M==y),[%F %T;%F %F])
 ans  =
 
  T  
 assert_checkequal((M==z),[%F %F;%T %F])
 ans  =
 
  T  
 assert_checkequal((M==x-z),[%F %F;%F %T])
 ans  =
 
  T  
 assert_checkequal((x==M),[%T %F;%F %F])
 ans  =
 
  T  
 assert_checkequal((y==M),[%F %T;%F %F])
 ans  =
 
  T  
 assert_checkequal((z==M),[%F %F;%T %F])
 ans  =
 
  T  
 assert_checkequal((x-z==M),[%F %F;%F %T])
 ans  =
 
  T  
// mixed bigint / double expressions
 assert_checkequal((M==123456789),[%T %F;%F %F])
 ans  =
 
  T  
 assert_checkequal((M==02345678),[%F %T;%F %F])
 ans  =
 
  T  
 assert_checkequal((M==1234567890),[%F %F;%T %F])
 ans  =
 
  T  
 assert_checkequal((M==-1111111101),[%F %F;%F %T])
 ans  =
 
  T  
 assert_checkequal((123456789==M),[%T %F;%F %F])
 ans  =
 
  T  
 assert_checkequal((02345678==M),[%F %T;%F %F])
 ans  =
 
  T  
 assert_checkequal((1234567890==M),[%F %F;%T %F])
 ans  =
 
  T  
 assert_checkequal((-1111111101==M),[%F %F;%F %T])
 ans  =
 
  T  
