//<-- JVM NOT MANDATORY -->
//=================================
x=mlist(['bigint' 'signe' 'rep'], 1,[3456789;12]);
x=check_bigint(x) // OK
 x  =
 
 
 123456789   
x=bigint('-1234567890')
 x  =
 
 
 -1234567890   
x=check_bigint(x) // OK
 x  =
 
 
 -1234567890   
x=bigint('0')
 x  =
 
 
 0   
x.signe=-1
 x  =
 
 
 -0   
x=check_bigint(x) // change signe to +
 x  =
 
 
 0   
assert_checkequal(x.signe,1)
 ans  =
 
  T  
//check errors
x=mlist(['blop' 'signe' 'rep'], 1,[3456789;12]);
assert_checkerror("x=check_bigint(x)","not bigint structure")
 ans  =
 
  T  
// signe
x=bigint('-1234567890')
 x  =
 
 
 -1234567890   
x.signe=%pi
 x  =
 
 
 1234567890   
 assert_checkerror("x=check_bigint(x)","bigint signe field should be +1 or -1")
 ans  =
 
  T  
//
x=bigint('-1234567890')
 x  =
 
 
 -1234567890   
x.rep=poly(0,'x')
 x  =
 
 
!-    !
!     !
!-1x  !
 assert_checkerror("x=check_bigint(x)","bigint rep should be a vector of 7 digits positives integers")
 ans  =
 
  T  
 //
 x=bigint('-1234567890')
 x  =
 
 
 -1234567890   
x.rep=1234567890
 x  =
 
 
 -1.235D+09   
 assert_checkerror("x=check_bigint(x)","bigint rep should be a vector of 7 digits positives integers")
 ans  =
 
  T  
