// =============================================================================
// Scilab ( http://www.scilab.org/ ) - This file is part of Scilab
// Copyright (C) 2009 - DIGITEO - Pierre MARECHAL <pierre.marechal@scilab.org>
//
//  This file is distributed under the same license as the Scilab package.
// =============================================================================
// <-- ATOMS MANDATORY -->
// <-- CLI SHELL MODE -->
this_toolbox_name = "toolbox_4";
atomsLoad(this_toolbox_name);
StartToolbox4
	Loadmacros
	Loadhelp

StartToolbox2
	Loadmacros
	Loadhelp

StartToolbox1
	Loadmacros
	Loadgateways
	Loadhelp

this_toolbox_path = atomsGetLoadedPath(this_toolbox_name);
t4_common         = pathconvert(this_toolbox_path+"/tests/unit_tests/t4_common.txt",%F);
ref = [ "Toolbox 4 -> Function 3" ; "Toolbox 2 -> Function 3" ; "Toolbox 1 -> Function 3" ];
if or( t4_function3() <> ref ) then bugmes();quit;end
if isempty(fileinfo(t4_common)) then bugmes();quit;end
t4_common_mat = mgetl(t4_common);
if t4_function3()<>t4_common_mat(7:9) then bugmes();quit;end
