<?xml version="1.0" encoding="UTF-8" standalone="no"?>
<svg
   xmlns:dc="http://purl.org/dc/elements/1.1/"
   xmlns:cc="http://creativecommons.org/ns#"
   xmlns:rdf="http://www.w3.org/1999/02/22-rdf-syntax-ns#"
   xmlns:svg="http://www.w3.org/2000/svg"
   xmlns="http://www.w3.org/2000/svg"
   xmlns:xlink="http://www.w3.org/1999/xlink"
   xmlns:sodipodi="http://sodipodi.sourceforge.net/DTD/sodipodi-0.dtd"
   xmlns:inkscape="http://www.inkscape.org/namespaces/inkscape"
   width="40px"
   height="40px"
   viewBox="0 0 40 40"
   style="stroke:none"
   id="svg2"
   version="1.1"
   inkscape:version="0.48.4 r9939"
   sodipodi:docname="TIMEZONE_CONVERSION.svg">
  <metadata
     id="metadata72">
    <rdf:RDF>
      <cc:Work
         rdf:about="">
        <dc:format>image/svg+xml</dc:format>
        <dc:type
           rdf:resource="http://purl.org/dc/dcmitype/StillImage" />
        <dc:title>Graphic window number 0</dc:title>
      </cc:Work>
    </rdf:RDF>
  </metadata>
  <sodipodi:namedview
     pagecolor="#ffffff"
     bordercolor="#666666"
     borderopacity="1"
     objecttolerance="10"
     gridtolerance="10"
     guidetolerance="10"
     inkscape:pageopacity="0"
     inkscape:pageshadow="2"
     inkscape:window-width="1400"
     inkscape:window-height="1001"
     id="namedview70"
     showgrid="false"
     inkscape:object-paths="true"
     inkscape:zoom="8"
     inkscape:cx="-10.437118"
     inkscape:cy="9.9679549"
     inkscape:window-x="0"
     inkscape:window-y="25"
     inkscape:window-maximized="1"
     inkscape:current-layer="g3124" />
  <title
     id="title4">Graphic window number 0</title>
  <desc
     id="desc6">
Creator: GL2PS 1.3.2, (C) 1999-2006 Christophe Geuzaine (geuz@geuz.org)
For: Scilab
CreationDate: Fri Jun  1 17:52:22 2012
</desc>
  <defs
     id="defs8">
    <inkscape:perspective
       sodipodi:type="inkscape:persp3d"
       inkscape:vp_x="-11.311475 : 25.901639 : 1"
       inkscape:vp_y="0 : 1000 : 0"
       inkscape:vp_z="40 : 20 : 1"
       inkscape:persp3d-origin="20 : 13.333333 : 1"
       id="perspective3867" />
    <linearGradient
       id="linearGradient3952">
      <stop
         style="stop-color:#00a400;stop-opacity:1;"
         offset="0"
         id="stop3954" />
      <stop
         style="stop-color:#00ff97;stop-opacity:1;"
         offset="1"
         id="stop3956" />
    </linearGradient>
    <radialGradient
       inkscape:collect="always"
       xlink:href="#linearGradient6339"
       id="radialGradient24412"
       gradientUnits="userSpaceOnUse"
       gradientTransform="matrix(1.454579,-0.103027,0.118439,1.802414,-328.325,-918.4274)"
       cx="406.20645"
       cy="1189.2123"
       fx="406.20645"
       fy="1189.2123"
       r="88.938736" />
    <linearGradient
       id="linearGradient6339">
      <stop
         style="stop-color:#6e9f4b;stop-opacity:1;"
         offset="0"
         id="stop6341" />
      <stop
         id="stop12671"
         offset="0.5"
         style="stop-color:#425f2d;stop-opacity:1;" />
      <stop
         id="stop6347"
         offset="1"
         style="stop-color:#2a3d1d;stop-opacity:1;" />
    </linearGradient>
    <radialGradient
       inkscape:collect="always"
       xlink:href="#linearGradient13206"
       id="radialGradient24414"
       gradientUnits="userSpaceOnUse"
       gradientTransform="matrix(1.150346,0,0,1.150346,-16.1173,-74.46758)"
       cx="107.20115"
       cy="495.30679"
       fx="107.20115"
       fy="495.30679"
       r="405.35715" />
    <linearGradient
       id="linearGradient13206">
      <stop
         id="stop13208"
         offset="0"
         style="stop-color:#f2c41f;stop-opacity:1;" />
      <stop
         id="stop2186"
         offset="1"
         style="stop-color:#b9380a;stop-opacity:1;" />
    </linearGradient>
    <radialGradient
       inkscape:collect="always"
       xlink:href="#linearGradient5142"
       id="radialGradient24416"
       gradientUnits="userSpaceOnUse"
       gradientTransform="matrix(2.971416,0.433793,-0.445445,3.041429,176.2001,-314.492)"
       cx="209.15753"
       cy="407.22339"
       fx="209.15753"
       fy="407.22339"
       r="55.703125" />
    <linearGradient
       id="linearGradient5142">
      <stop
         style="stop-color:#bfd1eb;stop-opacity:1;"
         offset="0"
         id="stop5144" />
      <stop
         id="stop5150"
         offset="0.61538464"
         style="stop-color:#315c9b;stop-opacity:1;" />
      <stop
         style="stop-color:#11233a;stop-opacity:1;"
         offset="1"
         id="stop5146" />
    </linearGradient>
    <radialGradient
       inkscape:collect="always"
       xlink:href="#linearGradient4437"
       id="radialGradient24418"
       gradientUnits="userSpaceOnUse"
       cx="136.1499"
       cy="504.90085"
       fx="136.1499"
       fy="504.90085"
       r="406.37308" />
    <linearGradient
       inkscape:collect="always"
       id="linearGradient4437">
      <stop
         style="stop-color:#ffffff;stop-opacity:0.85624999"
         offset="0"
         id="stop4439" />
      <stop
         style="stop-color:#ffffff;stop-opacity:0;"
         offset="1"
         id="stop4441" />
    </linearGradient>
    <linearGradient
       x1="48.90625"
       y1="17.376184"
       x2="50.988335"
       y2="22.250591"
       id="linearGradient2554"
       xlink:href="#linearGradient2966"
       gradientUnits="userSpaceOnUse"
       gradientTransform="translate(-5.669292,0)" />
    <linearGradient
       id="linearGradient2966">
      <stop
         id="stop2968"
         style="stop-color:#ffd1d1;stop-opacity:1"
         offset="0" />
      <stop
         id="stop3006"
         style="stop-color:#ff1d1d;stop-opacity:1"
         offset="0.5" />
      <stop
         id="stop2970"
         style="stop-color:#6f0000;stop-opacity:1"
         offset="1" />
    </linearGradient>
    <linearGradient
       x1="46"
       y1="19.8125"
       x2="47.6875"
       y2="22.625"
       id="linearGradient2556"
       xlink:href="#linearGradient2974"
       gradientUnits="userSpaceOnUse"
       gradientTransform="translate(-5.669292,0)" />
    <linearGradient
       id="linearGradient2974">
      <stop
         id="stop2976"
         style="stop-color:#c1c1c1;stop-opacity:1"
         offset="0" />
      <stop
         id="stop2978"
         style="stop-color:#acacac;stop-opacity:1"
         offset="1" />
    </linearGradient>
    <radialGradient
       cx="29.053354"
       cy="27.640751"
       r="3.2408545"
       fx="29.053354"
       fy="27.640751"
       id="radialGradient2558"
       xlink:href="#linearGradient2984"
       gradientUnits="userSpaceOnUse"
       gradientTransform="matrix(2.923565,0,0,2.029717,-61.55532,-27.88417)" />
    <linearGradient
       id="linearGradient2984">
      <stop
         id="stop2986"
         style="stop-color:#e7e2b8;stop-opacity:1"
         offset="0" />
      <stop
         id="stop2988"
         style="stop-color:#e7e2b8;stop-opacity:0"
         offset="1" />
    </linearGradient>
    <linearGradient
       x1="25.71875"
       y1="31.046875"
       x2="25.514589"
       y2="30.703125"
       id="linearGradient2560"
       xlink:href="#linearGradient2994"
       gradientUnits="userSpaceOnUse"
       gradientTransform="translate(-5.825542,0.125)" />
    <linearGradient
       id="linearGradient2994">
      <stop
         id="stop2996"
         style="stop-color:#000000;stop-opacity:1"
         offset="0" />
      <stop
         id="stop2998"
         style="stop-color:#c9c9c9;stop-opacity:1"
         offset="1" />
    </linearGradient>
    <marker
       style="overflow:visible"
       id="TriangleOutS-0"
       refX="0"
       refY="0"
       orient="auto"
       inkscape:stockid="TriangleOutS">
      <path
         transform="scale(0.2,0.2)"
         style="fill-rule:evenodd;stroke:#000000;stroke-width:1pt;marker-start:none"
         d="m 5.77,0 -8.65,5 0,-10 8.65,5 z"
         id="path3754-9" />
    </marker>
    <inkscape:perspective
       sodipodi:type="inkscape:persp3d"
       inkscape:vp_x="0 : 0.5 : 1"
       inkscape:vp_y="0 : 1000 : 0"
       inkscape:vp_z="1 : 0.5 : 1"
       inkscape:persp3d-origin="0.5 : 0.33333333 : 1"
       id="perspective4628" />
    <inkscape:perspective
       id="perspective20"
       inkscape:persp3d-origin="376.56 : 223.84001 : 1"
       inkscape:vp_z="753.12 : 335.76001 : 1"
       inkscape:vp_y="0 : 1000 : 0"
       inkscape:vp_x="0 : 335.76001 : 1"
       sodipodi:type="inkscape:persp3d" />
    <marker
       style="overflow:visible;"
       id="Arrow2Lend"
       refX="0.0"
       refY="0.0"
       orient="auto"
       inkscape:stockid="Arrow2Lend">
      <path
         transform="scale(1.1) rotate(180) translate(1,0)"
         d="M 8.7185878,4.0337352 L -2.2072895,0.016013256 L 8.7185884,-4.0017078 C 6.9730900,-1.6296469 6.9831476,1.6157441 8.7185878,4.0337352 z "
         style="font-size:12.0;fill-rule:evenodd;stroke-width:0.62500000;stroke-linejoin:round;"
         id="path3626" />
    </marker>
    <marker
       style="overflow:visible"
       id="TriangleOutL"
       refX="0.0"
       refY="0.0"
       orient="auto"
       inkscape:stockid="TriangleOutL">
      <path
         transform="scale(0.8)"
         style="fill-rule:evenodd;stroke:#000000;stroke-width:1.0pt;marker-start:none"
         d="M 5.77,0.0 L -2.88,5.0 L -2.88,-5.0 L 5.77,0.0 z "
         id="path3748" />
    </marker>
    <marker
       style="overflow:visible"
       id="TriangleOutM"
       refX="0.0"
       refY="0.0"
       orient="auto"
       inkscape:stockid="TriangleOutM">
      <path
         transform="scale(0.4)"
         style="fill-rule:evenodd;stroke:#000000;stroke-width:1.0pt;marker-start:none"
         d="M 5.77,0.0 L -2.88,5.0 L -2.88,-5.0 L 5.77,0.0 z "
         id="path3751" />
    </marker>
    <marker
       style="overflow:visible"
       id="TriangleOutS"
       refX="0.0"
       refY="0.0"
       orient="auto"
       inkscape:stockid="TriangleOutS">
      <path
         transform="scale(0.2)"
         style="fill-rule:evenodd;stroke:#000000;stroke-width:1.0pt;marker-start:none"
         d="M 5.77,0.0 L -2.88,5.0 L -2.88,-5.0 L 5.77,0.0 z "
         id="path3754" />
    </marker>
    <marker
       style="overflow:visible"
       id="TriangleOutS-8"
       refX="0"
       refY="0"
       orient="auto"
       inkscape:stockid="TriangleOutS">
      <path
         inkscape:connector-curvature="0"
         transform="scale(0.2,0.2)"
         style="fill-rule:evenodd;stroke:#000000;stroke-width:1pt;marker-start:none"
         d="m 5.77,0 -8.65,5 0,-10 8.65,5 z"
         id="path3754-3" />
    </marker>
    <marker
       style="overflow:visible"
       id="marker3957"
       refX="0"
       refY="0"
       orient="auto"
       inkscape:stockid="TriangleOutS">
      <path
         inkscape:connector-curvature="0"
         transform="scale(0.2,0.2)"
         style="fill-rule:evenodd;stroke:#000000;stroke-width:1pt;marker-start:none"
         d="m 5.77,0 -8.65,5 0,-10 8.65,5 z"
         id="path3959" />
    </marker>
    <marker
       style="overflow:visible"
       id="TriangleOutS-6"
       refX="0"
       refY="0"
       orient="auto"
       inkscape:stockid="TriangleOutS">
      <path
         inkscape:connector-curvature="0"
         transform="scale(0.2,0.2)"
         style="fill-rule:evenodd;stroke:#000000;stroke-width:1pt;marker-start:none"
         d="m 5.77,0 -8.65,5 0,-10 8.65,5 z"
         id="path3754-7" />
    </marker>
    <marker
       style="overflow:visible"
       id="TriangleOutS-2"
       refX="0"
       refY="0"
       orient="auto"
       inkscape:stockid="TriangleOutS">
      <path
         inkscape:connector-curvature="0"
         transform="scale(0.2,0.2)"
         style="fill-rule:evenodd;stroke:#000000;stroke-width:1pt;marker-start:none"
         d="m 5.77,0 -8.65,5 0,-10 8.65,5 z"
         id="path3754-38" />
    </marker>
    <marker
       style="overflow:visible"
       id="TriangleOutS-23"
       refX="0"
       refY="0"
       orient="auto"
       inkscape:stockid="TriangleOutS">
      <path
         inkscape:connector-curvature="0"
         transform="scale(0.2,0.2)"
         style="fill-rule:evenodd;stroke:#000000;stroke-width:1pt;marker-start:none"
         d="m 5.77,0 -8.65,5 0,-10 8.65,5 z"
         id="path3754-2" />
    </marker>
    <marker
       orient="auto"
       markerHeight="3"
       markerWidth="4"
       markerUnits="strokeWidth"
       refY="5"
       refX="10"
       viewBox="0 0 10 10"
       id="ArrowStart">
      <path
         id="path10"
         d="M 10,0 L 0,5 L 10,10 L 10,0 z" />
    </marker>
    <marker
       orient="auto"
       markerHeight="3"
       markerWidth="4"
       markerUnits="strokeWidth"
       refY="5"
       refX="0"
       viewBox="0 0 10 10"
       id="ArrowEnd">
      <path
         id="path7"
         d="M 0,0 L 10,5 L 0,10 L 0,0 z" />
    </marker>
    <inkscape:perspective
       id="perspective29"
       inkscape:persp3d-origin="400 : 245.56767 : 1"
       inkscape:vp_z="800 : 368.3515 : 1"
       inkscape:vp_y="0 : 1000 : 0"
       inkscape:vp_x="0 : 368.3515 : 1"
       sodipodi:type="inkscape:persp3d" />
    <linearGradient
       id="Grad1"
       x1="41.1948738"
       y1="616.477173"
       x2="118.931351"
       y2="527.555115"
       gradientUnits="userSpaceOnUse"
       gradientTransform="matrix(4.556763,0,0,-4.315033,37.49756,2758.519)">
      <stop
         offset="0"
         id="stop2909"
         style="stop-color:#ff801f;stop-opacity:1;" />
      <stop
         offset="1"
         id="stop2911"
         style="stop-color:#ffd03f;stop-opacity:1;" />
    </linearGradient>
    <linearGradient
       id="Grad2"
       x1="530.809509"
       y1="486.631012"
       x2="174.805481"
       y2="211.22995"
       gradientUnits="userSpaceOnUse"
       gradientTransform="matrix(0.960006,0,0,0.960006,11.68071,9.787565)">
      <stop
         offset="0"
         id="stop2914"
         style="stop-color:#d88500;stop-opacity:1;" />
      <stop
         offset="1"
         id="stop2916"
         style="stop-color:#fc3;stop-opacity:1;" />
    </linearGradient>
    <linearGradient
       id="Grad3"
       x1="187.873566"
       y1="224.598923"
       x2="581.837463"
       y2="483.100006"
       gradientUnits="userSpaceOnUse"
       gradientTransform="matrix(0.960006,0,0,0.960006,11.68071,9.787558)">
      <stop
         offset="0"
         id="stop2919"
         style="stop-color:#ffd657;stop-opacity:1;" />
      <stop
         offset="1"
         id="stop2921"
         style="stop-color:#f2b600;stop-opacity:1;" />
    </linearGradient>
    <linearGradient
       id="Grad4"
       x1="250.398453"
       y1="101.536331"
       x2="412.094299"
       y2="264.54187"
       gradientUnits="userSpaceOnUse"
       gradientTransform="matrix(0.960006,0,0,0.960006,11.68071,9.787565)">
      <stop
         offset="0"
         id="stop2924"
         style="stop-color:#fff1c5;stop-opacity:1;" />
      <stop
         offset="1"
         id="stop2926"
         style="stop-color:#fc3;stop-opacity:1;" />
    </linearGradient>
    <radialGradient
       id="Grad5"
       cx="295.471252"
       cy="186.096344"
       r="179.550003"
       gradientUnits="userSpaceOnUse"
       gradientTransform="matrix(1.14292e-8,1.531256,-0.876504,-2.165967e-5,462.7486,-245.0023)">
      <stop
         offset="0"
         stop-color="#ffffff"
         id="stop2929" />
      <stop
         offset="0.5"
         stop-color="#ffffff"
         id="stop2931" />
      <stop
         offset="1"
         stop-color="#d5d5d5"
         id="stop2933" />
    </radialGradient>
    <radialGradient
       xlink:href="#L0"
       r="103.66492"
       fy="364.19265"
       fx="244.76437"
       cy="364.19265"
       cx="244.76437"
       id="R0"
       gradientTransform="scale(0.99984473,1.0001553)"
       gradientUnits="userSpaceOnUse" />
    <linearGradient
       y2=".5"
       y1=".5"
       xlink:href="#L0"
       x2="1"
       x1="-2.9137933e-19"
       id="L4" />
    <linearGradient
       y2="850.52934"
       y1="987.17002"
       x2="106.81163"
       x1="104.63348"
       id="L3"
       gradientTransform="scale(0.97710312,1.0234334)"
       gradientUnits="userSpaceOnUse">
      <stop
         id="stop2276"
         style="stop-color:#fff;stop-opacity:0" />
      <stop
         id="stop2278"
         style="stop-color:#fff;stop-opacity:.85000002"
         offset="1" />
    </linearGradient>
    <linearGradient
       y2="260.52774"
       y1="402.1545"
       x2="243.32458"
       x1="243.32458"
       id="L2"
       gradientTransform="scale(0.99984473,1.0001553)"
       gradientUnits="userSpaceOnUse">
      <stop
         id="stop2271"
         style="stop-color:#fff;stop-opacity:0" />
      <stop
         id="stop2273"
         style="stop-color:#fff;stop-opacity:.57254905"
         offset="1" />
    </linearGradient>
    <linearGradient
       y2="469.55243"
       y1="307.82748"
       x2="260.54815"
       x1="259.40082"
       id="L1"
       gradientTransform="scale(0.99992221,1.0000778)"
       gradientUnits="userSpaceOnUse">
      <stop
         id="stop2266"
         style="stop-color:#ddd" />
      <stop
         id="stop2268"
         style="stop-color:#f5f5f5"
         offset="1" />
    </linearGradient>
    <linearGradient
       id="L0">
      <stop
         id="stop2259"
         style="stop-color:#000" />
      <stop
         id="stop2261"
         style="stop-color:#000;stop-opacity:.76612902"
         offset=".87947369" />
      <stop
         id="stop2263"
         style="stop-color:#000;stop-opacity:0"
         offset="1" />
    </linearGradient>
    <linearGradient
       inkscape:collect="always"
       xlink:href="#L3"
       id="linearGradient3188"
       gradientUnits="userSpaceOnUse"
       gradientTransform="matrix(0.2980662,0,0,0.29292807,-58.937806,-245.09425)"
       x1="104.63348"
       y1="987.17002"
       x2="106.81163"
       y2="850.52934" />
    <linearGradient
       inkscape:collect="always"
       xlink:href="#L1"
       id="linearGradient3191"
       gradientUnits="userSpaceOnUse"
       gradientTransform="matrix(0.31610017,0,0,0.31614935,-109.55448,-95.28573)"
       x1="259.40082"
       y1="307.82748"
       x2="260.54815"
       y2="469.55243" />
    <linearGradient
       inkscape:collect="always"
       xlink:href="#L2"
       id="linearGradient3195"
       gradientUnits="userSpaceOnUse"
       gradientTransform="matrix(0.29615564,0.00456784,0,0.30651727,-98.486354,-85.50856)"
       x1="243.32458"
       y1="402.1545"
       x2="243.32458"
       y2="260.52774" />
    <radialGradient
       inkscape:collect="always"
       xlink:href="#L0"
       id="radialGradient3199"
       gradientUnits="userSpaceOnUse"
       gradientTransform="matrix(0.31607568,0,0,0.31617385,-102.31494,-86.242349)"
       cx="244.76437"
       cy="364.19265"
       fx="244.76437"
       fy="364.19265"
       r="103.66492" />
    <linearGradient
       inkscape:collect="always"
       xlink:href="#L1"
       id="linearGradient3119"
       gradientUnits="userSpaceOnUse"
       gradientTransform="matrix(0.27378527,0,0,0.27382787,-34.872215,-70.361452)"
       x1="259.40082"
       y1="307.82748"
       x2="260.54815"
       y2="469.55243" />
    <linearGradient
       inkscape:collect="always"
       xlink:href="#L2"
       id="linearGradient3123"
       gradientUnits="userSpaceOnUse"
       gradientTransform="matrix(0.25651062,0.00395636,0,0.26548519,-25.285729,-61.893108)"
       x1="243.32458"
       y1="402.1545"
       x2="243.32458"
       y2="260.52774" />
    <linearGradient
       inkscape:collect="always"
       xlink:href="#Grad1"
       id="linearGradient5071"
       x1="35.88686"
       y1="50.560215"
       x2="47.105316"
       y2="50.560215"
       gradientUnits="userSpaceOnUse"
       gradientTransform="matrix(1.108978,0,0,1.108978,-5.1334414,-6.1221003)" />
    <linearGradient
       inkscape:collect="always"
       xlink:href="#Grad1"
       id="linearGradient5081"
       x1="37.268982"
       y1="57.705166"
       x2="45.142925"
       y2="57.705166"
       gradientUnits="userSpaceOnUse"
       gradientTransform="matrix(1.2830355,0,0,1.2830355,-20.679759,1.8873362)" />
    <linearGradient
       inkscape:collect="always"
       xlink:href="#Grad1"
       id="linearGradient5671"
       x1="48.938404"
       y1="51.757633"
       x2="66.094109"
       y2="51.757633"
       gradientUnits="userSpaceOnUse"
       spreadMethod="pad" />
  </defs>
  <g
     id="g3124"
     transform="matrix(0.6125941,0,0,0.6125941,-2.4808071,-2.1076566)">
    <path
       inkscape:connector-curvature="0"
       d="m 68.917161,36.215851 a 31.947578,31.947578 0 1 0 -63.8951544,0 31.947578,31.947578 0 1 0 63.8951544,0 z"
       id="path2283"
       style="fill:#cccccc" />
    <path
       inkscape:connector-curvature="0"
       d="m 64.174028,38.787216 a 27.215151,29.447289 0 1 0 -54.4303027,0 27.215151,29.447289 0 0 0 54.4303027,0 z"
       id="path2286"
       style="fill:#cccccc" />
    <path
       style="fill:#ececec;fill-opacity:1"
       inkscape:connector-curvature="0"
       id="P2"
       d="m 62.447309,35.987819 a 25.460125,25.460125 0 1 0 -50.920249,0 25.460125,25.460125 0 1 0 50.920249,0 z" />
    <g
       transform="matrix(0.30822907,0,0,0.30822907,4.6813324,-256.21454)"
       id="g2290">
      <path
         style="fill:none;stroke:#000000;stroke-width:3.75"
         inkscape:connector-curvature="0"
         id="P4"
         d="M 110.59018,958.15572 79.870691,910.36983" />
      <path
         style="fill:none;stroke:#000000;stroke-width:3.45385337"
         inkscape:connector-curvature="0"
         id="P5"
         d="M 98.933011,958.94485 135.90047,891.8317" />
      <path
         style="fill:none;stroke:#ff0000;stroke-width:1.875"
         inkscape:connector-curvature="0"
         id="P6"
         d="m 91.475836,950.64651 79.870694,-8.19186" />
    </g>
    <rect
       height="2.7927358"
       width="1.1629738"
       x="36.422829"
       y="12.351496"
       id="rect2295" />
    <rect
       height="2.7927358"
       transform="matrix(0,1,-1,0,0,0)"
       width="1.1629738"
       x="35.284603"
       y="-16.423479"
       id="rect2299" />
    <rect
       height="2.7927358"
       transform="matrix(0,1,-1,0,0,0)"
       width="1.1629738"
       x="35.284603"
       y="-60.306309"
       id="rect2301" />
    <text
       xml:space="preserve"
       style="font-size:21.22122955000000033px;font-style:normal;font-weight:normal;line-height:125%;letter-spacing:0px;word-spacing:0px;fill:url(#linearGradient5671);fill-opacity:1;stroke:#9f3e00;font-family:Sans;-inkscape-font-specification:Sans Bold;stroke-opacity:1;stroke-width:1.00066258999999991;stroke-miterlimit:4;stroke-dasharray:none;fill-rule:nonzero"
       x="46.971001"
       y="62.919823"
       id="text3225"
       sodipodi:linespacing="125%"><tspan
         sodipodi:role="line"
         id="tspan3227"
         x="46.971001"
         y="62.919823"
         style="font-size:29.38324164999999866px;font-style:normal;font-weight:bold;fill:url(#linearGradient5671);-inkscape-font-specification:Sans Bold;fill-opacity:1;stroke:#9f3e00;stroke-opacity:1;stroke-width:1.00066258999999991;stroke-miterlimit:4;stroke-dasharray:none;fill-rule:nonzero">h</tspan></text>
    <text
       xml:space="preserve"
       style="font-size:72.41192626999999504px;font-style:normal;font-weight:normal;line-height:125%;letter-spacing:0px;word-spacing:0px;fill:url(#linearGradient5071);fill-opacity:1;stroke:#9f3e00;stroke-width:1.10897790999999990;font-family:Sans;stroke-opacity:1"
       x="33.300648"
       y="55.622925"
       id="text3561"
       sodipodi:linespacing="125%"
       inkscape:transform-center-x="-0.69311214"><tspan
         sodipodi:role="line"
         id="tspan3563"
         x="33.300648"
         y="55.622925"
         style="font-size:18.10298157000000074px;font-weight:bold;fill:url(#linearGradient5071);fill-opacity:1;stroke:#9f3e00;stroke-width:1.10897790999999990;-inkscape-font-specification:Sans Bold;stroke-opacity:1">+</tspan></text>
    <text
       xml:space="preserve"
       style="font-size:83.77720641999999884px;font-style:normal;font-weight:normal;line-height:125%;letter-spacing:0px;word-spacing:0px;fill:url(#linearGradient5081);fill-opacity:1;stroke:#9f3e00;stroke-width:1.28303564000000003;font-family:Sans;stroke-opacity:1"
       x="26.142916"
       y="85.104591"
       id="text3565"
       sodipodi:linespacing="125%"
       transform="scale(1.2748824,0.78438608)"><tspan
         sodipodi:role="line"
         id="tspan3567"
         x="26.142916"
         y="85.104591"
         style="font-size:33.51088332999999864px;fill:url(#linearGradient5081);fill-opacity:1;stroke:#9f3e00;stroke-width:1.28303564000000003;stroke-opacity:1">-</tspan></text>
  </g>
  <style
     id="style2252"
     type="text/css">
#P0 {fill:url(#R0)}
#P1 {fill:url(#L2);stroke-width:1.2535489}
#P2 {fill:url(#L1)}
#P3 {fill:url(#L3)}
#P4,#P5,#P6 {fill:none;fill-opacity:.75}
#P2,#P4 {stroke-width:3.75}
#P4,#P5 {stroke:#000}
#P5 {stroke-width:3.4538534}
#P6 {stroke:#f00;stroke-width:1.875}
</style>
</svg>
