<?xml version="1.0" encoding="UTF-8" standalone="no"?>
<svg
   xmlns:dc="http://purl.org/dc/elements/1.1/"
   xmlns:cc="http://creativecommons.org/ns#"
   xmlns:rdf="http://www.w3.org/1999/02/22-rdf-syntax-ns#"
   xmlns:svg="http://www.w3.org/2000/svg"
   xmlns="http://www.w3.org/2000/svg"
   xmlns:xlink="http://www.w3.org/1999/xlink"
   xmlns:sodipodi="http://sodipodi.sourceforge.net/DTD/sodipodi-0.dtd"
   xmlns:inkscape="http://www.inkscape.org/namespaces/inkscape"
   width="40px"
   height="40px"
   viewBox="0 0 40 40"
   style="stroke:none"
   id="svg2"
   version="1.1"
   inkscape:version="0.48.4 r9939"
   sodipodi:docname="ECLIPSE_MODEL.svg">
  <metadata
     id="metadata72">
    <rdf:RDF>
      <cc:Work
         rdf:about="">
        <dc:format>image/svg+xml</dc:format>
        <dc:type
           rdf:resource="http://purl.org/dc/dcmitype/StillImage" />
        <dc:title>Graphic window number 0</dc:title>
      </cc:Work>
    </rdf:RDF>
  </metadata>
  <sodipodi:namedview
     pagecolor="#ffffff"
     bordercolor="#666666"
     borderopacity="1"
     objecttolerance="10"
     gridtolerance="10"
     guidetolerance="10"
     inkscape:pageopacity="0"
     inkscape:pageshadow="2"
     inkscape:window-width="1400"
     inkscape:window-height="991"
     id="namedview70"
     showgrid="false"
     inkscape:object-paths="true"
     inkscape:zoom="12.676819"
     inkscape:cx="21.030568"
     inkscape:cy="21.13889"
     inkscape:window-x="0"
     inkscape:window-y="27"
     inkscape:window-maximized="1"
     inkscape:current-layer="g3124" />
  <title
     id="title4">Graphic window number 0</title>
  <desc
     id="desc6">
Creator: GL2PS 1.3.2, (C) 1999-2006 Christophe Geuzaine (geuz@geuz.org)
For: Scilab
CreationDate: Fri Jun  1 17:52:22 2012
</desc>
  <defs
     id="defs8">
    <inkscape:perspective
       sodipodi:type="inkscape:persp3d"
       inkscape:vp_x="-11.311475 : 25.901639 : 1"
       inkscape:vp_y="0 : 1000 : 0"
       inkscape:vp_z="40 : 20 : 1"
       inkscape:persp3d-origin="20 : 13.333333 : 1"
       id="perspective3867" />
    <linearGradient
       id="linearGradient3952">
      <stop
         style="stop-color:#00a400;stop-opacity:1;"
         offset="0"
         id="stop3954" />
      <stop
         style="stop-color:#00ff97;stop-opacity:1;"
         offset="1"
         id="stop3956" />
    </linearGradient>
    <radialGradient
       inkscape:collect="always"
       xlink:href="#linearGradient6339"
       id="radialGradient24412"
       gradientUnits="userSpaceOnUse"
       gradientTransform="matrix(1.454579,-0.103027,0.118439,1.802414,-328.325,-918.4274)"
       cx="406.20645"
       cy="1189.2123"
       fx="406.20645"
       fy="1189.2123"
       r="88.938736" />
    <linearGradient
       id="linearGradient6339">
      <stop
         style="stop-color:#6e9f4b;stop-opacity:1;"
         offset="0"
         id="stop6341" />
      <stop
         id="stop12671"
         offset="0.5"
         style="stop-color:#425f2d;stop-opacity:1;" />
      <stop
         id="stop6347"
         offset="1"
         style="stop-color:#2a3d1d;stop-opacity:1;" />
    </linearGradient>
    <radialGradient
       inkscape:collect="always"
       xlink:href="#linearGradient13206"
       id="radialGradient24414"
       gradientUnits="userSpaceOnUse"
       gradientTransform="matrix(1.150346,0,0,1.150346,-16.1173,-74.46758)"
       cx="107.20115"
       cy="495.30679"
       fx="107.20115"
       fy="495.30679"
       r="405.35715" />
    <linearGradient
       id="linearGradient13206">
      <stop
         id="stop13208"
         offset="0"
         style="stop-color:#f2c41f;stop-opacity:1;" />
      <stop
         id="stop2186"
         offset="1"
         style="stop-color:#b9380a;stop-opacity:1;" />
    </linearGradient>
    <radialGradient
       inkscape:collect="always"
       xlink:href="#linearGradient5142"
       id="radialGradient24416"
       gradientUnits="userSpaceOnUse"
       gradientTransform="matrix(2.971416,0.433793,-0.445445,3.041429,176.2001,-314.492)"
       cx="209.15753"
       cy="407.22339"
       fx="209.15753"
       fy="407.22339"
       r="55.703125" />
    <linearGradient
       id="linearGradient5142">
      <stop
         style="stop-color:#bfd1eb;stop-opacity:1;"
         offset="0"
         id="stop5144" />
      <stop
         id="stop5150"
         offset="0.61538464"
         style="stop-color:#315c9b;stop-opacity:1;" />
      <stop
         style="stop-color:#11233a;stop-opacity:1;"
         offset="1"
         id="stop5146" />
    </linearGradient>
    <radialGradient
       inkscape:collect="always"
       xlink:href="#linearGradient4437"
       id="radialGradient24418"
       gradientUnits="userSpaceOnUse"
       cx="136.1499"
       cy="504.90085"
       fx="136.1499"
       fy="504.90085"
       r="406.37308" />
    <linearGradient
       inkscape:collect="always"
       id="linearGradient4437">
      <stop
         style="stop-color:#ffffff;stop-opacity:0.85624999"
         offset="0"
         id="stop4439" />
      <stop
         style="stop-color:#ffffff;stop-opacity:0;"
         offset="1"
         id="stop4441" />
    </linearGradient>
    <linearGradient
       x1="48.90625"
       y1="17.376184"
       x2="50.988335"
       y2="22.250591"
       id="linearGradient2554"
       xlink:href="#linearGradient2966"
       gradientUnits="userSpaceOnUse"
       gradientTransform="translate(-5.669292,0)" />
    <linearGradient
       id="linearGradient2966">
      <stop
         id="stop2968"
         style="stop-color:#ffd1d1;stop-opacity:1"
         offset="0" />
      <stop
         id="stop3006"
         style="stop-color:#ff1d1d;stop-opacity:1"
         offset="0.5" />
      <stop
         id="stop2970"
         style="stop-color:#6f0000;stop-opacity:1"
         offset="1" />
    </linearGradient>
    <linearGradient
       x1="46"
       y1="19.8125"
       x2="47.6875"
       y2="22.625"
       id="linearGradient2556"
       xlink:href="#linearGradient2974"
       gradientUnits="userSpaceOnUse"
       gradientTransform="translate(-5.669292,0)" />
    <linearGradient
       id="linearGradient2974">
      <stop
         id="stop2976"
         style="stop-color:#c1c1c1;stop-opacity:1"
         offset="0" />
      <stop
         id="stop2978"
         style="stop-color:#acacac;stop-opacity:1"
         offset="1" />
    </linearGradient>
    <radialGradient
       cx="29.053354"
       cy="27.640751"
       r="3.2408545"
       fx="29.053354"
       fy="27.640751"
       id="radialGradient2558"
       xlink:href="#linearGradient2984"
       gradientUnits="userSpaceOnUse"
       gradientTransform="matrix(2.923565,0,0,2.029717,-61.55532,-27.88417)" />
    <linearGradient
       id="linearGradient2984">
      <stop
         id="stop2986"
         style="stop-color:#e7e2b8;stop-opacity:1"
         offset="0" />
      <stop
         id="stop2988"
         style="stop-color:#e7e2b8;stop-opacity:0"
         offset="1" />
    </linearGradient>
    <linearGradient
       x1="25.71875"
       y1="31.046875"
       x2="25.514589"
       y2="30.703125"
       id="linearGradient2560"
       xlink:href="#linearGradient2994"
       gradientUnits="userSpaceOnUse"
       gradientTransform="translate(-5.825542,0.125)" />
    <linearGradient
       id="linearGradient2994">
      <stop
         id="stop2996"
         style="stop-color:#000000;stop-opacity:1"
         offset="0" />
      <stop
         id="stop2998"
         style="stop-color:#c9c9c9;stop-opacity:1"
         offset="1" />
    </linearGradient>
    <marker
       style="overflow:visible"
       id="TriangleOutS-0"
       refX="0"
       refY="0"
       orient="auto"
       inkscape:stockid="TriangleOutS">
      <path
         transform="scale(0.2,0.2)"
         style="fill-rule:evenodd;stroke:#000000;stroke-width:1pt;marker-start:none"
         d="m 5.77,0 -8.65,5 0,-10 8.65,5 z"
         id="path3754-9" />
    </marker>
    <inkscape:perspective
       sodipodi:type="inkscape:persp3d"
       inkscape:vp_x="0 : 0.5 : 1"
       inkscape:vp_y="0 : 1000 : 0"
       inkscape:vp_z="1 : 0.5 : 1"
       inkscape:persp3d-origin="0.5 : 0.33333333 : 1"
       id="perspective4628" />
    <inkscape:perspective
       id="perspective20"
       inkscape:persp3d-origin="376.56 : 223.84001 : 1"
       inkscape:vp_z="753.12 : 335.76001 : 1"
       inkscape:vp_y="0 : 1000 : 0"
       inkscape:vp_x="0 : 335.76001 : 1"
       sodipodi:type="inkscape:persp3d" />
    <marker
       style="overflow:visible;"
       id="Arrow2Lend"
       refX="0.0"
       refY="0.0"
       orient="auto"
       inkscape:stockid="Arrow2Lend">
      <path
         transform="scale(1.1) rotate(180) translate(1,0)"
         d="M 8.7185878,4.0337352 L -2.2072895,0.016013256 L 8.7185884,-4.0017078 C 6.9730900,-1.6296469 6.9831476,1.6157441 8.7185878,4.0337352 z "
         style="font-size:12.0;fill-rule:evenodd;stroke-width:0.62500000;stroke-linejoin:round;"
         id="path3626" />
    </marker>
    <marker
       style="overflow:visible"
       id="TriangleOutL"
       refX="0.0"
       refY="0.0"
       orient="auto"
       inkscape:stockid="TriangleOutL">
      <path
         transform="scale(0.8)"
         style="fill-rule:evenodd;stroke:#000000;stroke-width:1.0pt;marker-start:none"
         d="M 5.77,0.0 L -2.88,5.0 L -2.88,-5.0 L 5.77,0.0 z "
         id="path3748" />
    </marker>
    <marker
       style="overflow:visible"
       id="TriangleOutM"
       refX="0.0"
       refY="0.0"
       orient="auto"
       inkscape:stockid="TriangleOutM">
      <path
         transform="scale(0.4)"
         style="fill-rule:evenodd;stroke:#000000;stroke-width:1.0pt;marker-start:none"
         d="M 5.77,0.0 L -2.88,5.0 L -2.88,-5.0 L 5.77,0.0 z "
         id="path3751" />
    </marker>
    <marker
       style="overflow:visible"
       id="TriangleOutS"
       refX="0.0"
       refY="0.0"
       orient="auto"
       inkscape:stockid="TriangleOutS">
      <path
         transform="scale(0.2)"
         style="fill-rule:evenodd;stroke:#000000;stroke-width:1.0pt;marker-start:none"
         d="M 5.77,0.0 L -2.88,5.0 L -2.88,-5.0 L 5.77,0.0 z "
         id="path3754" />
    </marker>
    <marker
       style="overflow:visible"
       id="TriangleOutS-8"
       refX="0"
       refY="0"
       orient="auto"
       inkscape:stockid="TriangleOutS">
      <path
         inkscape:connector-curvature="0"
         transform="scale(0.2,0.2)"
         style="fill-rule:evenodd;stroke:#000000;stroke-width:1pt;marker-start:none"
         d="m 5.77,0 -8.65,5 0,-10 8.65,5 z"
         id="path3754-3" />
    </marker>
    <marker
       style="overflow:visible"
       id="marker3957"
       refX="0"
       refY="0"
       orient="auto"
       inkscape:stockid="TriangleOutS">
      <path
         inkscape:connector-curvature="0"
         transform="scale(0.2,0.2)"
         style="fill-rule:evenodd;stroke:#000000;stroke-width:1pt;marker-start:none"
         d="m 5.77,0 -8.65,5 0,-10 8.65,5 z"
         id="path3959" />
    </marker>
    <marker
       style="overflow:visible"
       id="TriangleOutS-6"
       refX="0"
       refY="0"
       orient="auto"
       inkscape:stockid="TriangleOutS">
      <path
         inkscape:connector-curvature="0"
         transform="scale(0.2,0.2)"
         style="fill-rule:evenodd;stroke:#000000;stroke-width:1pt;marker-start:none"
         d="m 5.77,0 -8.65,5 0,-10 8.65,5 z"
         id="path3754-7" />
    </marker>
    <marker
       style="overflow:visible"
       id="TriangleOutS-2"
       refX="0"
       refY="0"
       orient="auto"
       inkscape:stockid="TriangleOutS">
      <path
         inkscape:connector-curvature="0"
         transform="scale(0.2,0.2)"
         style="fill-rule:evenodd;stroke:#000000;stroke-width:1pt;marker-start:none"
         d="m 5.77,0 -8.65,5 0,-10 8.65,5 z"
         id="path3754-38" />
    </marker>
    <marker
       style="overflow:visible"
       id="TriangleOutS-23"
       refX="0"
       refY="0"
       orient="auto"
       inkscape:stockid="TriangleOutS">
      <path
         inkscape:connector-curvature="0"
         transform="scale(0.2,0.2)"
         style="fill-rule:evenodd;stroke:#000000;stroke-width:1pt;marker-start:none"
         d="m 5.77,0 -8.65,5 0,-10 8.65,5 z"
         id="path3754-2" />
    </marker>
    <marker
       orient="auto"
       markerHeight="3"
       markerWidth="4"
       markerUnits="strokeWidth"
       refY="5"
       refX="10"
       viewBox="0 0 10 10"
       id="ArrowStart">
      <path
         id="path10"
         d="M 10,0 L 0,5 L 10,10 L 10,0 z" />
    </marker>
    <marker
       orient="auto"
       markerHeight="3"
       markerWidth="4"
       markerUnits="strokeWidth"
       refY="5"
       refX="0"
       viewBox="0 0 10 10"
       id="ArrowEnd">
      <path
         id="path7"
         d="M 0,0 L 10,5 L 0,10 L 0,0 z" />
    </marker>
    <inkscape:perspective
       id="perspective29"
       inkscape:persp3d-origin="400 : 245.56767 : 1"
       inkscape:vp_z="800 : 368.3515 : 1"
       inkscape:vp_y="0 : 1000 : 0"
       inkscape:vp_x="0 : 368.3515 : 1"
       sodipodi:type="inkscape:persp3d" />
  </defs>
  <g
     id="g3124"
     transform="matrix(0.6125941,0,0,0.6125941,-2.4808071,-2.1076566)">
    <path
       inkscape:connector-curvature="0"
       style="fill:#ffcc00;fill-opacity:1;stroke:none;display:inline"
       d="m 39.543824,58.012469 1.451384,1.037794 c 2.080708,1.451168 3.224905,3.468194 3.11159,5.549729 l -0.07683,1.719097 0.683022,-1.691371 c 0.74717,-1.770025 0.644303,-4.450247 -0.238226,-6.435304 l -0.514875,-1.157481 1.635059,0.71271 c 2.336453,0.986585 3.874865,2.720966 4.196172,4.781277 l 0.281744,1.697599 0.316783,-1.797187 c 0.363124,-1.887165 -0.293611,-4.486467 -1.569503,-6.244324 l -0.744051,-1.025635 1.747529,0.356781 c 2.490175,0.478719 4.354982,1.855187 5.097346,3.80375 l 0.628198,1.601965 -0.06357,-1.82407 c -0.03648,-1.921399 -1.219089,-4.327456 -2.83183,-5.781444 l -0.940738,-0.848238 1.783421,-0.01438 c 2.535115,-0.05007 4.645204,0.907924 5.775844,2.65985 l 0.946676,1.435592 -0.440561,-1.770586 c -0.434622,-1.871035 -2.090874,-3.9786 -3.970379,-5.065063 l -1.096445,-0.634056 1.741599,-0.385069 c 2.469264,-0.577463 4.73224,-0.07892 6.201703,1.398818 l 1.224179,1.207275 -0.79888,-1.640161 c -0.813576,-1.740032 -2.87139,-3.457152 -4.935422,-4.128554 l -1.204109,-0.391008 1.62347,-0.739591 c 2.295194,-1.078539 4.612142,-1.062128 6.356564,0.07699 l 1.448553,0.926609 -1.121877,-1.438429 c -1.157491,-1.53293 -3.52672,-2.78349 -5.685133,-3.010401 l -1.258653,-0.132136 1.434419,-1.061559 c 2.021081,-1.532368 4.290837,-1.999489 6.233639,-1.247731 l 1.609346,0.604337 -1.395992,-1.173032 c -1.45053,-1.258203 -4.027746,-1.988738 -6.18616,-1.761256 l -1.258653,0.132128 1.182354,-1.336856 c 1.658797,-1.919705 3.782174,-2.848571 5.838576,-2.51754 l 1.699492,0.25577 -1.609346,-0.856434 C 64.171259,30.932777 61.498811,30.754808 59.43478,31.42621 l -1.204118,0.391297 0.878856,-1.553303 c 1.223896,-2.223283 3.10792,-3.57372 5.188059,-3.678686 l 1.715599,-0.102988 -1.752051,-0.502771 c -1.836267,-0.558794 -4.487236,-0.176273 -6.366742,0.909628 l -1.096444,0.633766 0.537481,-1.702685 c 0.735582,-2.42926 2.297741,-4.142136 4.310903,-4.677728 l 1.656821,-0.458073 -1.81818,-0.127033 c -1.912278,-0.164668 -4.425911,0.760808 -6.038652,2.214797 l -0.940738,0.848236 0.172094,-1.777104 c 0.214775,-2.529979 1.387229,-4.530322 3.24526,-5.473615 l 1.525418,-0.792495 -1.804903,0.253793 c -1.904651,0.237101 -4.171018,1.665911 -5.44662,3.423767 l -0.74406,1.025634 -0.200639,-1.774274 c -0.315087,-2.518665 0.415969,-4.72045 2.037471,-6.02901 l 1.327317,-1.092972 -1.712772,0.623866 c -1.813654,0.628399 -3.733567,2.497729 -4.616377,4.482785 L 47.77288,17.649368 47.207986,15.955449 C 46.37661,13.557317 46.634895,11.251701 47.949217,9.6341687 l 1.071579,-1.3453345 -1.545764,0.966495 c -1.643537,0.9922428 -3.133626,3.2203388 -3.584924,5.3457288 l -0.263091,1.240089 -0.904291,-1.53887 C 41.411514,12.128789 41.185447,9.8206237 42.134943,7.9642962 l 0.768644,-1.5388619 -1.311212,1.2669629 c -1.401647,1.313101 -2.396357,3.8031868 -2.396357,5.9758318 l 0,1.267252 -1.204117,-1.317054 c -1.7334,-1.852084 -2.433942,-4.0637703 -1.890803,-6.0768255 l 0.431794,-1.6656299 -1.019295,1.5131293 c -1.098429,1.5753633 -1.554243,4.2179511 -1.102945,6.3439111 l 0.262809,1.239526 -1.451095,-1.037793 C 31.141659,12.483568 29.997454,10.466543 30.110768,8.3841562 l 0.07659,-1.7190964 -0.683022,1.6922304 c -0.746881,1.7700158 -0.644022,4.4493938 0.238225,6.4344428 l 0.514875,1.158333 -1.635058,-0.71299 C 26.285926,14.250772 24.747514,12.516109 24.426206,10.45608 L 24.144463,8.7584802 23.827961,10.555387 c -0.363121,1.886593 0.293332,4.486747 1.569505,6.244604 l 0.74377,1.025064 -1.747248,-0.357054 c -2.490175,-0.478445 -4.354982,-1.854632 -5.097346,-3.803468 l -0.628197,-1.601683 0.06357,1.823788 c 0.03648,1.921391 1.219089,4.327456 2.831831,5.781164 l 0.940737,0.848228 -1.783421,0.01439 c -2.535111,0.05038 -4.645208,-0.907929 -5.775847,-2.659003 l -0.946957,-1.436164 0.440842,1.770305 c 0.434622,1.871887 2.090873,3.979452 3.970378,5.065916 l 1.096164,0.633766 -1.741318,0.385069 c -2.469264,0.576901 -4.732239,0.07924 -6.201706,-1.398537 l -1.224457,-1.207556 0.798876,1.640163 c 0.813865,1.74032 2.871676,3.456588 4.935707,4.12799 l 1.204118,0.39186 -1.623478,0.739302 c -2.295475,1.078828 -4.612423,1.062128 -6.3568505,-0.07723 l -1.4485476,-0.926319 1.1218798,1.437859 c 1.1574813,1.532931 3.5267153,2.783491 5.6851263,3.010691 l 1.258943,0.132691 -1.434427,1.061003 c -2.021366,1.532924 -4.291115,1.999202 -6.2339161,1.247733 l -1.6093501,-0.604064 1.3959889,1.172759 c 1.4505328,1.258765 4.0277513,1.988729 6.1861623,1.761537 l 1.258943,-0.132128 -1.182644,1.336285 c -1.658799,1.920267 -3.782171,2.848572 -5.8385758,2.518102 l -1.6994956,-0.256332 1.60935,0.857005 c 1.6802804,0.929148 4.3527234,1.106827 6.4167544,0.435434 l 1.204117,-0.391579 -0.879137,1.553859 c -1.223895,2.223 -3.107917,3.573729 -5.1880611,3.67813 l -1.7155927,0.102699 1.7520463,0.503343 c 1.8362685,0.558794 4.4872375,0.176264 6.3667435,-0.909918 l 1.096443,-0.634048 -0.537199,1.702686 c -0.735582,2.429829 -2.297733,4.142987 -4.310901,4.67829 l -1.656822,0.458073 1.818178,0.127322 c 1.912286,0.164098 4.425912,-0.76166 6.038654,-2.215648 l 0.940736,-0.848237 -0.172093,1.777956 c -0.214768,2.529136 -1.38723,4.530033 -3.245254,5.472763 l -1.525416,0.793058 1.804894,-0.253504 c 1.904652,-0.237101 4.171018,-1.666754 5.446629,-3.424619 l 0.74406,-1.025064 0.20092,1.774557 c 0.315079,2.518664 -0.416259,4.719597 -2.03776,6.028728 l -1.327599,1.092972 1.712772,-0.623874 c 1.813654,-0.628108 3.733856,-2.498291 4.616667,-4.483066 l 0.514593,-1.157764 0.564894,1.693075 c 0.831376,2.398984 0.573091,4.703757 -0.741231,6.321843 l -1.071579,1.345633 1.545765,-0.967065 c 1.643537,-0.991962 3.133634,-3.220621 3.584923,-5.346011 l 0.263092,-1.239535 0.904291,1.539159 c 1.311212,2.172918 1.537278,4.481654 0.587782,6.337692 l -0.768643,1.539152 1.311212,-1.267816 c 1.401646,-1.312247 2.396357,-3.802335 2.396357,-5.97526 l 0,-1.267542 1.204116,1.317336 c 1.733402,1.852365 2.433945,4.063763 1.891087,6.076834 l -0.432356,1.665622 1.019293,-1.513121 c 1.09843,-1.575935 1.554244,-4.217967 1.103227,-6.343639 l -0.263082,-1.239526"
       id="path7619" />
    <path
       sodipodi:type="arc"
       style="fill:#000000;fill-opacity:0.99607843;stroke:#000000;stroke-width:2;stroke-linecap:round;stroke-linejoin:round;stroke-miterlimit:4;stroke-opacity:1;stroke-dasharray:none;stroke-dashoffset:0"
       id="path3051"
       sodipodi:cx="32.579151"
       sodipodi:cy="30.533903"
       sodipodi:rx="10.807128"
       sodipodi:ry="10.807128"
       d="m 43.386279,30.533903 a 10.807128,10.807128 0 1 1 -21.614256,0 10.807128,10.807128 0 1 1 21.614256,0 z"
       transform="matrix(1.6433085,0,0,1.6433085,-7.2511446,-4.7474755)" />
  </g>
</svg>
