// This file is released under the 3-clause BSD license. See COPYING-BSD.
//=================================
// Test flags
//<-- XCOS TEST -->
//<-- NO CHECK ERROR OUTPUT -->
[macros,base_path] = libraryinfo('xcos_aerolib');
s = filesep();
// Locate help files
help_files = findfiles(base_path + '..' + s + 'help' + s + 'en_US' + s + 'blocks', '*.xml');
number_of_help = size(help_files);
help_files = strsubst(help_files,'.xml','')
 help_files  =
 
!AXA_TO_QUAT           !
!                      !
!TIMEZONE_CONVERSION   !
!                      !
!VECTOR_ROTATE         !
!                      !
!DOT_PRODUCT           !
!                      !
!SOL_DRAG_MODEL        !
!                      !
!KEP_TO_CAR            !
!                      !
!FRAME_CONV_JACOBIAN   !
!                      !
!PLOT_VISIBILITY       !
!                      !
!FRAME_CONVERSION      !
!                      !
!PLANET_MODEL          !
!                      !
!VECTOR_NORMALIZATION  !
!                      !
!QUAT_INVERT           !
!                      !
!STATION_POINTING      !
!                      !
!KEPLERIAN_INPUT       !
!                      !
!CJD_NOW               !
!                      !
!PLOT_POLAR            !
!                      !
!CROSS_PRODUCT         !
!                      !
!QUAT_PRODUCT          !
!                      !
!VECTOR_NORM           !
!                      !
!ROTATION_JACOBIAN     !
!                      !
!GROUND_STATION        !
!                      !
!VECTOR_ANGLE          !
!                      !
!KEPLERIAN_PROPAGATOR  !
!                      !
!ELL_TO_CAR            !
!                      !
!DISTANCE_CONVERSION   !
!                      !
!QUAT_INPUT            !
!                      !
!QUAT_TO_DCM           !
!                      !
!FRAME_CONV_DCM        !
!                      !
!SUN_MODEL             !
!                      !
!CJD_TIME              !
!                      !
!SECULAR_J2            !
!                      !
!QUAT_QUOTIENT         !
!                      !
!TIMEFRAME_CONVERSION  !
!                      !
!QUAT_CONJUGATE        !
!                      !
!PLOT_GROUNDTRACK      !
!                      !
!ECLIPSE_MODEL         !
!                      !
!GEOMAG_MODEL          !
!                      !
!PLOT_INDICATORS       !
!                      !
!VELOCITY_CONVERSION   !
!                      !
!ATM_DRAG_MODEL        !
!                      !
!STATION_VISIBILITY    !
!                      !
!DCM_TO_QUAT           !
!                      !
!QUAT_TO_AXA           !
!                      !
!LYDDANE_PROPAGATOR    !
!                      !
!MOON_MODEL            !
!                      !
!US76_ATM_MODEL        !
!                      !
!QUAT_NORM             !
!                      !
!ANGLE_CONVERSION      !
!                      !
!CAR_TO_ELL            !
help_files = gsort(help_files);
// Locate macro files
macro_files = findfiles(base_path + '..' + s + 'macros', '*.sci');
number_of_macro = size(macro_files);
macro_files = strsubst(macro_files,'.sci','')
 macro_files  =
 
!ECLIPSE_MODEL            !
!                         !
!VECTOR_NORM              !
!                         !
!AB_plot_groundtrack      !
!                         !
!AB_crossProduct          !
!                         !
!FRAME_CONVERSION         !
!                         !
!PLANET_MODEL             !
!                         !
!SOL_DRAG_MODEL           !
!                         !
!STATION_POINTING         !
!                         !
!AB_mod_moonSun           !
!                         !
!AB_quatConjugate         !
!                         !
!AB__plot_pg_tick_steps   !
!                         !
!AB_rot_quat2matrix       !
!                         !
!AB_ground_station        !
!                         !
!DISTANCE_CONVERSION      !
!                         !
!AB_quatProduct           !
!                         !
!STATION_VISIBILITY       !
!                         !
!AB_gm_stationPointing    !
!                         !
!ELL_TO_CAR               !
!                         !
!AB_unit_conversion       !
!                         !
!KEP_TO_CAR               !
!                         !
!AB_rotationJacobian      !
!                         !
!TIMEFRAME_CONVERSION     !
!                         !
!ATM_DRAG_MODEL           !
!                         !
!AXA_TO_QUAT              !
!                         !
!AB_set_block_style       !
!                         !
!AB_ex_lyddane            !
!                         !
!AB_ex_kepler             !
!                         !
!QUAT_NORM                !
!                         !
!AB_rot_matrix2quat       !
!                         !
!AB_check_cal_date        !
!                         !
!AB__inputParam           !
!                         !
!AB_fo_srpAcc             !
!                         !
!DCM_TO_QUAT              !
!                         !
!TIMEZONE_CONVERSION      !
!                         !
!AB__atmUS76              !
!                         !
!PLOT_VISIBILITY          !
!                         !
!AB_mod_atmUS76           !
!                         !
!AB_plot_polar            !
!                         !
!AB_plot_visibility       !
!                         !
!AB_fr_convertMat         !
!                         !
!AB_rot_quat2axAng        !
!                         !
!AB_ex_secularJ2          !
!                         !
!US76_ATM_MODEL           !
!                         !
!AB_vectAngle             !
!                         !
!AB_timeframe_conversion  !
!                         !
!AB_keplerian_input       !
!                         !
!AB_cjd_now               !
!                         !
!GROUND_STATION           !
!                         !
!PLOT_INDICATORS          !
!                         !
!AB_quat_input            !
!                         !
!AB_quatInvert            !
!                         !
!QUAT_TO_DCM              !
!                         !
!PLOT_GROUNDTRACK         !
!                         !
!SUN_MODEL                !
!                         !
!SECULAR_J2               !
!                         !
!AB__get_pv_params        !
!                         !
!FRAME_CONV_JACOBIAN      !
!                         !
!AB_plot_indicators       !
!                         !
!CROSS_PRODUCT            !
!                         !
!VELOCITY_CONVERSION      !
!                         !
!AB_fo_dragAcc            !
!                         !
!QUAT_INPUT               !
!                         !
!AB_cjd_time              !
!                         !
!AB_dotProduct            !
!                         !
!AB_gm_eclipseCheck       !
!                         !
!VECTOR_ROTATE            !
!                         !
!AB_co_car2ell            !
!                         !
!QUAT_CONJUGATE           !
!                         !
!QUAT_PRODUCT             !
!                         !
!xcos_block_debug         !
!                         !
!QUAT_TO_AXA              !
!                         !
!xcos_block_perf          !
!                         !
!VECTOR_ANGLE             !
!                         !
!CJD_TIME                 !
!                         !
!GEOMAG_MODEL             !
!                         !
!CAR_TO_ELL               !
!                         !
!QUAT_INVERT              !
!                         !
!AB_co_ell2car            !
!                         !
!AB_oe_kep2car            !
!                         !
!FRAME_CONV_DCM           !
!                         !
!AB_check_kep             !
!                         !
!AB_timezone_conversion   !
!                         !
!QUAT_QUOTIENT            !
!                         !
!CJD_NOW                  !
!                         !
!ROTATION_JACOBIAN        !
!                         !
!AB_quatNorm              !
!                         !
!VECTOR_NORMALIZATION     !
!                         !
!KEPLERIAN_INPUT          !
!                         !
!AB_unitVector            !
!                         !
!LYDDANE_PROPAGATOR       !
!                         !
!AB__get_pg_params        !
!                         !
!AB_vectorNorm            !
!                         !
!ANGLE_CONVERSION         !
!                         !
!AB__plot_earthMap        !
!                         !
!AB_check_param_number    !
!                         !
!AB_quatQuotient          !
!                         !
!KEPLERIAN_PROPAGATOR     !
!                         !
!DOT_PRODUCT              !
!                         !
!MOON_MODEL               !
!                         !
!AB_mod_geomagField       !
!                         !
!PLOT_POLAR               !
!                         !
!AB_eph_planet            !
!                         !
!AB_rot_axAng2quat        !
!                         !
!AB__get_pv_time_label    !
!                         !
!AB_fr_convert            !
!                         !
!AB_check_kep_lyd         !
!                         !
!AB__plot_ephem           !
!                         !
!AB_station_visibility    !
!                         !
!AB_rot_rotVect           !
macro_files = gsort(macro_files);
// the block files and help files
block_files = [];
for i =1:number_of_macro(1)
	if(~strcmp(macro_files(i), convstr(macro_files(i), 'u')));
		block_files = [block_files; macro_files(i)];
	end
end
number_of_block = size(block_files);
block_files = gsort(block_files);
// Check if all of the blocks are documented
assert_checktrue(and(block_files == help_files));
