<?xml version="1.0" encoding="UTF-8" standalone="no"?>
<!-- Created with Inkscape (http://www.inkscape.org/) -->

<svg
   xmlns:dc="http://purl.org/dc/elements/1.1/"
   xmlns:cc="http://creativecommons.org/ns#"
   xmlns:rdf="http://www.w3.org/1999/02/22-rdf-syntax-ns#"
   xmlns:svg="http://www.w3.org/2000/svg"
   xmlns="http://www.w3.org/2000/svg"
   xmlns:xlink="http://www.w3.org/1999/xlink"
   xmlns:sodipodi="http://sodipodi.sourceforge.net/DTD/sodipodi-0.dtd"
   xmlns:inkscape="http://www.inkscape.org/namespaces/inkscape"
   id="svg11300"
   height="44.822"
   width="41.062"
   version="1.1"
   inkscape:version="0.48.1 r9760"
   sodipodi:docname="PLOT_VISIBILITY.svg">
  <metadata
     id="metadata21023">
    <rdf:RDF>
      <cc:Work
         rdf:about="">
        <dc:format>image/svg+xml</dc:format>
        <dc:type
           rdf:resource="http://purl.org/dc/dcmitype/StillImage" />
        <dc:title>base scilan</dc:title>
      </cc:Work>
    </rdf:RDF>
  </metadata>
  <sodipodi:namedview
     pagecolor="#ffffff"
     bordercolor="#666666"
     borderopacity="1"
     objecttolerance="10"
     gridtolerance="10"
     guidetolerance="10"
     inkscape:pageopacity="0"
     inkscape:pageshadow="2"
     inkscape:window-width="1400"
     inkscape:window-height="992"
     id="namedview21021"
     showgrid="false"
     inkscape:zoom="16"
     inkscape:cx="15.207559"
     inkscape:cy="21.711377"
     inkscape:window-x="0"
     inkscape:window-y="26"
     inkscape:window-maximized="1"
     inkscape:current-layer="svg11300" />
  <title
     id="title3289">base scilan</title>
  <defs
     id="defs3">
    <radialGradient
       id="radialGradient20899"
       gradientUnits="userSpaceOnUse"
       cy="32.267"
       cx="23.994"
       gradientTransform="matrix(2.2986117,0,0,1.8027614,-75.446386,-24.554065)"
       r="19.089">
      <stop
         id="stop2224"
         stop-color="#5187d6"
         offset="0" />
      <stop
         id="stop2227"
         stop-color="#1e4580"
         offset="1" />
    </radialGradient>
    <linearGradient
       id="linearGradient2854"
       y2="24.238"
       gradientUnits="userSpaceOnUse"
       x2="12.499"
       gradientTransform="matrix(0,-5.2061514,2.5688251,0,-79.265723,164.6207)"
       y1="12.538"
       x1="8.8208">
      <stop
         id="stop2182"
         stop-color="#FFF"
         offset="0" />
      <stop
         id="stop2184"
         stop-color="#FFF"
         stop-opacity="0"
         offset="1" />
    </linearGradient>
    <radialGradient
       inkscape:collect="always"
       xlink:href="#radialGradient20899"
       id="radialGradient22083"
       gradientUnits="userSpaceOnUse"
       gradientTransform="matrix(2.2986117,0,0,1.8027614,-75.446386,-24.554065)"
       cx="23.994"
       cy="32.267"
       r="19.089" />
    <linearGradient
       inkscape:collect="always"
       xlink:href="#linearGradient2854"
       id="linearGradient22085"
       gradientUnits="userSpaceOnUse"
       gradientTransform="matrix(0,-5.2061514,2.5688251,0,-79.265723,164.6207)"
       x1="8.8208"
       y1="12.538"
       x2="12.499"
       y2="24.238" />
    <linearGradient
       inkscape:collect="always"
       xlink:href="#linearGradient2854"
       id="linearGradient22113"
       gradientUnits="userSpaceOnUse"
       gradientTransform="matrix(0,-5.2061514,2.5688251,0,-25.131725,80.137624)"
       x1="8.8208"
       y1="12.538"
       x2="12.499"
       y2="24.238" />
    <radialGradient
       inkscape:collect="always"
       xlink:href="#radialGradient20899"
       id="radialGradient22117"
       gradientUnits="userSpaceOnUse"
       gradientTransform="matrix(2.2986116,0,0,1.8027613,-80.537645,-19.462808)"
       cx="23.994"
       cy="32.267"
       r="19.089" />
    <linearGradient
       inkscape:collect="always"
       xlink:href="#linearGradient2854"
       id="linearGradient22123"
       gradientUnits="userSpaceOnUse"
       gradientTransform="matrix(3.5473247,0,0,1.750325,-16.835852,-13.840596)"
       x1="8.8208"
       y1="12.538"
       x2="12.499"
       y2="24.238" />
    <radialGradient
       inkscape:collect="always"
       xlink:href="#radialGradient20899"
       id="radialGradient22127"
       gradientUnits="userSpaceOnUse"
       gradientTransform="matrix(1.5662091,0,0,1.2283507,-17.108415,-9.9779561)"
       cx="23.994"
       cy="32.267"
       r="19.089" />
    <radialGradient
       inkscape:collect="always"
       xlink:href="#radialGradient20899"
       id="radialGradient4027"
       gradientUnits="userSpaceOnUse"
       gradientTransform="matrix(1.5662091,0,0,1.2283507,-17.108415,-9.9779561)"
       cx="23.994"
       cy="32.267"
       r="19.089" />
    <linearGradient
       inkscape:collect="always"
       xlink:href="#linearGradient2854"
       id="linearGradient4029"
       gradientUnits="userSpaceOnUse"
       gradientTransform="matrix(3.5473247,0,0,1.750325,-16.835852,-13.840596)"
       x1="8.8208"
       y1="12.538"
       x2="12.499"
       y2="24.238" />
    <radialGradient
       inkscape:collect="always"
       xlink:href="#radialGradient20899"
       id="radialGradient4543"
       gradientUnits="userSpaceOnUse"
       gradientTransform="matrix(1.5662091,0,0,1.2283507,-17.108415,-9.9779561)"
       cx="23.994"
       cy="32.267"
       r="19.089" />
    <linearGradient
       inkscape:collect="always"
       xlink:href="#linearGradient2854"
       id="linearGradient3512"
       gradientUnits="userSpaceOnUse"
       gradientTransform="matrix(3.5473247,0,0,1.750325,-16.835852,-13.840596)"
       x1="8.8208"
       y1="12.538"
       x2="12.499"
       y2="24.238" />
  </defs>
  <rect
     id="rect1314"
     style="fill:url(#radialGradient4543);fill-rule:evenodd;stroke:#173562;stroke-width:0.99998122;stroke-linecap:round;stroke-linejoin:round;stroke-miterlimit:4;stroke-dasharray:none;stroke-dashoffset:0"
     rx="1.5007215"
     ry="1.5007215"
     height="25.640701"
     width="32.923203"
     stroke-miterlimit="4"
     y="8.4187174"
     x="4.009604" />
  <path
     id="rect2178"
     d="m 4.4370519,8.9156701 0,8.8264899 c 3.417284,0.688118 7.2061881,1.079906 11.2031151,1.079906 8.320231,0 15.771713,-1.664795 20.747771,-4.278197 l 0,-5.6280627 -31.9508861,0 z"
     style="opacity:0.43181817;fill:url(#linearGradient3512);fill-rule:evenodd"
     inkscape:connector-curvature="0" />
  <rect
     style="opacity:0.97000002;fill:#3eff3e;fill-opacity:1;stroke:#3eff3e;stroke-width:0.93132311;stroke-linejoin:round;stroke-miterlimit:4;stroke-opacity:1;stroke-dasharray:none;stroke-dashoffset:0"
     id="rect3223"
     width="12.776677"
     height="4.0686769"
     x="7.8929205"
     y="19.297659" />
  <rect
     style="opacity:0.97000002;fill:#ffcc00;fill-opacity:1;stroke:#ffcc00;stroke-width:1.0770036;stroke-linejoin:round;stroke-miterlimit:4;stroke-opacity:1;stroke-dasharray:none;stroke-dashoffset:0"
     id="rect3223-8"
     width="17.720942"
     height="3.9229963"
     x="14.88071"
     y="12.799542" />
  <rect
     style="opacity:0.97000002;fill:#ff0000;fill-opacity:1;stroke:#ff0000;stroke-width:0.7530418;stroke-linejoin:round;stroke-miterlimit:4;stroke-opacity:1;stroke-dasharray:none;stroke-dashoffset:0"
     id="rect3223-6"
     width="8.0815563"
     height="4.205461"
     x="17.207541"
     y="25.855476" />
</svg>
