// ====================================================================
// Allan CORNET
// DIGITEO 2010
// ====================================================================
// <-- JVM NOT MANDATORY -->
// ====================================================================
if getos() == 'Windows' then
  info = dllinfo(SCI+'\bin\scilex.exe','machine');
  if info(2) <> 'x86' & info(2) <> 'x64' then bugmes();quit;end
  info = dllinfo(SCI+'\bin\api_scilab.dll','machine');
  if info(2) <> 'x86' & info(2) <> 'x64' then bugmes();quit;end
  info = dllinfo(SCI+'\bin\scilex.exe','exports');
  if size(info) <> 0 then bugmes();quit;end
  info = dllinfo(SCI+'\bin\api_scilab.dll','exports');
  if info(1) <> 'api_scilab.dll' then bugmes();quit;end
  if size(info(2),'*') < 300 then bugmes();quit;end
  if type(info(2)(1)) <> 10 then bugmes();quit;end
  info = dllinfo(SCI+'\bin\scilex.exe','imports');
  if size(info) < 4 then bugmes();quit;end
  info = dllinfo(SCI+'\bin\api_scilab.dll','imports');
  if size(info) < 4 then bugmes();quit;end
else
  // nothing to do
end
// ====================================================================
