//
//  Copyright (C) 2011 - DIGITEO
//
//  This file must be used under the terms of the CeCILL.
//  This source file is licensed as described in the file COPYING, which
//  you should have received as part of this distribution.  The terms
//  are also available at
//  http://www.cecill.info/licences/Licence_CeCILL_V2-en.txt
//
//
// <-- JVM MANDATORY -->
//
jimport java.awt.BorderLayout;
jimport java.net.URL;
jimport javax.imageio.ImageIO;
jimport javax.swing.ImageIcon;
jimport javax.swing.JFrame;
jimport javax.swing.JLabel;
url = URL.new("http://www.scilab.org/var/ezwebin_site/storage/images/media/images/puffin/1948-1-eng-GB/puffin.png");
image = ImageIO.read(url);
frame = JFrame.new();
icon = ImageIcon.new(image);
label = JLabel.new(icon);
pane = frame.getContentPane();
pane.add(label, BorderLayout.CENTER);
frame.pack();
frame.setVisible(%T);
jremove frame icon label pane url image BorderLayout URL ImageIO ImageIcon JFrame JLabel
jautoUnwrap(%F);
