//
//  Copyright (C) 2011 - DIGITEO - Allan CORNET
//
//  This file must be used under the terms of the CeCILL.
//  This source file is licensed as described in the file COPYING, which
//  you should have received as part of this distribution.  The terms
//  are also available at
//  http://www.cecill.info/licences/Licence_CeCILL_V2-en.txt
//
//
// <-- JVM MANDATORY -->
//
s = jwrap("Hello World !");
if jgetclassname(s) <> "java.lang.String" then bugmes();quit;end
jremove s;
if jgetclassname("toto") <> "java.lang.String" then bugmes();quit;end
if jgetclassname(1) <> "double" then bugmes();quit;end
if jgetclassname(%t) <> "boolean" then bugmes();quit;end
s = scf();
if execstr("jgetclassname(s)", "errcatch") <> 999, end
