//
//  Copyright (C) 2011 - DIGITEO - Allan CORNET
//
//  This file must be used under the terms of the CeCILL.
//  This source file is licensed as described in the file COPYING, which
//  you should have received as part of this distribution.  The terms
//  are also available at
//  http://www.cecill.info/licences/Licence_CeCILL_V2-en.txt
//
//
// <-- JVM MANDATORY -->
//
if execstr("jautoUnwrap(1);", "errcatch") <> 999 then bugmes();quit;end
if execstr("jautoUnwrap([%T %F]);", "errcatch") <> 999 then bugmes();quit;end
if jautoUnwrap() <> %F then bugmes();quit;end
jautoUnwrap(%T);
if jautoUnwrap() <> %T then bugmes();quit;end
