// Allan CORNET - 2012
//
// unit test
//
global IPD_PATH;
VideoInfoAsList = GetVideoInfo(IPD_PATH + 'demos\red-car-video.avi');
for n = 1 : length(VideoInfoAsList)
  disp(VideoInfoAsList(n));
end;
 
 Codec   
 
 xvid   
 
 NumberOfFrames   
 
    47.  
 
 FrameRate   
 
    30.  
 
 Width   
 
    320.  
 
 Height   
 
    240.  
 
 IsColor   
 
  T  
