// Allan CORNET - 2012
//
// unit test
//
Image = rand(9, 9); // generate random image
Threshold = CalculateOtsuThreshold(Image); // calculate a threshold
BinaryImage = SegmentByThreshold(Image, Threshold); // segment image
BlobImage = SearchBlobs(BinaryImage)
 BlobImage  =
 
  0  0  1  1  0  1  1  0  0  
  1  1  1  0  1  0  1  0  1  
  0  1  0  1  0  1  1  1  1  
  0  1  1  1  0  1  1  0  0  
  1  0  0  0  0  0  1  1  1  
  1  1  0  0  0  0  0  0  0  
  1  0  0  3  3  3  0  3  0  
  1  0  0  0  0  0  3  3  3  
  1  0  2  2  0  0  3  0  3  
