-0.1028595	-0.0221405	0.0231752	-0.0010190	-0.0053648	-0.0000489	0.0012619	-0.0000025	-0.0002999	-0.0000001
0.4778595	0.1028595	-0.0586403	0.0025784	0.0110063	0.0001004	-0.0023045	0.0000046	0.0005071	0.0000002
1.2057189	0.5442811	-0.0952792	0.0079358	0.0331671	0.0006593	-0.0103891	0.0000442	0.0030806	0.0000029
0.5442811	-1.2057189	0.5460421	-0.0334888	-0.0930155	-0.0015804	0.0227249	-0.0000882	-0.0058822	-0.0000052
-0.1028595	0.4778595	1.1493648	-0.0840530	-0.0864415	-0.0036409	0.0377345	-0.0003677	-0.0143282	-0.0000301
-0.0221405	0.1028595	0.5897344	0.1081712	0.5730067	0.0127392	-0.1149285	0.0008330	0.0331044	0.0000583
Nan	Nan	-0.1081712	0.5897344	1.1225705	0.0224585	-0.0793053	0.0017912	0.0398380	0.0001985
Nan	Nan	-0.0840530	-1.1493648	0.6059671	-0.0488682	0.5873348	-0.0053053	-0.1299968	-0.0004269
Nan	Nan	0.0334888	0.5460421	-0.1015403	-0.1163925	1.1062529	-0.0080020	-0.0736051	-0.0009016
Nan	Nan	0.0079358	0.0952792	-0.1163925	0.1015403	0.6143146	0.0215126	0.5961918	0.0023499
Nan	Nan	-0.0025784	-0.0586403	0.0488682	0.6059671	-0.0942255	0.0354717	1.0950165	0.0034388
Nan	Nan	-0.0010190	-0.0231752	0.0224585	-1.1225705	-0.1360762	-0.0556273	0.6194005	-0.0095622
Nan	Nan	Nan	Nan	-0.0127392	0.5730067	0.0556273	-0.1360762	-0.0877346	-0.0129535
Nan	Nan	Nan	Nan	-0.0036409	0.0864415	0.0354717	0.0942255	-0.1492888	0.0279426
Nan	Nan	Nan	Nan	0.0015804	-0.0930155	-0.0215126	0.6143146	0.0583894	0.0462091
Nan	Nan	Nan	Nan	0.0006593	-0.0331671	-0.0080020	-1.1062529	0.0462091	-0.0583894
Nan	Nan	Nan	Nan	-0.0001004	0.0110063	0.0053053	0.5873348	-0.0279426	-0.1492888
Nan	Nan	Nan	Nan	-0.0000489	0.0053648	0.0017912	0.0793053	-0.0129535	0.0877346
Nan	Nan	Nan	Nan	Nan	Nan	-0.0008330	-0.1149285	0.0095622	0.6194005
Nan	Nan	Nan	Nan	Nan	Nan	-0.0003677	-0.0377345	0.0034388	-1.0950165
Nan	Nan	Nan	Nan	Nan	Nan	0.0000882	0.0227249	-0.0023499	0.5961918
Nan	Nan	Nan	Nan	Nan	Nan	0.0000442	0.0103891	-0.0009016	0.0736051
Nan	Nan	Nan	Nan	Nan	Nan	-0.0000046	-0.0023045	0.0004269	-0.1299968
Nan	Nan	Nan	Nan	Nan	Nan	-0.0000025	-0.0012619	0.0001985	-0.0398380
Nan	Nan	Nan	Nan	Nan	Nan	Nan	Nan	-0.0000583	0.0331044
Nan	Nan	Nan	Nan	Nan	Nan	Nan	Nan	-0.0000301	0.0143282
Nan	Nan	Nan	Nan	Nan	Nan	Nan	Nan	0.0000052	-0.0058822
Nan	Nan	Nan	Nan	Nan	Nan	Nan	Nan	0.0000029	-0.0030806
Nan	Nan	Nan	Nan	Nan	Nan	Nan	Nan	-0.0000002	0.0005071
Nan	Nan	Nan	Nan	Nan	Nan	Nan	Nan	-0.0000001	0.0002999
