// Allan CORNET - 2012
//
// unit test
//
global IPD_PATH;
VideoFilePointer = OpenVideoFile(IPD_PATH + 'demos\red-car-video.avi');
[PixelList Dimensions] = ReadImageFromVideo(VideoFilePointer);
CloseVideoFile(VideoFilePointer);
RGB = matrix(PixelList, Dimensions);
ShowColorImage(RGB, 'Result');
