// Allan CORNET - 2012
//
// unit test
//
global IPD_PATH;
RGB = ReadImage(IPD_PATH + 'demos\teaset.png');
Image = RGB2Gray(RGB);
ThresholdedImage = SegmentByThreshold(Image, 200);
BlobImage = SearchBlobs(ThresholdedImage);
FilteredBlobImage = FilterBySize(BlobImage, 100); // Small objects are removed.
IsCalculated = CreateFeatureStruct(%f); // Feature struct is generated.
IsCalculated.PixelIndexList = %t; // The pixel index list shall be calculated for each blob.
SizeHistogram = CreateHistogram(FilteredBlobImage);
NumberOfObjects = length(SizeHistogram) - 1;
PixelIndexMatrix = CreatePixelIndexList(FilteredBlobImage);
for n = 1 : NumberOfObjects
 PixelIndexList = PixelIndexMatrix(1 : SizeHistogram(n + 1), n);
end;
