ID,CircleDistributionStrategyTIME,DWR:FRG:IDF,DWR:FRG:MICF,DWR:FRG:MIPF,DWR:FRG:NCF,DWR:FRG:NPF,DWR:SRG:IDF,DWR:SRG:MICF,DWR:SRG:MIPF,DWR:SRG:NCF,DWR:SRG:NPF,DefaultEnjoyingStrategyLEAVE_TIME,DefaultReconstructionStrategyABORTED_TIME,DefaultReconstructionStrategyFOUND_POINT_ABORTED_TIME,DefaultReconstructionStrategyFOUND_POINT_TIME,DefaultReconstructionStrategyNO_STATION,DefaultReconstructionStrategyPOINTS_FOUND,ESTER:FRG:IDF,ESTER:FRG:MICF,ESTER:FRG:MIPF,ESTER:FRG:NCF,ESTER:FRG:NPF,ESTER:SRG:IDF,ESTER:SRG:MICF,ESTER:SRG:MIPF,ESTER:SRG:NCF,ESTER:SRG:NPF,GraphClusteringAlgorithmCREATE_LINKAGES_TIME,GraphClusteringAlgorithmCREATE_WEIGHTED_CLUSTER_TIME,GraphClusteringAlgorithmWEIGHTED_CLUSTERING_TIME,PVISR:FRG:IDF,PVISR:FRG:MICF,PVISR:FRG:MIPF,PVISR:FRG:NCF,PVISR:FRG:NPF,PVISR:SRG:IDF,PVISR:SRG:MICF,PVISR:SRG:MIPF,PVISR:SRG:NCF,PVISR:SRG:NPF,SSTER:FRG:IDF,SSTER:FRG:MICF,SSTER:FRG:MIPF,SSTER:FRG:NCF,SSTER:FRG:NPF,SSTER:SRG:IDF,SSTER:SRG:MICF,SSTER:SRG:MIPF,SSTER:SRG:NCF,SSTER:SRG:NPF,STIR:FRG:IDF,STIR:FRG:MICF,STIR:FRG:MIPF,STIR:FRG:NCF,STIR:FRG:NPF,STIR:SRG:IDF,STIR:SRG:MICF,STIR:SRG:MIPF,STIR:SRG:NCF,STIR:SRG:NPF,SimulationTime,TRAJECTORY,WSTER:FRG:IDF,WSTER:FRG:MICF,WSTER:FRG:MIPF,WSTER:FRG:NCF,WSTER:FRG:NPF,WSTER:SRG:IDF,WSTER:SRG:MICF,WSTER:SRG:MIPF,WSTER:SRG:NCF,WSTER:SRG:NPF,fastestRouteRoutingStrategyCALCULATED_TIME,fastestRouteRoutingStrategyFROM_CACHE_TIME,intrestDistanceFactorGoalStrategyFOUND_GOAL_TIME,intrestDistanceFactorGoalStrategyNO_INTEREST_TIME,mostInterestingClusterFirstGoalStrategyFOUND_GOAL_TIME,mostInterestingClusterFirstGoalStrategyNO_INTEREST_TIME,mostInterestingPlacesFirstGoalStrategyFOUND_GOAL_TIME,mostInterestingPlacesFirstGoalStrategyNO_INTEREST_TIME,nearestClusterFirstGoalStrategyFOUND_GOAL_TIME,nearestClusterFirstGoalStrategyNO_INTEREST_TIME,nearestPlacesFirstGoalStrategyFOUND_GOAL_TIME,nearestPlacesFirstGoalStrategyNO_INTEREST_TIME,shortestRouteRoutingStrategyCALCULATED_TIME,shortestRouteRoutingStrategyFROM_CACHE_TIME
Count,1.0,115.0,108.0,106.0,95.0,82.0,100.0,92.0,101.0,95.0,106.0,639000.0,1.0,36.0,39501.0,13156.0,39537.0,115.0,108.0,106.0,95.0,82.0,100.0,92.0,101.0,95.0,106.0,1.0,1.0,1.0,115.0,108.0,106.0,95.0,82.0,100.0,92.0,101.0,95.0,106.0,115.0,108.0,106.0,95.0,82.0,100.0,92.0,101.0,95.0,106.0,115.0,108.0,106.0,95.0,82.0,100.0,92.0,101.0,95.0,106.0,1.0,39520.0,115.0,108.0,106.0,95.0,82.0,100.0,92.0,101.0,95.0,106.0,3638.0,45017.0,1765.0,215.0,1500.0,200.0,1333.0,207.0,1567.0,190.0,1513.0,188.0,3755.0,41019.0
Max,2699183.0,3753.813328896394,4033.4541275593247,8186.529138281412,4995.142288189821,3023.907600747862,3668.4913288963944,3860.132328896394,7726.934857057375,4363.2636281891155,3740.4159499880316,6.6153201E7,1.4243427E8,7.25238663E8,9.6697365E7,8916.0,10.0,640.0,640.0,640.0,640.0,640.0,640.0,640.0,640.0,640.0,640.0,8464379.0,1020524.0,3.190922488E9,12.0,11.0,11.0,13.0,12.0,11.0,12.0,10.0,12.0,11.0,4343.0,4613.0,8715.0,5574.0,3630.0,4251.0,4439.0,8247.0,4964.0,4338.0,4343000.0,4613000.0,8715000.0,5574000.0,3630000.0,4251000.0,4439000.0,8247000.0,4964000.0,4338000.0,11218.0,53.392704685470505,3704.0,3974.0,8076.0,4935.0,2991.0,3612.0,3800.0,7608.0,4325.0,3699.0,7.73807088E8,1.08015148E8,1.738410806E9,1898.0,1.485233168E9,1513.0,8647424.0,2863.0,1.372833162E9,1632.0,3.903066714E9,1210.0,7.64608892E8,5.1598624E7
Min,2699183.0,776.7211056634937,863.618022590494,4566.984168101138,577.9467508080554,728.2710437650029,843.3586406866905,1139.2000829616377,4266.280168101139,827.2881342095698,728.2710437650029,1.0,1.4243427E8,1.03400723E8,25962.0,21.0,1.0,639.0,639.0,640.0,640.0,639.0,639.0,640.0,640.0,639.0,639.0,8464379.0,1020524.0,3.190922488E9,4.0,4.0,4.0,5.0,6.0,5.0,4.0,4.0,6.0,6.0,1407.0,1489.0,5146.0,1209.0,1360.0,1466.0,1761.0,4837.0,1450.0,1360.0,1407000.0,1489000.0,5146000.0,1209000.0,1360000.0,1466000.0,1761000.0,4837000.0,1450000.0,1360000.0,11218.0,0.021453035181757552,768.0,850.0,4507.0,570.0,721.0,827.0,1122.0,4198.0,811.0,721.0,2472075.0,1298.0,79437.0,100.0,70283.0,72.0,591.0,79.0,36247.0,97.0,6146.0,77.0,2447690.0,1384.0
Avg,2699183.0,1897.8685466695654,2090.0132769548864,5935.3964163729515,1626.3312301793032,1044.7727390150894,1764.4341108395154,2104.1486194246886,5841.292660471305,1495.1965300714394,1077.4756451846526,169.69542097026604,1.4243427E8,2.0259396105555555E8,178266.1958431432,133.4432198236546,9.995801401219111,639.991304347826,639.9814814814815,640.0,640.0,639.9634146341464,639.99,640.0,640.0,639.9894736842106,639.9811320754717,8464379.0,1020524.0,3.190922488E9,8.4,7.583333333333333,6.386792452830188,8.242105263157894,8.097560975609756,7.99,7.4021739130434785,6.4950495049504955,8.25263157894737,8.00943396226415,2513.060869565217,2698.0185185185187,6495.509433962264,2243.5263157894738,1669.5243902439024,2381.29,2712.4239130434785,6392.584158415842,2114.2736842105264,1702.198113207547,2513060.8695652173,2698018.5185185187,6495509.433962264,2243526.3157894737,1669524.3902439023,2381290.0,2712423.913043478,6392584.158415842,2114273.6842105263,1702198.1132075472,11218.0,15.135625740876556,1874.0695652173913,2059.037037037037,5856.509433962264,1604.5263157894738,1030.560975609756,1742.3,2073.4239130434785,5753.584158415842,1475.2842105263157,1063.2169811320755,4.7587940541231446E7,16898.900415398628,6.0390314359206796E7,214.16744186046512,5.2210547844E7,174.27,11433.610652663167,328.2028985507246,5.8717793013401404E7,199.90526315789472,7.458893870323859E7,259.5585106382979,4.969797455579228E7,5265.90689680392
variance,0.0,208652.73848426266,211383.5612115581,520343.61537477246,787577.7132647387,83533.83087677373,174606.27308856684,212377.7434898029,624208.6536412198,258053.0528916669,199954.57501306306,6.849889280764785E9,0.0,1.33609100193748E16,5.54312987328577E12,18580.53804995501,0.02633743158565759,0.008620037807183359,0.01817558299039785,0.0,0.0,0.03524687685901242,0.009899999999999978,0.0,0.0,0.010415512465373922,0.0185119259522962,0.0,0.0,0.0,1.8921739130434811,1.743055555555556,1.8220897116411539,2.1413850415512434,1.9904818560380737,1.9499000000000022,1.6099952741020798,1.7351240074502494,1.9993351800554018,1.3678355286578865,202857.6745557652,205947.88854595332,508262.28764684894,772020.2493074795,81675.78599048177,169237.2859000002,205228.5485586012,608954.3221252819,253698.9987811635,196005.21546813805,2.028576745557652E11,2.0594788854595337E11,5.08262287646849E11,7.720202493074791E11,8.16757859904819E10,1.692372859E11,2.0522854855860132E11,6.089543221252817E11,2.5369899878116348E11,1.9600521546813828E11,0.0,102.64830509407044,202873.21255198523,205936.38751714688,508262.28764684894,772020.2493074795,81677.12433075556,169231.9699999999,205228.5485586012,608954.3221252819,253693.76132963994,196044.18876824473,5.873200013457889E15,9.831635786932518E11,4.2633565236584064E16,28002.58591671173,4.016464268406916E16,13086.267099999995,5.614021244391838E10,218154.13274522126,3.6608052547035568E16,25999.99102493074,2.07486987594627936E17,50743.44870416475,6.91836213172051E15,6.963889218072433E10
Quantil 0,,,,,,,,,,,,,,,,,,,,,,,,,,,,,,,,,,,,,,,,,,,,,,,,,,,,,,,,,,,,,,,,,,,,,,,,,,,,,,,,,,,,,,
Quantil 1,,,,,,,,,,,,,,,,,,,,,,,,,,,,,,,,,,,,,,,,,,,,,,,,,,,,,,,,,,,,,,,,,,,,,,,,,,,,,,,,,,,,,,
Quantil 2,,,,,,,,,,,,,,,,,,,,,,,,,,,,,,,,,,,,,,,,,,,,,,,,,,,,,,,,,,,,,,,,,,,,,,,,,,,,,,,,,,,,,,
Quantil 3,,,,,,,,,,,,,,,,,,,,,,,,,,,,,,,,,,,,,,,,,,,,,,,,,,,,,,,,,,,,,,,,,,,,,,,,,,,,,,,,,,,,,,
Quantil 4,,,,,,,,,,,,,,,,,,,,,,,,,,,,,,,,,,,,,,,,,,,,,,,,,,,,,,,,,,,,,,,,,,,,,,,,,,,,,,,,,,,,,,
Quantil 5,,,,,,,,,,,,,,,,,,,,,,,,,,,,,,,,,,,,,,,,,,,,,,,,,,,,,,,,,,,,,,,,,,,,,,,,,,,,,,,,,,,,,,
Quantil 6,,,,,,,,,,,,,,,,,,,,,,,,,,,,,,,,,,,,,,,,,,,,,,,,,,,,,,,,,,,,,,,,,,,,,,,,,,,,,,,,,,,,,,
Quantil 7,,,,,,,,,,,,,,,,,,,,,,,,,,,,,,,,,,,,,,,,,,,,,,,,,,,,,,,,,,,,,,,,,,,,,,,,,,,,,,,,,,,,,,
Quantil 8,,,,,,,,,,,,,,,,,,,,,,,,,,,,,,,,,,,,,,,,,,,,,,,,,,,,,,,,,,,,,,,,,,,,,,,,,,,,,,,,,,,,,,
Quantil 9,,,,,,,,,,,,,,,,,,,,,,,,,,,,,,,,,,,,,,,,,,,,,,,,,,,,,,,,,,,,,,,,,,,,,,,,,,,,,,,,,,,,,,
Quantil 10,,,,,,,,,,,,,,,,,,,,,,,,,,,,,,,,,,,,,,,,,,,,,,,,,,,,,,,,,,,,,,,,,,,,,,,,,,,,,,,,,,,,,,
Quantil 11,,,,,,,,,,,,,,,,,,,,,,,,,,,,,,,,,,,,,,,,,,,,,,,,,,,,,,,,,,,,,,,,,,,,,,,,,,,,,,,,,,,,,,
Quantil 12,,,,,,,,,,,,,,,,,,,,,,,,,,,,,,,,,,,,,,,,,,,,,,,,,,,,,,,,,,,,,,,,,,,,,,,,,,,,,,,,,,,,,,
Quantil 13,,,,,,,,,,,,,,,,,,,,,,,,,,,,,,,,,,,,,,,,,,,,,,,,,,,,,,,,,,,,,,,,,,,,,,,,,,,,,,,,,,,,,,
Quantil 14,,,,,,,,,,,,,,,,,,,,,,,,,,,,,,,,,,,,,,,,,,,,,,,,,,,,,,,,,,,,,,,,,,,,,,,,,,,,,,,,,,,,,,
Quantil 15,,,,,,,,,,,,,,,,,,,,,,,,,,,,,,,,,,,,,,,,,,,,,,,,,,,,,,,,,,,,,,,,,,,,,,,,,,,,,,,,,,,,,,
Quantil 16,,,,,,,,,,,,,,,,,,,,,,,,,,,,,,,,,,,,,,,,,,,,,,,,,,,,,,,,,,,,,,,,,,,,,,,,,,,,,,,,,,,,,,
Quantil 17,,,,,,,,,,,,,,,,,,,,,,,,,,,,,,,,,,,,,,,,,,,,,,,,,,,,,,,,,,,,,,,,,,,,,,,,,,,,,,,,,,,,,,
Quantil 18,,,,,,,,,,,,,,,,,,,,,,,,,,,,,,,,,,,,,,,,,,,,,,,,,,,,,,,,,,,,,,,,,,,,,,,,,,,,,,,,,,,,,,
Quantil 19,,,,,,,,,,,,,,,,,,,,,,,,,,,,,,,,,,,,,,,,,,,,,,,,,,,,,,,,,,,,,,,,,,,,,,,,,,,,,,,,,,,,,,
