ID,DWR:FRG:IDF,DWR:FRG:MICF,DWR:FRG:MIPF,DWR:FRG:NCF,DWR:FRG:NPF,DWR:SRG:IDF,DWR:SRG:MICF,DWR:SRG:MIPF,DWR:SRG:NCF,DWR:SRG:NPF,DefaultEnjoyingStrategyLEAVE_TIME,ESTER:FRG:IDF,ESTER:FRG:MICF,ESTER:FRG:MIPF,ESTER:FRG:NCF,ESTER:FRG:NPF,ESTER:SRG:IDF,ESTER:SRG:MICF,ESTER:SRG:MIPF,ESTER:SRG:NCF,ESTER:SRG:NPF,GraphClusteringAlgorithmCREATE_LINKAGES_TIME,GraphClusteringAlgorithmCREATE_WEIGHTED_CLUSTER_TIME,GraphClusteringAlgorithmWEIGHTED_CLUSTERING_TIME,PVISR:FRG:IDF,PVISR:FRG:MICF,PVISR:FRG:MIPF,PVISR:FRG:NCF,PVISR:FRG:NPF,PVISR:SRG:IDF,PVISR:SRG:MICF,PVISR:SRG:MIPF,PVISR:SRG:NCF,PVISR:SRG:NPF,SSTER:FRG:IDF,SSTER:FRG:MICF,SSTER:FRG:MIPF,SSTER:FRG:NCF,SSTER:FRG:NPF,SSTER:SRG:IDF,SSTER:SRG:MICF,SSTER:SRG:MIPF,SSTER:SRG:NCF,SSTER:SRG:NPF,STIR:FRG:IDF,STIR:FRG:MICF,STIR:FRG:MIPF,STIR:FRG:NCF,STIR:FRG:NPF,STIR:SRG:IDF,STIR:SRG:MICF,STIR:SRG:MIPF,STIR:SRG:NCF,STIR:SRG:NPF,SimulationTime,WSTER:FRG:IDF,WSTER:FRG:MICF,WSTER:FRG:MIPF,WSTER:FRG:NCF,WSTER:FRG:NPF,WSTER:SRG:IDF,WSTER:SRG:MICF,WSTER:SRG:MIPF,WSTER:SRG:NCF,WSTER:SRG:NPF,fastestRouteRoutingStrategyCALCULATED_TIME,fastestRouteRoutingStrategyFROM_CACHE_TIME,intrestDistanceFactorGoalStrategyFOUND_GOAL_TIME,intrestDistanceFactorGoalStrategyNO_INTEREST_TIME,mostInterestingClusterFirstGoalStrategyFOUND_GOAL_TIME,mostInterestingClusterFirstGoalStrategyNO_INTEREST_TIME,mostInterestingPlacesFirstGoalStrategyFOUND_GOAL_TIME,mostInterestingPlacesFirstGoalStrategyNO_INTEREST_TIME,nearestClusterFirstGoalStrategyFOUND_GOAL_TIME,nearestClusterFirstGoalStrategyNO_INTEREST_TIME,nearestPlacesFirstGoalStrategyFOUND_GOAL_TIME,nearestPlacesFirstGoalStrategyNO_INTEREST_TIME,shortestRouteRoutingStrategyCALCULATED_TIME,shortestRouteRoutingStrategyFROM_CACHE_TIME
Count,315.0,313.0,310.0,291.0,296.0,298.0,284.0,295.0,312.0,283.0,1915083.0,315.0,313.0,310.0,291.0,296.0,298.0,284.0,295.0,312.0,283.0,1.0,1.0,1.0,315.0,313.0,310.0,291.0,296.0,298.0,284.0,295.0,312.0,283.0,315.0,313.0,310.0,291.0,296.0,298.0,284.0,295.0,312.0,283.0,315.0,313.0,310.0,291.0,296.0,298.0,284.0,295.0,312.0,283.0,1.0,315.0,313.0,310.0,291.0,296.0,298.0,284.0,295.0,312.0,283.0,3998.0,137169.0,4918.0,613.0,4451.0,597.0,3979.0,605.0,5146.0,603.0,4818.0,579.0,4702.0,134635.0
Max,3992.076328896394,4024.004328896394,8195.707138281412,4492.798912829344,3871.2469499880317,3960.888127559325,3851.798328896394,8046.251138281413,4483.618124217671,4266.886510792663,927710.0,640.0,640.0,640.0,640.0,640.0,640.0,640.0,640.0,640.0,640.0,8372439.0,1003378.0,3.168833379E9,11.0,13.0,12.0,13.0,12.0,13.0,13.0,11.0,13.0,13.0,4580.0,4609.0,8723.0,5083.0,4471.0,4535.0,4431.0,8566.0,5069.0,4855.0,4580000.0,4609000.0,8723000.0,5083000.0,4471000.0,4535000.0,4431000.0,8566000.0,5069000.0,4855000.0,77806.0,3941.0,3970.0,8084.0,4444.0,3832.0,3896.0,3792.0,7927.0,4430.0,4216.0,7.51064681E8,1.19441759E8,1.542904223E9,2092.0,1.313654324E9,1460.0,296339.0,2169.0,1.197724584E9,1788.0,3.545651663E9,1271.0,7.60199637E8,4.8880117E7
Min,597.4786276604257,879.2060829616375,4452.838377652439,577.9467508080554,728.2710437650029,717.1920225904939,1177.7713288963946,4270.946168101139,577.9467508080554,522.3437160802384,1.0,639.0,639.0,640.0,639.0,639.0,639.0,639.0,639.0,639.0,639.0,8372439.0,1003378.0,3.168833379E9,5.0,5.0,4.0,5.0,5.0,5.0,4.0,4.0,5.0,5.0,1226.0,1506.0,5029.0,1209.0,1359.0,1348.0,1799.0,4840.0,1209.0,1156.0,1226000.0,1506000.0,5029000.0,1209000.0,1359000.0,1348000.0,1799000.0,4840000.0,1209000.0,1156000.0,77806.0,587.0,867.0,4390.0,570.0,721.0,709.0,1160.0,4201.0,570.0,517.0,2380270.0,1229.0,52688.0,59.0,54027.0,70.0,252.0,53.0,29507.0,70.0,1794.0,28.0,2129179.0,1160.0
Avg,1770.9712517763037,2071.3901310997367,6030.038046566107,1512.8928858925308,1027.2754825045472,1779.493886009493,2095.5501617484174,5888.197417152239,1551.8701056569075,1128.9897203510075,55.43179172913132,639.9936507936508,639.9968051118211,640.0,639.9828178694158,639.9898648648649,639.9865771812081,639.9753521126761,639.9898305084746,639.9903846153846,639.9893992932862,8372439.0,1003378.0,3.168833379E9,7.914285714285715,7.396166134185304,6.580645161290323,8.47766323024055,8.202702702702704,8.13758389261745,7.52112676056338,6.5728813559322035,8.586538461538462,8.445229681978798,2389.08253968254,2680.827476038339,6589.687096774193,2131.955326460481,1653.1418918918919,2396.973154362416,2703.975352112676,6439.125423728814,2170.426282051282,1753.6713780918728,2389082.5396825396,2680827.4760383386,6589687.096774193,2131955.326460481,1653141.8918918918,2396973.154362416,2703975.352112676,6439125.423728813,2170426.282051282,1753671.378091873,77806.0,1750.088888888889,2041.8306709265175,5950.687096774193,1492.9725085910652,1014.152027027027,1757.986577181208,2065.0,5800.135593220339,1531.4358974358975,1114.6819787985867,3.624457814332166E7,4322.773141161632,2.0102695910736073E7,185.44698205546493,1.3282012661649067E7,200.91122278056952,2805.243025885901,199.89752066115702,1.6289151721919937E7,212.14593698175787,2.048575177916148E7,151.293609671848,3.56395320355168E7,3474.767170498013
variance,123071.51844704969,90036.38881828696,525496.1421112628,300574.8221097699,94670.1267177981,120460.97377983703,90198.37438773311,586167.3067894812,371151.0335568933,314342.0981728425,543132.7271482346,0.006308893927941561,0.0031846808684379366,0.0,0.016886904972780226,0.010032414170927616,0.013242646727624926,0.02404036897440967,0.010066072967538097,0.00952292899408284,0.010488331730949317,0.0,0.0,0.0,1.8751927437641775,1.932509263134252,1.727367325702394,2.1395354329778775,2.107560262965672,2.29986261880095,1.7002578853402122,1.9260442401608697,1.9989213510848107,2.1480602829352353,119942.36779037523,87219.89355816648,512734.0924141524,294693.05985994544,92818.45959642081,116579.18048736603,86801.21418121416,571917.0927434645,363354.1804631004,307836.0227496897,1.1994236779037537E11,8.721989355816641E10,5.127340924141512E11,2.946930598599455E11,9.281845959642072E10,1.1657918048736542E11,8.680121418121378E10,5.719170927434653E11,3.6335418046310034E11,3.078360227496898E11,0.0,119940.855590829,87219.32915514096,512734.0924141524,294682.3772510965,92815.75053643141,116577.57028962696,86802.17605633802,571913.9544958373,363357.3740959887,307832.9518660473,4.418704444559053E15,1.5869719714816257E11,1.1841708610018748E16,19351.105264138336,8.596317417823095E15,22276.78441341268,6.518397279919445E7,50547.98288641483,8.263466357414091E15,23114.0881551337,3.76885487269186E16,16847.934518749193,4.5008350471650755E15,1.911058258904256E10
Quantil 0,,,,,,,,,,,,,,,,,,,,,,,,,,,,,,,,,,,,,,,,,,,,,,,,,,,,,,,,,,,,,,,,,,,,,,,,,,,,,,,
Quantil 1,,,,,,,,,,,,,,,,,,,,,,,,,,,,,,,,,,,,,,,,,,,,,,,,,,,,,,,,,,,,,,,,,,,,,,,,,,,,,,,
Quantil 2,,,,,,,,,,,,,,,,,,,,,,,,,,,,,,,,,,,,,,,,,,,,,,,,,,,,,,,,,,,,,,,,,,,,,,,,,,,,,,,
Quantil 3,,,,,,,,,,,,,,,,,,,,,,,,,,,,,,,,,,,,,,,,,,,,,,,,,,,,,,,,,,,,,,,,,,,,,,,,,,,,,,,
Quantil 4,,,,,,,,,,,,,,,,,,,,,,,,,,,,,,,,,,,,,,,,,,,,,,,,,,,,,,,,,,,,,,,,,,,,,,,,,,,,,,,
Quantil 5,,,,,,,,,,,,,,,,,,,,,,,,,,,,,,,,,,,,,,,,,,,,,,,,,,,,,,,,,,,,,,,,,,,,,,,,,,,,,,,
Quantil 6,,,,,,,,,,,,,,,,,,,,,,,,,,,,,,,,,,,,,,,,,,,,,,,,,,,,,,,,,,,,,,,,,,,,,,,,,,,,,,,
Quantil 7,,,,,,,,,,,,,,,,,,,,,,,,,,,,,,,,,,,,,,,,,,,,,,,,,,,,,,,,,,,,,,,,,,,,,,,,,,,,,,,
Quantil 8,,,,,,,,,,,,,,,,,,,,,,,,,,,,,,,,,,,,,,,,,,,,,,,,,,,,,,,,,,,,,,,,,,,,,,,,,,,,,,,
Quantil 9,,,,,,,,,,,,,,,,,,,,,,,,,,,,,,,,,,,,,,,,,,,,,,,,,,,,,,,,,,,,,,,,,,,,,,,,,,,,,,,
Quantil 10,,,,,,,,,,,,,,,,,,,,,,,,,,,,,,,,,,,,,,,,,,,,,,,,,,,,,,,,,,,,,,,,,,,,,,,,,,,,,,,
Quantil 11,,,,,,,,,,,,,,,,,,,,,,,,,,,,,,,,,,,,,,,,,,,,,,,,,,,,,,,,,,,,,,,,,,,,,,,,,,,,,,,
Quantil 12,,,,,,,,,,,,,,,,,,,,,,,,,,,,,,,,,,,,,,,,,,,,,,,,,,,,,,,,,,,,,,,,,,,,,,,,,,,,,,,
Quantil 13,,,,,,,,,,,,,,,,,,,,,,,,,,,,,,,,,,,,,,,,,,,,,,,,,,,,,,,,,,,,,,,,,,,,,,,,,,,,,,,
Quantil 14,,,,,,,,,,,,,,,,,,,,,,,,,,,,,,,,,,,,,,,,,,,,,,,,,,,,,,,,,,,,,,,,,,,,,,,,,,,,,,,
Quantil 15,,,,,,,,,,,,,,,,,,,,,,,,,,,,,,,,,,,,,,,,,,,,,,,,,,,,,,,,,,,,,,,,,,,,,,,,,,,,,,,
Quantil 16,,,,,,,,,,,,,,,,,,,,,,,,,,,,,,,,,,,,,,,,,,,,,,,,,,,,,,,,,,,,,,,,,,,,,,,,,,,,,,,
Quantil 17,,,,,,,,,,,,,,,,,,,,,,,,,,,,,,,,,,,,,,,,,,,,,,,,,,,,,,,,,,,,,,,,,,,,,,,,,,,,,,,
Quantil 18,,,,,,,,,,,,,,,,,,,,,,,,,,,,,,,,,,,,,,,,,,,,,,,,,,,,,,,,,,,,,,,,,,,,,,,,,,,,,,,
Quantil 19,,,,,,,,,,,,,,,,,,,,,,,,,,,,,,,,,,,,,,,,,,,,,,,,,,,,,,,,,,,,,,,,,,,,,,,,,,,,,,,
