ID,DWR:FRG:IDF,DWR:FRG:MICF,DWR:FRG:MIPF,DWR:FRG:NCF,DWR:FRG:NPF,DWR:SRG:IDF,DWR:SRG:MICF,DWR:SRG:MIPF,DWR:SRG:NCF,DWR:SRG:NPF,DefaultEnjoyingStrategyLEAVE_TIME,ESTER:FRG:IDF,ESTER:FRG:MICF,ESTER:FRG:MIPF,ESTER:FRG:NCF,ESTER:FRG:NPF,ESTER:SRG:IDF,ESTER:SRG:MICF,ESTER:SRG:MIPF,ESTER:SRG:NCF,ESTER:SRG:NPF,GraphClusteringAlgorithmCREATE_LINKAGES_TIME,GraphClusteringAlgorithmCREATE_WEIGHTED_CLUSTER_TIME,GraphClusteringAlgorithmWEIGHTED_CLUSTERING_TIME,PVISR:FRG:IDF,PVISR:FRG:MICF,PVISR:FRG:MIPF,PVISR:FRG:NCF,PVISR:FRG:NPF,PVISR:SRG:IDF,PVISR:SRG:MICF,PVISR:SRG:MIPF,PVISR:SRG:NCF,PVISR:SRG:NPF,SSTER:FRG:IDF,SSTER:FRG:MICF,SSTER:FRG:MIPF,SSTER:FRG:NCF,SSTER:FRG:NPF,SSTER:SRG:IDF,SSTER:SRG:MICF,SSTER:SRG:MIPF,SSTER:SRG:NCF,SSTER:SRG:NPF,STIR:FRG:IDF,STIR:FRG:MICF,STIR:FRG:MIPF,STIR:FRG:NCF,STIR:FRG:NPF,STIR:SRG:IDF,STIR:SRG:MICF,STIR:SRG:MIPF,STIR:SRG:NCF,STIR:SRG:NPF,TRAJECTORY_AVG,TRAJECTORY_MAX,TRAJECTORY_MIN,TRAJECTORY_VARIANCE,WSTER:FRG:IDF,WSTER:FRG:MICF,WSTER:FRG:MIPF,WSTER:FRG:NCF,WSTER:FRG:NPF,WSTER:SRG:IDF,WSTER:SRG:MICF,WSTER:SRG:MIPF,WSTER:SRG:NCF,WSTER:SRG:NPF,fastestRouteRoutingStrategyCALCULATED_TIME,fastestRouteRoutingStrategyFROM_CACHE_TIME,intrestDistanceFactorGoalStrategyFOUND_GOAL_TIME,intrestDistanceFactorGoalStrategyNO_INTEREST_TIME,mostInterestingClusterFirstGoalStrategyFOUND_GOAL_TIME,mostInterestingClusterFirstGoalStrategyNO_INTEREST_TIME,mostInterestingPlacesFirstGoalStrategyFOUND_GOAL_TIME,mostInterestingPlacesFirstGoalStrategyNO_INTEREST_TIME,nearestClusterFirstGoalStrategyFOUND_GOAL_TIME,nearestClusterFirstGoalStrategyNO_INTEREST_TIME,nearestPlacesFirstGoalStrategyFOUND_GOAL_TIME,nearestPlacesFirstGoalStrategyNO_INTEREST_TIME,shortestRouteRoutingStrategyCALCULATED_TIME,shortestRouteRoutingStrategyFROM_CACHE_TIME
Count,232.0,238.0,257.0,261.0,243.0,257.0,277.0,238.0,229.0,268.0,1676270.0,232.0,238.0,257.0,261.0,243.0,257.0,277.0,238.0,229.0,268.0,1.0,1.0,1.0,232.0,238.0,257.0,261.0,243.0,257.0,277.0,238.0,229.0,268.0,232.0,238.0,257.0,261.0,243.0,257.0,277.0,238.0,229.0,268.0,232.0,238.0,257.0,261.0,243.0,257.0,277.0,238.0,229.0,268.0,2498.0,2499.0,2498.0,2500.0,232.0,238.0,257.0,261.0,243.0,257.0,277.0,238.0,229.0,268.0,10146.0,105674.0,3979.0,489.0,4011.0,515.0,3254.0,495.0,4158.0,490.0,4310.0,511.0,10436.0,111422.0
Max,4069.858127559325,4648.314127559326,8205.430223167223,4796.480628189115,4744.303275012008,3907.268127559325,4403.586727806519,7910.599857057376,4711.209288189822,4928.084275012008,8.0795196E7,1673.0,1696.0,1722.0,1711.0,1696.0,1753.0,1753.0,1707.0,1667.0,1656.0,7566780.0,1020717.0,3.238967428E9,13.0,13.0,11.0,13.0,12.0,13.0,13.0,10.0,13.0,13.0,6257.0,6170.0,15820.0,6576.0,9384.0,8251.0,6431.0,14154.0,7305.0,5853.0,6257000.0,6170000.0,1.582E7,6576000.0,9384000.0,8251000.0,6431000.0,1.4154E7,7305000.0,5853000.0,4.9E-324,4.9E-324,1.7976931348623157E308,4.9E-324,5794.0,5512.0,15383.0,5626.0,9014.0,7445.0,5947.0,13655.0,6716.0,5106.0,7.85190184E8,2.22705939E8,1.869146808E9,1211.0,1.809274209E9,1678.0,2.19478E7,1797.0,1.653194549E9,2018.0,3.551059007E9,1318.0,7.65575513E8,2.48822629E8
Min,813.4636873674199,894.6398215336225,4406.558168101138,552.6746276604258,650.3078292317687,566.4990745025757,850.1860829616376,4015.013168101138,734.4006276604257,552.6746276604257,1.0,316.0,311.0,306.0,311.0,308.0,316.0,304.0,313.0,314.0,314.0,7566780.0,1020717.0,3.238967428E9,5.0,3.0,4.0,4.0,6.0,4.0,4.0,3.0,5.0,5.0,1219.0,1240.0,3840.0,751.0,867.0,876.0,1517.0,3567.0,1132.0,868.0,1219000.0,1240000.0,3840000.0,751000.0,867000.0,876000.0,1517000.0,3567000.0,1132000.0,868000.0,0.0,4.9E-324,1.7976931348623157E308,1.7976931348623157E308,708.0,767.0,3534.0,401.0,526.0,477.0,980.0,3065.0,678.0,513.0,2524612.0,1292.0,60016.0,73.0,66055.0,83.0,335.0,64.0,29496.0,63.0,2412.0,55.0,2483821.0,1485.0
Avg,1889.8183619999977,2202.716193948523,6002.842764795253,1614.0668317650097,1253.9395605648963,1799.7260492842368,2170.0291871777617,5868.879230267186,1709.2123942506482,1214.5856828656188,129.51064625627137,642.0,691.7521008403361,695.147859922179,657.6666666666666,680.2633744855967,667.4747081712062,671.9566787003611,658.5336134453781,683.1528384279476,666.776119402985,7566780.0,1020717.0,3.238967428E9,8.21551724137931,7.722689075630252,6.595330739299611,8.39463601532567,8.345679012345679,8.066147859922179,7.844765342960288,6.550420168067227,8.589519650655022,8.514925373134329,2610.560344827586,2991.1638655462184,6755.140077821012,2324.697318007663,2015.9053497942386,2499.875486381323,2900.259927797834,6803.76050420168,2443.048034934498,1931.5783582089553,2610560.3448275863,2991163.8655462186,6755140.077821012,2324697.318007663,2015905.3497942386,2499875.486381323,2900259.927797834,6803760.50420168,2443048.034934498,1931578.3582089553,0.0,4.9E-324,Infinity,NaN,1969.5603448275863,2300.4117647058824,6060.992217898833,1668.0306513409962,1336.641975308642,1833.4007782101166,2229.303249097473,6146.226890756303,1760.8951965065503,1265.80223880597,4.6871249142814904E7,24459.121922137896,5.2868481481276706E7,221.87525562372187,4.7832312686362505E7,243.9902912621359,16632.317148125385,244.97979797979798,4.354020681938432E7,238.4530612244898,1.0360950792853828E8,163.7495107632094,4.94064263096972E7,14526.563290912029
variance,394696.3976017413,337183.82124684437,664292.8220782613,518928.86610388895,463962.03454624704,248012.91529326633,243050.902091271,574224.1868737688,648698.4677666693,352449.8708145953,4.2228245009538164E9,102810.80172413793,113965.15283172094,114338.70187285198,105317.54022988508,119909.74133346885,97023.43223970084,108847.0161738065,94204.03878610267,120590.69716443244,112615.5692804633,0.0,0.0,0.0,2.255276456599287,2.494527222653768,1.820678587109561,2.3768294652163102,1.9957323578722768,2.3574921649078733,2.3477433564884262,1.7180460419461845,2.512728590225202,2.3467921586099276,714837.28946195,805737.4227279146,2416582.774152522,846072.5022533429,1060793.5918643838,612342.6848854638,690137.6508490923,3288798.2157510063,1087666.4387406802,569179.1617704392,7.148372894619501E11,8.057374227279148E11,2.4165827741525244E12,8.460725022533435E11,1.0607935918643839E12,6.123426848854639E11,6.901376508490922E11,3.288798215751006E12,1.08766643874068E12,5.691791617704388E11,0.0,0.0,Infinity,NaN,645034.8325653985,697870.9649036084,2246971.3073324356,722458.7500183495,990465.3244932176,496778.6603884996,550878.7383648948,3137565.301461762,947717.264125398,444870.1661143908,6.539615671340701E15,2.6943343802619175E12,4.320226243082396E16,16151.291187306848,3.9107039532685264E16,23103.8931096239,2.0814295279497012E11,60712.7107029895,3.0785876812264508E16,46347.77432736359,2.40939688724611392E17,18060.83353694264,7.159581090021199E15,1.616620192677802E12
Quantil 0,7.0,1.0,13.0,3.0,18.0,1.0,1.0,1.0,11.0,15.0,1676266.0,53.0,39.0,36.0,56.0,42.0,44.0,43.0,40.0,45.0,45.0,1.0,1.0,1.0,3.0,1.0,8.0,1.0,25.0,1.0,1.0,1.0,1.0,3.0,7.0,1.0,4.0,3.0,33.0,2.0,6.0,4.0,20.0,9.0,7.0,1.0,4.0,3.0,33.0,2.0,6.0,4.0,20.0,9.0,2498.0,2499.0,2498.0,0.0,8.0,4.0,9.0,5.0,74.0,3.0,11.0,4.0,27.0,28.0,7109.0,105651.0,3634.0,49.0,3695.0,118.0,3251.0,205.0,3827.0,155.0,4102.0,278.0,7227.0,111410.0
Quantil 1,9.0,5.0,4.0,19.0,78.0,6.0,2.0,6.0,16.0,87.0,1.0,38.0,29.0,40.0,38.0,31.0,38.0,47.0,28.0,32.0,45.0,,,,0.0,2.0,0.0,0.0,0.0,0.0,0.0,0.0,0.0,0.0,20.0,4.0,15.0,10.0,87.0,20.0,17.0,12.0,34.0,36.0,20.0,4.0,15.0,10.0,87.0,20.0,17.0,12.0,34.0,36.0,,,,0.0,22.0,3.0,32.0,25.0,110.0,33.0,8.0,11.0,53.0,53.0,942.0,1.0,29.0,192.0,43.0,188.0,0.0,148.0,45.0,226.0,2.0,69.0,932.0,0.0
Quantil 2,13.0,7.0,12.0,40.0,78.0,4.0,9.0,8.0,64.0,90.0,0.0,26.0,26.0,35.0,25.0,38.0,29.0,34.0,39.0,20.0,37.0,,,,30.0,0.0,50.0,2.0,0.0,3.0,10.0,11.0,16.0,20.0,24.0,11.0,40.0,37.0,50.0,38.0,32.0,24.0,45.0,58.0,24.0,11.0,40.0,37.0,50.0,38.0,32.0,24.0,45.0,58.0,,,,0.0,32.0,17.0,38.0,45.0,34.0,48.0,38.0,28.0,50.0,80.0,710.0,1.0,65.0,110.0,52.0,144.0,0.0,73.0,40.0,78.0,0.0,93.0,728.0,2.0
Quantil 3,9.0,6.0,7.0,58.0,36.0,19.0,10.0,3.0,41.0,37.0,1.0,18.0,29.0,26.0,28.0,23.0,31.0,33.0,29.0,21.0,23.0,,,,0.0,11.0,0.0,0.0,46.0,0.0,0.0,0.0,0.0,0.0,33.0,28.0,43.0,51.0,41.0,64.0,46.0,28.0,39.0,55.0,33.0,28.0,43.0,51.0,41.0,64.0,46.0,28.0,39.0,55.0,,,,0.0,37.0,32.0,57.0,56.0,10.0,73.0,58.0,36.0,36.0,52.0,498.0,2.0,54.0,75.0,32.0,35.0,0.0,24.0,36.0,10.0,8.0,45.0,489.0,1.0
Quantil 4,27.0,14.0,33.0,41.0,18.0,8.0,10.0,9.0,6.0,22.0,1.0,9.0,19.0,15.0,17.0,16.0,16.0,17.0,12.0,18.0,21.0,,,,41.0,0.0,0.0,22.0,0.0,40.0,39.0,0.0,45.0,42.0,34.0,28.0,56.0,45.0,13.0,53.0,42.0,34.0,25.0,37.0,34.0,28.0,56.0,45.0,13.0,53.0,42.0,34.0,25.0,37.0,,,,0.0,47.0,31.0,50.0,42.0,0.0,46.0,55.0,35.0,19.0,22.0,318.0,4.0,31.0,28.0,24.0,15.0,0.0,6.0,28.0,4.0,11.0,12.0,376.0,2.0
Quantil 5,57.0,63.0,6.0,13.0,1.0,28.0,10.0,26.0,33.0,6.0,0.0,16.0,17.0,7.0,15.0,13.0,21.0,13.0,15.0,11.0,13.0,,,,0.0,38.0,70.0,0.0,0.0,0.0,0.0,40.0,0.0,0.0,25.0,36.0,32.0,29.0,4.0,30.0,37.0,38.0,16.0,27.0,25.0,36.0,32.0,29.0,4.0,30.0,37.0,38.0,16.0,27.0,,,,0.0,30.0,48.0,21.0,28.0,3.0,28.0,33.0,32.0,12.0,10.0,182.0,2.0,22.0,13.0,22.0,5.0,1.0,5.0,29.0,1.0,9.0,3.0,204.0,0.0
Quantil 6,36.0,79.0,42.0,54.0,1.0,33.0,113.0,4.0,16.0,1.0,0.0,11.0,11.0,14.0,11.0,10.0,14.0,14.0,11.0,14.0,8.0,,,,0.0,0.0,0.0,55.0,62.0,47.0,77.0,0.0,0.0,0.0,31.0,26.0,21.0,26.0,3.0,25.0,25.0,20.0,18.0,16.0,31.0,26.0,21.0,26.0,3.0,25.0,25.0,20.0,18.0,16.0,,,,0.0,12.0,23.0,21.0,17.0,0.0,10.0,28.0,24.0,9.0,7.0,152.0,1.0,14.0,6.0,22.0,1.0,0.0,0.0,19.0,1.0,4.0,1.0,172.0,0.0
Quantil 7,36.0,17.0,3.0,11.0,0.0,83.0,53.0,4.0,21.0,0.0,0.0,12.0,4.0,14.0,11.0,10.0,10.0,19.0,17.0,10.0,13.0,,,,64.0,59.0,0.0,0.0,0.0,0.0,0.0,0.0,58.0,76.0,15.0,26.0,19.0,19.0,2.0,13.0,15.0,20.0,8.0,10.0,15.0,26.0,19.0,19.0,2.0,13.0,15.0,20.0,8.0,10.0,,,,0.0,16.0,21.0,12.0,10.0,3.0,5.0,17.0,19.0,7.0,2.0,91.0,1.0,16.0,2.0,11.0,0.0,0.0,3.0,26.0,0.0,10.0,2.0,116.0,1.0
Quantil 8,12.0,15.0,16.0,10.0,0.0,28.0,13.0,43.0,3.0,0.0,0.0,6.0,15.0,7.0,12.0,10.0,13.0,7.0,6.0,10.0,5.0,,,,0.0,0.0,68.0,61.0,0.0,79.0,62.0,63.0,0.0,0.0,16.0,26.0,13.0,13.0,2.0,7.0,21.0,17.0,8.0,6.0,16.0,26.0,13.0,13.0,2.0,7.0,21.0,17.0,8.0,6.0,,,,0.0,4.0,19.0,5.0,10.0,2.0,6.0,9.0,9.0,1.0,2.0,56.0,1.0,13.0,2.0,12.0,1.0,0.0,4.0,14.0,0.0,10.0,0.0,57.0,1.0
Quantil 9,4.0,5.0,46.0,0.0,0.0,27.0,18.0,28.0,1.0,0.0,0.0,9.0,7.0,18.0,8.0,5.0,3.0,10.0,8.0,9.0,7.0,,,,49.0,54.0,0.0,0.0,59.0,0.0,0.0,0.0,42.0,65.0,4.0,10.0,5.0,7.0,1.0,1.0,11.0,10.0,3.0,0.0,4.0,10.0,5.0,7.0,1.0,1.0,11.0,10.0,3.0,0.0,,,,0.0,5.0,9.0,4.0,7.0,0.0,2.0,5.0,13.0,1.0,1.0,18.0,1.0,14.0,3.0,13.0,1.0,0.0,6.0,24.0,6.0,11.0,0.0,37.0,0.0
Quantil 10,1.0,4.0,15.0,0.0,0.0,4.0,10.0,43.0,1.0,0.0,0.0,4.0,7.0,9.0,7.0,8.0,9.0,5.0,4.0,4.0,8.0,,,,0.0,0.0,0.0,0.0,0.0,0.0,0.0,0.0,0.0,0.0,4.0,11.0,3.0,7.0,3.0,1.0,7.0,10.0,3.0,3.0,4.0,11.0,3.0,7.0,3.0,1.0,7.0,10.0,3.0,3.0,,,,0.0,5.0,8.0,3.0,0.0,4.0,1.0,2.0,10.0,4.0,2.0,13.0,3.0,20.0,2.0,16.0,0.0,0.0,7.0,14.0,0.0,11.0,1.0,18.0,3.0
Quantil 11,0.0,3.0,7.0,0.0,1.0,1.0,13.0,11.0,2.0,0.0,0.0,5.0,3.0,7.0,8.0,4.0,6.0,4.0,6.0,5.0,7.0,,,,0.0,46.0,40.0,61.0,0.0,41.0,51.0,70.0,0.0,0.0,6.0,9.0,2.0,4.0,2.0,2.0,2.0,6.0,1.0,1.0,6.0,9.0,2.0,4.0,2.0,2.0,2.0,6.0,1.0,1.0,,,,0.0,5.0,4.0,2.0,3.0,1.0,1.0,1.0,7.0,3.0,1.0,8.0,1.0,16.0,1.0,17.0,1.0,1.0,4.0,13.0,2.0,19.0,1.0,23.0,0.0
Quantil 12,0.0,1.0,4.0,1.0,1.0,3.0,1.0,8.0,0.0,0.0,0.0,10.0,7.0,5.0,3.0,6.0,4.0,6.0,6.0,2.0,5.0,,,,29.0,0.0,0.0,0.0,0.0,0.0,0.0,0.0,42.0,37.0,6.0,7.0,1.0,1.0,0.0,0.0,3.0,6.0,1.0,2.0,6.0,7.0,1.0,1.0,0.0,0.0,3.0,6.0,1.0,2.0,,,,0.0,2.0,6.0,1.0,3.0,0.0,0.0,2.0,2.0,1.0,1.0,11.0,0.0,15.0,1.0,12.0,2.0,0.0,2.0,10.0,2.0,16.0,0.0,9.0,0.0
Quantil 13,5.0,0.0,2.0,0.0,0.0,1.0,2.0,3.0,0.0,2.0,0.0,0.0,6.0,6.0,8.0,7.0,6.0,5.0,5.0,4.0,4.0,,,,0.0,18.0,0.0,36.0,37.0,27.0,22.0,0.0,0.0,0.0,1.0,2.0,1.0,2.0,0.0,0.0,1.0,1.0,0.0,1.0,1.0,2.0,1.0,2.0,0.0,0.0,1.0,1.0,0.0,1.0,,,,0.0,2.0,2.0,0.0,0.0,0.0,0.0,3.0,1.0,0.0,2.0,7.0,1.0,13.0,0.0,16.0,0.0,0.0,3.0,13.0,1.0,18.0,0.0,6.0,0.0
Quantil 14,1.0,9.0,33.0,0.0,1.0,0.0,3.0,2.0,0.0,4.0,0.0,0.0,3.0,3.0,4.0,4.0,1.0,4.0,3.0,4.0,6.0,,,,12.0,0.0,15.0,0.0,0.0,0.0,0.0,36.0,13.0,14.0,1.0,1.0,0.0,2.0,0.0,0.0,4.0,1.0,2.0,2.0,1.0,1.0,0.0,2.0,0.0,0.0,4.0,1.0,2.0,2.0,,,,0.0,1.0,0.0,0.0,4.0,0.0,0.0,1.0,1.0,0.0,0.0,3.0,1.0,8.0,1.0,11.0,1.0,0.0,2.0,10.0,0.0,19.0,2.0,8.0,0.0
Quantil 15,0.0,1.0,3.0,0.0,4.0,2.0,2.0,28.0,0.0,1.0,0.0,6.0,3.0,3.0,0.0,3.0,6.0,7.0,1.0,4.0,5.0,,,,0.0,5.0,0.0,14.0,0.0,15.0,10.0,0.0,0.0,0.0,0.0,1.0,0.0,0.0,0.0,0.0,3.0,3.0,1.0,0.0,0.0,1.0,0.0,0.0,0.0,0.0,3.0,3.0,1.0,0.0,,,,0.0,0.0,3.0,1.0,2.0,1.0,0.0,2.0,2.0,1.0,0.0,2.0,0.0,9.0,1.0,8.0,1.0,0.0,0.0,4.0,0.0,16.0,0.0,5.0,1.0
Quantil 16,0.0,5.0,3.0,0.0,2.0,0.0,5.0,3.0,1.0,1.0,0.0,2.0,4.0,6.0,3.0,3.0,2.0,5.0,3.0,6.0,6.0,,,,0.0,0.0,0.0,0.0,9.0,0.0,0.0,0.0,0.0,0.0,3.0,4.0,0.0,3.0,0.0,0.0,1.0,1.0,2.0,2.0,3.0,4.0,0.0,3.0,0.0,0.0,1.0,1.0,2.0,2.0,,,,0.0,3.0,2.0,0.0,0.0,0.0,0.0,2.0,2.0,2.0,2.0,16.0,1.0,2.0,1.0,1.0,1.0,0.0,0.0,2.0,1.0,9.0,2.0,13.0,0.0
Quantil 17,8.0,1.0,5.0,4.0,2.0,6.0,1.0,5.0,5.0,1.0,0.0,2.0,4.0,1.0,1.0,2.0,2.0,1.0,1.0,3.0,6.0,,,,3.0,2.0,4.0,8.0,0.0,3.0,4.0,14.0,10.0,7.0,1.0,3.0,1.0,0.0,1.0,0.0,3.0,2.0,1.0,1.0,1.0,3.0,1.0,0.0,1.0,0.0,3.0,2.0,1.0,1.0,,,,0.0,0.0,3.0,0.0,2.0,0.0,0.0,1.0,1.0,2.0,1.0,3.0,1.0,1.0,0.0,1.0,0.0,0.0,0.0,0.0,1.0,19.0,0.0,6.0,0.0
Quantil 18,3.0,1.0,1.0,4.0,1.0,2.0,0.0,1.0,7.0,0.0,0.0,4.0,1.0,3.0,3.0,4.0,0.0,0.0,3.0,2.0,3.0,,,,0.0,0.0,0.0,0.0,0.0,0.0,0.0,0.0,0.0,0.0,0.0,0.0,0.0,0.0,0.0,0.0,0.0,0.0,0.0,1.0,0.0,0.0,0.0,0.0,0.0,0.0,0.0,0.0,0.0,1.0,,,,0.0,0.0,1.0,0.0,1.0,0.0,0.0,0.0,0.0,0.0,1.0,1.0,0.0,2.0,0.0,2.0,0.0,0.0,0.0,2.0,0.0,10.0,0.0,6.0,0.0
Quantil 19,4.0,1.0,2.0,3.0,1.0,1.0,1.0,2.0,1.0,1.0,1.0,1.0,4.0,2.0,3.0,4.0,2.0,3.0,1.0,5.0,1.0,,,,1.0,2.0,2.0,1.0,5.0,1.0,1.0,3.0,2.0,4.0,1.0,4.0,1.0,2.0,1.0,1.0,1.0,1.0,2.0,1.0,1.0,4.0,1.0,2.0,1.0,1.0,1.0,1.0,2.0,1.0,,,,0.0,1.0,2.0,1.0,1.0,1.0,1.0,1.0,1.0,1.0,1.0,6.0,1.0,1.0,2.0,1.0,1.0,1.0,3.0,2.0,2.0,6.0,2.0,4.0,1.0
