ID,CircleDistributionStrategyTIME,DWR:FRG:IDF,DWR:FRG:MICF,DWR:FRG:MIPF,DWR:FRG:NCF,DWR:FRG:NPF,DWR:SRG:IDF,DWR:SRG:MICF,DWR:SRG:MIPF,DWR:SRG:NCF,DWR:SRG:NPF,DefaultEnjoyingStrategyLEAVE_TIME,DefaultReconstructionStrategyABORTED_TIME,DefaultReconstructionStrategyFOUND_POINT_ABORTED_TIME,DefaultReconstructionStrategyFOUND_POINT_TIME,DefaultReconstructionStrategyNO_STATION,DefaultReconstructionStrategyPOINTS_FOUND,ESTER:FRG:IDF,ESTER:FRG:MICF,ESTER:FRG:MIPF,ESTER:FRG:NCF,ESTER:FRG:NPF,ESTER:SRG:IDF,ESTER:SRG:MICF,ESTER:SRG:MIPF,ESTER:SRG:NCF,ESTER:SRG:NPF,GraphClusteringAlgorithmCREATE_LINKAGES_TIME,GraphClusteringAlgorithmCREATE_WEIGHTED_CLUSTER_TIME,GraphClusteringAlgorithmWEIGHTED_CLUSTERING_TIME,PVISR:FRG:IDF,PVISR:FRG:MICF,PVISR:FRG:MIPF,PVISR:FRG:NCF,PVISR:FRG:NPF,PVISR:SRG:IDF,PVISR:SRG:MICF,PVISR:SRG:MIPF,PVISR:SRG:NCF,PVISR:SRG:NPF,SSTER:FRG:IDF,SSTER:FRG:MICF,SSTER:FRG:MIPF,SSTER:FRG:NCF,SSTER:FRG:NPF,SSTER:SRG:IDF,SSTER:SRG:MICF,SSTER:SRG:MIPF,SSTER:SRG:NCF,SSTER:SRG:NPF,STIR:FRG:IDF,STIR:FRG:MICF,STIR:FRG:MIPF,STIR:FRG:NCF,STIR:FRG:NPF,STIR:SRG:IDF,STIR:SRG:MICF,STIR:SRG:MIPF,STIR:SRG:NCF,STIR:SRG:NPF,SimulationTime,TRAJECTORY,WSTER:FRG:IDF,WSTER:FRG:MICF,WSTER:FRG:MIPF,WSTER:FRG:NCF,WSTER:FRG:NPF,WSTER:SRG:IDF,WSTER:SRG:MICF,WSTER:SRG:MIPF,WSTER:SRG:NCF,WSTER:SRG:NPF,fastestRouteRoutingStrategyCALCULATED_TIME,fastestRouteRoutingStrategyFROM_CACHE_TIME,intrestDistanceFactorGoalStrategyFOUND_GOAL_TIME,intrestDistanceFactorGoalStrategyNO_INTEREST_TIME,mostInterestingClusterFirstGoalStrategyFOUND_GOAL_TIME,mostInterestingClusterFirstGoalStrategyNO_INTEREST_TIME,mostInterestingPlacesFirstGoalStrategyFOUND_GOAL_TIME,mostInterestingPlacesFirstGoalStrategyNO_INTEREST_TIME,nearestClusterFirstGoalStrategyFOUND_GOAL_TIME,nearestClusterFirstGoalStrategyNO_INTEREST_TIME,nearestPlacesFirstGoalStrategyFOUND_GOAL_TIME,nearestPlacesFirstGoalStrategyNO_INTEREST_TIME,shortestRouteRoutingStrategyCALCULATED_TIME,shortestRouteRoutingStrategyFROM_CACHE_TIME
Count,1.0,303.0,315.0,282.0,283.0,296.0,319.0,281.0,291.0,297.0,333.0,1917000.0,1.0,22.0,216506.0,23.0,216528.0,303.0,315.0,282.0,283.0,296.0,319.0,281.0,291.0,297.0,333.0,1.0,1.0,1.0,303.0,315.0,282.0,283.0,296.0,319.0,281.0,291.0,297.0,333.0,303.0,315.0,282.0,283.0,296.0,319.0,281.0,291.0,297.0,333.0,303.0,315.0,282.0,283.0,296.0,319.0,281.0,291.0,297.0,333.0,1.0,216482.0,303.0,315.0,282.0,283.0,296.0,319.0,281.0,291.0,297.0,333.0,7454.0,115039.0,4678.0,622.0,4485.0,596.0,3665.0,573.0,4717.0,580.0,5126.0,629.0,7970.0,115251.0
Max,5180414.0,5718.717328896394,4877.914103166996,8146.467054639304,4778.398288189821,5093.322484563309,4392.63472780652,4367.182727806519,7567.551857057373,5296.231628189114,4930.530111039858,1.9726137E7,1.22089358E8,1.69782486E8,9.9186868E7,52085.0,10.0,640.0,640.0,640.0,640.0,640.0,640.0,640.0,640.0,640.0,640.0,7919761.0,1033628.0,3.23772953E9,13.0,13.0,12.0,12.0,14.0,12.0,12.0,10.0,13.0,13.0,6288.0,5446.0,8674.0,5365.0,5673.0,4957.0,4934.0,8107.0,5888.0,5511.0,6288000.0,5446000.0,8674000.0,5365000.0,5673000.0,4957000.0,4934000.0,8107000.0,5888000.0,5511000.0,49695.0,47.95791459478769,5649.0,4807.0,8035.0,4726.0,5034.0,4318.0,4295.0,7468.0,5249.0,4872.0,8.2272084E7,9.4765304E7,3.38592435E8,2665.0,3.73052676E8,3451.0,2.0690537E7,3596.0,3.44694058E8,3145.0,8.20139098E8,1958.0,1.57042973E8,5.1295657E7
Min,5180414.0,987.4080829616375,1141.3363288963944,4070.705168101138,630.3651654161106,691.1153221723772,820.8576406866905,1317.7113288963947,3930.4271681011387,705.1040829616376,667.7705148288719,1.0,1.22089358E8,1.00001471E8,30034.0,70.0,1.0,639.0,639.0,639.0,639.0,639.0,639.0,639.0,639.0,639.0,639.0,7919761.0,1033628.0,3.23772953E9,4.0,5.0,3.0,4.0,5.0,4.0,5.0,3.0,5.0,5.0,1614.0,1763.0,4657.0,1266.0,1317.0,1447.0,1937.0,4508.0,1334.0,1298.0,1614000.0,1763000.0,4657000.0,1266000.0,1317000.0,1447000.0,1937000.0,4508000.0,1334000.0,1298000.0,49695.0,0.004563816352323538,975.0,1124.0,4018.0,627.0,678.0,808.0,1298.0,3869.0,695.0,659.0,2447224.0,1434.0,57448.0,105.0,73260.0,124.0,381.0,70.0,30846.0,122.0,2548.0,53.0,2495109.0,1479.0
Avg,5180414.0,3102.2968098535603,3267.5027387896052,5544.8598065834185,3671.889015806537,3370.1969635619657,2968.1636439122417,3119.2776184040845,5322.437236584248,3679.6755745912656,3298.3997531774853,87.56944913928012,1.22089358E8,1.1464021145454545E8,806929.588343972,2422.5652173913045,9.999570494347152,639.990099009901,639.9936507936508,639.9964539007092,639.9858657243816,639.9864864864865,639.9905956112852,639.982206405694,639.9896907216495,639.993265993266,639.996996996997,7919761.0,1033628.0,3.23772953E9,7.554455445544554,7.552380952380952,6.4361702127659575,8.098939929328623,8.199324324324325,7.4890282131661445,7.494661921708185,6.357388316151202,8.164983164983164,8.105105105105105,3700.138613861386,3862.7492063492064,6108.843971631206,4271.296819787985,3973.260135135135,3559.8777429467086,3708.4661921708184,5878.563573883162,4277.481481481482,3900.087087087087,3700138.613861386,3862749.206349206,6108843.971631206,4271296.819787986,3973260.135135135,3559877.7429467086,3708466.1921708183,5878563.573883162,4277481.481481481,3900087.087087087,49695.0,16.02990550563572,3061.1485148514853,3223.7555555555555,5469.847517730496,3632.310954063604,3334.2736486486488,2920.8871473354234,3069.4839857651245,5239.573883161512,3638.4882154882157,3261.09009009009,1.2124242134961095E7,7010.500864924069,7670042.147285164,340.63987138263667,7262771.758751393,359.57214765100673,9043.852933151433,304.0331588132635,5485616.874496502,361.3448275862069,1.6323541437182989E7,177.00635930047696,1.2530407400250942E7,6149.681738119409
variance,0.0,578975.7304775683,539029.8106492887,714967.9366535867,1239338.4268419428,1373754.7208797701,596342.5595072508,445952.12216628494,619098.7903825361,1049928.374845536,1204174.386155187,3.3036691916023874E8,0.0,4.042221365678128E14,1.4039287541671902E13,1.121108891153119E8,0.00247986429456493,0.009802960494069268,0.006308893927941584,0.0035335244706000968,0.013934497871118341,0.013330898466033577,0.009315946187635857,0.017476982307721496,0.010202997130407183,0.006688659887313129,0.002993984975966964,0.0,0.0,0.0,2.2668365846485643,1.974240362811793,1.8913158291836458,2.0538151306671297,2.321756300219129,1.74831222177455,1.8727473056318957,1.6111052065988731,2.3936559761475587,1.997961925889845,564205.6045485733,525773.1085311166,697481.7841657872,1219845.6080110874,1349583.6113837648,576678.8910093253,430658.58337660343,604332.5552367116,1029243.367502182,1179716.367791214,5.642056045485728E11,5.257731085311161E11,6.974817841657865E11,1.219845608011087E12,1.349583611383765E12,5.766788910093262E11,4.3065858337660394E11,6.043325552367119E11,1.0292433675021826E12,1.1797163677912146E12,0.0,57.23156462939709,564213.9416397087,525775.3021516757,697474.1221392289,1219840.74429697,1349538.1041704721,576689.0092078507,430643.900989096,604328.0864656768,1029251.3811742575,1179717.95584774,1.4251124012411712E14,1.5775643133070297E11,1.4804706825280108E15,67446.70632024069,1.3929852338078305E15,93742.96962693126,1.1680619695131995E11,158987.26068059783,8.793882952351195E14,94506.40868014278,9.390493411791036E15,25743.92682760382,1.5814585795288478E14,6.4773675855409874E10
Quantil 0,,,,,,,,,,,,,,,,,,,,,,,,,,,,,,,,,,,,,,,,,,,,,,,,,,,,,,,,,,,,,,,,,,,,,,,,,,,,,,,,,,,,,,
Quantil 1,,,,,,,,,,,,,,,,,,,,,,,,,,,,,,,,,,,,,,,,,,,,,,,,,,,,,,,,,,,,,,,,,,,,,,,,,,,,,,,,,,,,,,
Quantil 2,,,,,,,,,,,,,,,,,,,,,,,,,,,,,,,,,,,,,,,,,,,,,,,,,,,,,,,,,,,,,,,,,,,,,,,,,,,,,,,,,,,,,,
Quantil 3,,,,,,,,,,,,,,,,,,,,,,,,,,,,,,,,,,,,,,,,,,,,,,,,,,,,,,,,,,,,,,,,,,,,,,,,,,,,,,,,,,,,,,
Quantil 4,,,,,,,,,,,,,,,,,,,,,,,,,,,,,,,,,,,,,,,,,,,,,,,,,,,,,,,,,,,,,,,,,,,,,,,,,,,,,,,,,,,,,,
Quantil 5,,,,,,,,,,,,,,,,,,,,,,,,,,,,,,,,,,,,,,,,,,,,,,,,,,,,,,,,,,,,,,,,,,,,,,,,,,,,,,,,,,,,,,
Quantil 6,,,,,,,,,,,,,,,,,,,,,,,,,,,,,,,,,,,,,,,,,,,,,,,,,,,,,,,,,,,,,,,,,,,,,,,,,,,,,,,,,,,,,,
Quantil 7,,,,,,,,,,,,,,,,,,,,,,,,,,,,,,,,,,,,,,,,,,,,,,,,,,,,,,,,,,,,,,,,,,,,,,,,,,,,,,,,,,,,,,
Quantil 8,,,,,,,,,,,,,,,,,,,,,,,,,,,,,,,,,,,,,,,,,,,,,,,,,,,,,,,,,,,,,,,,,,,,,,,,,,,,,,,,,,,,,,
Quantil 9,,,,,,,,,,,,,,,,,,,,,,,,,,,,,,,,,,,,,,,,,,,,,,,,,,,,,,,,,,,,,,,,,,,,,,,,,,,,,,,,,,,,,,
Quantil 10,,,,,,,,,,,,,,,,,,,,,,,,,,,,,,,,,,,,,,,,,,,,,,,,,,,,,,,,,,,,,,,,,,,,,,,,,,,,,,,,,,,,,,
Quantil 11,,,,,,,,,,,,,,,,,,,,,,,,,,,,,,,,,,,,,,,,,,,,,,,,,,,,,,,,,,,,,,,,,,,,,,,,,,,,,,,,,,,,,,
Quantil 12,,,,,,,,,,,,,,,,,,,,,,,,,,,,,,,,,,,,,,,,,,,,,,,,,,,,,,,,,,,,,,,,,,,,,,,,,,,,,,,,,,,,,,
Quantil 13,,,,,,,,,,,,,,,,,,,,,,,,,,,,,,,,,,,,,,,,,,,,,,,,,,,,,,,,,,,,,,,,,,,,,,,,,,,,,,,,,,,,,,
Quantil 14,,,,,,,,,,,,,,,,,,,,,,,,,,,,,,,,,,,,,,,,,,,,,,,,,,,,,,,,,,,,,,,,,,,,,,,,,,,,,,,,,,,,,,
Quantil 15,,,,,,,,,,,,,,,,,,,,,,,,,,,,,,,,,,,,,,,,,,,,,,,,,,,,,,,,,,,,,,,,,,,,,,,,,,,,,,,,,,,,,,
Quantil 16,,,,,,,,,,,,,,,,,,,,,,,,,,,,,,,,,,,,,,,,,,,,,,,,,,,,,,,,,,,,,,,,,,,,,,,,,,,,,,,,,,,,,,
Quantil 17,,,,,,,,,,,,,,,,,,,,,,,,,,,,,,,,,,,,,,,,,,,,,,,,,,,,,,,,,,,,,,,,,,,,,,,,,,,,,,,,,,,,,,
Quantil 18,,,,,,,,,,,,,,,,,,,,,,,,,,,,,,,,,,,,,,,,,,,,,,,,,,,,,,,,,,,,,,,,,,,,,,,,,,,,,,,,,,,,,,
Quantil 19,,,,,,,,,,,,,,,,,,,,,,,,,,,,,,,,,,,,,,,,,,,,,,,,,,,,,,,,,,,,,,,,,,,,,,,,,,,,,,,,,,,,,,
