ID,CircleDistributionStrategyTIME,DWR:FRG:IDF,DWR:FRG:MICF,DWR:FRG:MIPF,DWR:FRG:NCF,DWR:FRG:NPF,DWR:SRG:IDF,DWR:SRG:MICF,DWR:SRG:MIPF,DWR:SRG:NCF,DWR:SRG:NPF,DefaultEnjoyingStrategyLEAVE_TIME,DefaultReconstructionStrategyABORTED_TIME,DefaultReconstructionStrategyFOUND_POINT_ABORTED_TIME,DefaultReconstructionStrategyFOUND_POINT_TIME,DefaultReconstructionStrategyNO_STATION,DefaultReconstructionStrategyPOINTS_FOUND,ESTER:FRG:IDF,ESTER:FRG:MICF,ESTER:FRG:MIPF,ESTER:FRG:NCF,ESTER:FRG:NPF,ESTER:SRG:IDF,ESTER:SRG:MICF,ESTER:SRG:MIPF,ESTER:SRG:NCF,ESTER:SRG:NPF,GraphClusteringAlgorithmCREATE_LINKAGES_TIME,GraphClusteringAlgorithmCREATE_WEIGHTED_CLUSTER_TIME,GraphClusteringAlgorithmWEIGHTED_CLUSTERING_TIME,PVISR:FRG:IDF,PVISR:FRG:MICF,PVISR:FRG:MIPF,PVISR:FRG:NCF,PVISR:FRG:NPF,PVISR:SRG:IDF,PVISR:SRG:MICF,PVISR:SRG:MIPF,PVISR:SRG:NCF,PVISR:SRG:NPF,SSTER:FRG:IDF,SSTER:FRG:MICF,SSTER:FRG:MIPF,SSTER:FRG:NCF,SSTER:FRG:NPF,SSTER:SRG:IDF,SSTER:SRG:MICF,SSTER:SRG:MIPF,SSTER:SRG:NCF,SSTER:SRG:NPF,STIR:FRG:IDF,STIR:FRG:MICF,STIR:FRG:MIPF,STIR:FRG:NCF,STIR:FRG:NPF,STIR:SRG:IDF,STIR:SRG:MICF,STIR:SRG:MIPF,STIR:SRG:NCF,STIR:SRG:NPF,SimulationTime,TRAJECTORY,WSTER:FRG:IDF,WSTER:FRG:MICF,WSTER:FRG:MIPF,WSTER:FRG:NCF,WSTER:FRG:NPF,WSTER:SRG:IDF,WSTER:SRG:MICF,WSTER:SRG:MIPF,WSTER:SRG:NCF,WSTER:SRG:NPF,fastestRouteRoutingStrategyCALCULATED_TIME,fastestRouteRoutingStrategyFROM_CACHE_TIME,intrestDistanceFactorGoalStrategyFOUND_GOAL_TIME,intrestDistanceFactorGoalStrategyNO_INTEREST_TIME,mostInterestingClusterFirstGoalStrategyFOUND_GOAL_TIME,mostInterestingClusterFirstGoalStrategyNO_INTEREST_TIME,mostInterestingPlacesFirstGoalStrategyFOUND_GOAL_TIME,mostInterestingPlacesFirstGoalStrategyNO_INTEREST_TIME,nearestClusterFirstGoalStrategyFOUND_GOAL_TIME,nearestClusterFirstGoalStrategyNO_INTEREST_TIME,nearestPlacesFirstGoalStrategyFOUND_GOAL_TIME,nearestPlacesFirstGoalStrategyNO_INTEREST_TIME,shortestRouteRoutingStrategyCALCULATED_TIME,shortestRouteRoutingStrategyFROM_CACHE_TIME
Count,1.0,103.0,96.0,107.0,94.0,107.0,89.0,101.0,110.0,86.0,107.0,639000.0,39.0,802.0,52011.0,0.0,52813.0,103.0,96.0,107.0,94.0,107.0,89.0,101.0,110.0,86.0,107.0,1.0,1.0,1.0,103.0,96.0,107.0,94.0,107.0,89.0,101.0,110.0,86.0,107.0,103.0,96.0,107.0,94.0,107.0,89.0,101.0,110.0,86.0,107.0,103.0,96.0,107.0,94.0,107.0,89.0,101.0,110.0,86.0,107.0,1.0,52018.0,103.0,96.0,107.0,94.0,107.0,89.0,101.0,110.0,86.0,107.0,2906.0,43380.0,1570.0,192.0,1494.0,197.0,1385.0,217.0,1503.0,180.0,1725.0,214.0,2972.0,40932.0
Max,5111204.0,3672.173328896394,3677.5273288963945,7767.682857057374,4451.873912829344,4126.274889616889,3469.967691698841,3581.6073288963944,7074.265857057375,4497.2169128293435,3801.2469499880317,2.62249906E8,4.88088909E8,9.74186239E8,1.16141615E8,4.9E-324,20.0,640.0,640.0,640.0,640.0,640.0,640.0,640.0,640.0,640.0,640.0,7811297.0,961409.0,3.179546891E9,12.0,12.0,10.0,12.0,12.0,13.0,12.0,10.0,12.0,12.0,4262.0,4268.0,8302.0,5045.0,4726.0,4055.0,4165.0,7609.0,5082.0,4398.0,4262000.0,4268000.0,8302000.0,5045000.0,4726000.0,4055000.0,4165000.0,7609000.0,5082000.0,4398000.0,18041.0,43.082018960807694,3623.0,3629.0,7663.0,4406.0,4087.0,3416.0,3526.0,6970.0,4443.0,3759.0,8.74453462E8,3.24180662E8,3.055378168E9,570.0,2.79125178E9,488.0,280126.0,2146.0,2.640250593E9,371.0,5.103356197E9,655.0,8.70345347E8,1.6443011E8
Min,5111204.0,813.4636873674199,953.9700829616376,4406.558168101137,577.9467508080554,579.6690674683795,922.7562299103669,1373.8693288963946,4266.280168101137,577.9467508080554,728.2710437650029,1.0,1.01696291E8,1.00001233E8,67255.0,1.7976931348623157E308,1.0,639.0,639.0,639.0,639.0,639.0,639.0,640.0,639.0,639.0,639.0,7811297.0,961409.0,3.179546891E9,5.0,5.0,4.0,5.0,5.0,6.0,5.0,4.0,5.0,6.0,1437.0,1579.0,4985.0,1209.0,1212.0,1547.0,1991.0,4837.0,1209.0,1360.0,1437000.0,1579000.0,4985000.0,1209000.0,1212000.0,1547000.0,1991000.0,4837000.0,1209000.0,1360000.0,18041.0,0.01244872542849212,798.0,940.0,4346.0,570.0,573.0,908.0,1352.0,4198.0,570.0,721.0,2462639.0,1366.0,80087.0,87.0,96138.0,75.0,540.0,75.0,35355.0,110.0,6219.0,68.0,2945207.0,1586.0
Avg,5111204.0,1790.931683145071,2087.279140368106,5904.112827551926,1537.8872155710922,1042.6564370802907,1818.1571301713843,2112.1435660944985,5782.783333687474,1585.636003181504,1110.0303253128322,613.8360015649453,1.9109295856410256E8,2.1112987597256857E8,1850099.5365788005,NaN,19.84753753810615,639.9902912621359,639.96875,639.9719626168225,639.9893617021277,639.981308411215,639.9887640449438,640.0,639.9909090909091,639.9883720930233,639.981308411215,7811297.0,961409.0,3.179546891E9,8.097087378640778,7.697916666666667,6.327102803738318,8.351063829787234,7.962616822429907,8.269662921348315,7.475247524752476,6.4363636363636365,8.348837209302326,8.158878504672897,2408.378640776699,2696.03125,6464.869158878505,2156.691489361702,1667.9252336448599,2435.044943820225,2719.9504950495048,6334.918181818181,2203.953488372093,1734.7757009345794,2408378.640776699,2696031.25,6464869.158878504,2156691.489361702,1667925.2336448599,2435044.9438202246,2719950.495049505,6334918.181818182,2203953.488372093,1734775.7009345794,18041.0,16.318380666196603,1769.388349514563,2057.0625,5825.897196261682,1517.7021276595744,1028.943925233645,1796.056179775281,2080.9504950495048,5695.927272727273,1564.9651162790697,1095.7943925233644,6.3075427186166555E7,44817.50299677271,5.1897979994267516E7,208.625,5.77541445562249E7,184.09137055837564,7098.91046931408,298.0783410138249,6.894717673120426E7,202.57777777777778,8.886346846550724E7,217.4392523364486,6.420097244751009E7,45904.37581843057
variance,0.0,157850.01130123722,143839.394073247,514500.59557547513,471038.1179603834,195978.25544562974,72689.09070468787,154579.5912388429,569325.8108184187,436908.9700503156,232256.27443157847,1.1512613709044162E11,8.160324048616842E15,2.4382008641558028E16,6.798626761089857E13,NaN,1.973498423813236,0.009614478273164303,0.0302734375,0.02725128832212418,0.01052512449071979,0.018342213293737416,0.011109708370155305,0.0,0.009008264462809919,0.011492698756084349,0.018342213293737405,0.0,0.0,0.0,2.281836176830994,2.002495659722221,1.678050484758495,1.781009506564057,2.017294086819813,2.3767201110970837,1.6553279090285224,1.573223140495867,2.296917252568957,1.6663464057996302,153732.9148835894,139628.4677734375,502188.82400209643,462646.7877999091,192442.5551576556,70086.38000252494,149012.819331438,556102.2205785128,427903.06760411017,227737.40763385437,1.5373291488358923E11,1.396284677734375E11,5.02188824002096E11,4.6264678779990924E11,1.92442555157656E11,7.008638000252493E10,1.4901281933143826E11,5.561022205785126E11,4.279030676041103E11,2.2773740763385452E11,0.0,59.35014254608808,153728.4899613536,139635.60026041666,502183.02681456873,462644.4857401544,192433.5669490785,70083.4013382149,149012.819331438,556098.7947107442,427895.1964575444,227736.23809939742,1.1966340473817318E16,4.959914316640984E12,5.3222220613014712E16,10769.828125,6.8864646201050784E16,5069.585560050502,2.881431724410815E8,191134.35791798503,5.9215517898581656E16,4305.410617283952,3.7589268159607834E17,12063.34911345969,1.2343428226806258E16,2.6889803321515312E12
Quantil 0,,,,,,,,,,,,,,,,,,,,,,,,,,,,,,,,,,,,,,,,,,,,,,,,,,,,,,,,,,,,,,,,,,,,,,,,,,,,,,,,,,,,,,
Quantil 1,,,,,,,,,,,,,,,,,,,,,,,,,,,,,,,,,,,,,,,,,,,,,,,,,,,,,,,,,,,,,,,,,,,,,,,,,,,,,,,,,,,,,,
Quantil 2,,,,,,,,,,,,,,,,,,,,,,,,,,,,,,,,,,,,,,,,,,,,,,,,,,,,,,,,,,,,,,,,,,,,,,,,,,,,,,,,,,,,,,
Quantil 3,,,,,,,,,,,,,,,,,,,,,,,,,,,,,,,,,,,,,,,,,,,,,,,,,,,,,,,,,,,,,,,,,,,,,,,,,,,,,,,,,,,,,,
Quantil 4,,,,,,,,,,,,,,,,,,,,,,,,,,,,,,,,,,,,,,,,,,,,,,,,,,,,,,,,,,,,,,,,,,,,,,,,,,,,,,,,,,,,,,
Quantil 5,,,,,,,,,,,,,,,,,,,,,,,,,,,,,,,,,,,,,,,,,,,,,,,,,,,,,,,,,,,,,,,,,,,,,,,,,,,,,,,,,,,,,,
Quantil 6,,,,,,,,,,,,,,,,,,,,,,,,,,,,,,,,,,,,,,,,,,,,,,,,,,,,,,,,,,,,,,,,,,,,,,,,,,,,,,,,,,,,,,
Quantil 7,,,,,,,,,,,,,,,,,,,,,,,,,,,,,,,,,,,,,,,,,,,,,,,,,,,,,,,,,,,,,,,,,,,,,,,,,,,,,,,,,,,,,,
Quantil 8,,,,,,,,,,,,,,,,,,,,,,,,,,,,,,,,,,,,,,,,,,,,,,,,,,,,,,,,,,,,,,,,,,,,,,,,,,,,,,,,,,,,,,
Quantil 9,,,,,,,,,,,,,,,,,,,,,,,,,,,,,,,,,,,,,,,,,,,,,,,,,,,,,,,,,,,,,,,,,,,,,,,,,,,,,,,,,,,,,,
Quantil 10,,,,,,,,,,,,,,,,,,,,,,,,,,,,,,,,,,,,,,,,,,,,,,,,,,,,,,,,,,,,,,,,,,,,,,,,,,,,,,,,,,,,,,
Quantil 11,,,,,,,,,,,,,,,,,,,,,,,,,,,,,,,,,,,,,,,,,,,,,,,,,,,,,,,,,,,,,,,,,,,,,,,,,,,,,,,,,,,,,,
Quantil 12,,,,,,,,,,,,,,,,,,,,,,,,,,,,,,,,,,,,,,,,,,,,,,,,,,,,,,,,,,,,,,,,,,,,,,,,,,,,,,,,,,,,,,
Quantil 13,,,,,,,,,,,,,,,,,,,,,,,,,,,,,,,,,,,,,,,,,,,,,,,,,,,,,,,,,,,,,,,,,,,,,,,,,,,,,,,,,,,,,,
Quantil 14,,,,,,,,,,,,,,,,,,,,,,,,,,,,,,,,,,,,,,,,,,,,,,,,,,,,,,,,,,,,,,,,,,,,,,,,,,,,,,,,,,,,,,
Quantil 15,,,,,,,,,,,,,,,,,,,,,,,,,,,,,,,,,,,,,,,,,,,,,,,,,,,,,,,,,,,,,,,,,,,,,,,,,,,,,,,,,,,,,,
Quantil 16,,,,,,,,,,,,,,,,,,,,,,,,,,,,,,,,,,,,,,,,,,,,,,,,,,,,,,,,,,,,,,,,,,,,,,,,,,,,,,,,,,,,,,
Quantil 17,,,,,,,,,,,,,,,,,,,,,,,,,,,,,,,,,,,,,,,,,,,,,,,,,,,,,,,,,,,,,,,,,,,,,,,,,,,,,,,,,,,,,,
Quantil 18,,,,,,,,,,,,,,,,,,,,,,,,,,,,,,,,,,,,,,,,,,,,,,,,,,,,,,,,,,,,,,,,,,,,,,,,,,,,,,,,,,,,,,
Quantil 19,,,,,,,,,,,,,,,,,,,,,,,,,,,,,,,,,,,,,,,,,,,,,,,,,,,,,,,,,,,,,,,,,,,,,,,,,,,,,,,,,,,,,,
