ID,DWR:FRG:IDF,DWR:FRG:MICF,DWR:FRG:MIPF,DWR:FRG:NCF,DWR:FRG:NPF,DWR:SRG:IDF,DWR:SRG:MICF,DWR:SRG:MIPF,DWR:SRG:NCF,DWR:SRG:NPF,DefaultEnjoyingStrategyLEAVE_TIME,ESTER:FRG:IDF,ESTER:FRG:MICF,ESTER:FRG:MIPF,ESTER:FRG:NCF,ESTER:FRG:NPF,ESTER:SRG:IDF,ESTER:SRG:MICF,ESTER:SRG:MIPF,ESTER:SRG:NCF,ESTER:SRG:NPF,GraphClusteringAlgorithmCREATE_LINKAGES_TIME,GraphClusteringAlgorithmCREATE_WEIGHTED_CLUSTER_TIME,GraphClusteringAlgorithmWEIGHTED_CLUSTERING_TIME,PVISR:FRG:IDF,PVISR:FRG:MICF,PVISR:FRG:MIPF,PVISR:FRG:NCF,PVISR:FRG:NPF,PVISR:SRG:IDF,PVISR:SRG:MICF,PVISR:SRG:MIPF,PVISR:SRG:NCF,PVISR:SRG:NPF,SSTER:FRG:IDF,SSTER:FRG:MICF,SSTER:FRG:MIPF,SSTER:FRG:NCF,SSTER:FRG:NPF,SSTER:SRG:IDF,SSTER:SRG:MICF,SSTER:SRG:MIPF,SSTER:SRG:NCF,SSTER:SRG:NPF,STIR:FRG:IDF,STIR:FRG:MICF,STIR:FRG:MIPF,STIR:FRG:NCF,STIR:FRG:NPF,STIR:SRG:IDF,STIR:SRG:MICF,STIR:SRG:MIPF,STIR:SRG:NCF,STIR:SRG:NPF,TRAJECTORY_AVG,TRAJECTORY_MAX,TRAJECTORY_MIN,WSTER:FRG:IDF,WSTER:FRG:MICF,WSTER:FRG:MIPF,WSTER:FRG:NCF,WSTER:FRG:NPF,WSTER:SRG:IDF,WSTER:SRG:MICF,WSTER:SRG:MIPF,WSTER:SRG:NCF,WSTER:SRG:NPF,fastestRouteRoutingStrategyCALCULATED_TIME,fastestRouteRoutingStrategyFROM_CACHE_TIME,intrestDistanceFactorGoalStrategyFOUND_GOAL_TIME,intrestDistanceFactorGoalStrategyNO_INTEREST_TIME,mostInterestingClusterFirstGoalStrategyFOUND_GOAL_TIME,mostInterestingClusterFirstGoalStrategyNO_INTEREST_TIME,mostInterestingPlacesFirstGoalStrategyFOUND_GOAL_TIME,mostInterestingPlacesFirstGoalStrategyNO_INTEREST_TIME,nearestClusterFirstGoalStrategyFOUND_GOAL_TIME,nearestClusterFirstGoalStrategyNO_INTEREST_TIME,nearestPlacesFirstGoalStrategyFOUND_GOAL_TIME,nearestPlacesFirstGoalStrategyNO_INTEREST_TIME,shortestRouteRoutingStrategyCALCULATED_TIME,shortestRouteRoutingStrategyFROM_CACHE_TIME
Count,282.0,355.0,332.0,313.0,287.0,317.0,338.0,296.0,320.0,328.0,2107336.0,282.0,355.0,332.0,313.0,287.0,317.0,338.0,296.0,320.0,328.0,1.0,1.0,1.0,282.0,355.0,332.0,313.0,287.0,317.0,338.0,296.0,320.0,328.0,282.0,354.0,332.0,313.0,287.0,317.0,338.0,296.0,320.0,328.0,282.0,354.0,332.0,313.0,287.0,317.0,338.0,296.0,320.0,328.0,3167.0,3167.0,3166.0,282.0,355.0,332.0,313.0,287.0,317.0,338.0,296.0,320.0,328.0,8278.0,140811.0,4938.0,599.0,5341.0,693.0,4108.0,628.0,5402.0,633.0,5175.0,615.0,9090.0,144493.0
Max,4038.5961275593245,4400.095727806519,8205.430223167223,5140.6555871258115,4736.631111039858,3907.268127559325,4328.96272780652,8046.251138281413,4569.2839128293435,4938.202275012009,7.8855865E7,1716.0,1737.0,1737.0,1679.0,1717.0,1762.0,1704.0,1758.0,1707.0,1722.0,7448966.0,1073039.0,3.596665298E9,13.0,12.0,11.0,14.0,13.0,13.0,14.0,11.0,13.0,13.0,6511.0,12547.0,15963.0,8639.0,8455.0,6582.0,7842.0,12823.0,6607.0,7342.0,6511000.0,1.2547E7,1.5963E7,8639000.0,8455000.0,6582000.0,7842000.0,1.2823E7,6607000.0,7342000.0,4.9E-324,4.9E-324,1.7976931348623157E308,5486.0,12173.0,15282.0,8093.0,7882.0,4993.0,6836.0,12256.0,6103.0,6675.0,9.55048704E8,2.11897714E8,2.062140592E9,1233.0,1.769868576E9,1017.0,5457586.0,2014.0,1.567515512E9,2152.0,3.777264059E9,1610.0,9.86159996E8,1.49601284E8
Min,552.6746276604257,879.2060829616375,4406.558168101138,577.9467508080554,522.3437160802384,776.7211056634937,916.3480225904941,4266.280168101139,577.9467508080554,522.3437160802384,1.0,307.0,305.0,310.0,302.0,315.0,316.0,313.0,313.0,315.0,310.0,7448966.0,1073039.0,3.596665298E9,5.0,4.0,4.0,5.0,5.0,4.0,5.0,4.0,5.0,5.0,935.0,1277.0,3738.0,1015.0,907.0,986.0,1447.0,3585.0,970.0,778.0,935000.0,1277000.0,3738000.0,1015000.0,907000.0,986000.0,1447000.0,3585000.0,970000.0,778000.0,0.0,4.9E-324,1.7976931348623157E308,498.0,864.0,3353.0,642.0,503.0,609.0,880.0,2905.0,475.0,430.0,2399836.0,1455.0,60025.0,46.0,62606.0,91.0,348.0,62.0,32518.0,79.0,2599.0,49.0,2448161.0,1422.0
Avg,1829.978425654395,2159.3228516086306,5937.416236072149,1656.7707851699704,1299.8724676490551,1844.7560425152215,2157.6618252386697,5828.1182554381985,1577.69440055645,1311.8445119245664,140.19110194102888,698.822695035461,642.8676056338028,682.5722891566265,646.3354632587859,668.2508710801394,684.4384858044164,679.4230769230769,640.7533783783783,663.584375,658.109756097561,7448966.0,1073039.0,3.596665298E9,8.191489361702128,7.732394366197183,6.524096385542169,8.680511182108626,8.40766550522648,8.290220820189274,7.680473372781065,6.5608108108108105,8.390625,8.420731707317072,2620.4893617021276,2873.0141242937852,6692.939759036145,2372.444089456869,2040.0174216027874,2588.8107255520504,2893.1005917159764,6467.3175675675675,2298.059375,2019.3231707317073,2620489.361702128,2873014.1242937855,6692939.759036144,2372444.089456869,2040017.4216027874,2588810.7255520504,2893100.591715976,6467317.567567567,2298059.375,2019323.1707317072,0.0,4.9E-324,Infinity,1922.6666666666667,2234.03661971831,6011.3674698795185,1727.1086261980831,1372.766550522648,1905.372239747634,2214.6775147928993,5827.564189189189,1635.475,1362.2134146341464,4.641544149722155E7,16332.15987387349,3.2178014109963547E7,197.10183639398997,3.1080078194907323E7,235.84415584415584,4558.777750730283,211.55573248407643,2.3312785905960754E7,226.69194312796208,7.18163985142029E7,189.24878048780488,4.791860128459846E7,12665.299149439765
variance,223095.0726888464,320840.36525676283,594152.0816368483,557797.7703199008,691172.2031687832,226921.91655224288,267322.71460603573,636515.3247196911,462373.7283860644,685882.7355906881,4.424868113002954E9,111766.74161259494,93137.1064153938,119649.1122441573,89933.94177750102,114535.5746943632,122124.03170496275,104816.78254437866,101969.94255615408,109755.13663085946,103543.60380725756,0.0,0.0,0.0,2.2257431718726424,1.925570323348546,1.7915880389025953,2.556073860098599,2.31116075222474,2.0987371752132127,2.0280802492909897,1.9287344777209543,2.175537109375,2.060789708506847,605633.717971933,902128.1834163233,2737538.990346931,998352.1126887077,1194927.5362818537,574157.3206420605,609077.8005321939,2538765.412664353,709731.9808496095,948370.0479997024,6.056337179719331E11,9.021281834163235E11,2.7375389903469297E12,9.983521126887076E11,1.1949275362818538E12,5.741573206420603E11,6.090778005321946E11,2.538765412664353E12,7.09731980849609E11,9.483700479997025E11,0.0,0.0,Infinity,506599.2931442082,853304.7000674469,2489382.5215923926,897501.016954343,1006740.0117034321,438929.4639612294,520940.25990861683,2384945.097231099,632536.7618749995,880347.1129907791,8.125845891504758E15,1.4711681115126758E12,2.7827605464434052E16,10592.879445709461,2.4374579146520028E16,9454.137328760704,7.292349496395833E9,45634.10039707493,1.487987688115312E16,22077.221056729777,1.64429178119360768E17,24341.760872496536,7.942120560680646E15,7.210587682795422E11
Quantil 0,1.0,2.0,21.0,1.0,22.0,8.0,1.0,16.0,5.0,23.0,2107332.0,35.0,60.0,47.0,40.0,52.0,62.0,45.0,56.0,62.0,55.0,1.0,1.0,1.0,3.0,3.0,12.0,2.0,3.0,1.0,21.0,12.0,4.0,4.0,3.0,26.0,7.0,17.0,41.0,6.0,8.0,5.0,10.0,20.0,3.0,26.0,7.0,17.0,41.0,6.0,8.0,5.0,10.0,20.0,3167.0,3167.0,3166.0,5.0,39.0,11.0,40.0,66.0,7.0,10.0,4.0,9.0,35.0,6101.0,140793.0,4691.0,29.0,5044.0,73.0,4107.0,316.0,5143.0,247.0,4994.0,314.0,6617.0,144472.0
Quantil 1,1.0,7.0,2.0,16.0,40.0,9.0,6.0,4.0,19.0,34.0,0.0,46.0,60.0,68.0,55.0,52.0,50.0,58.0,49.0,50.0,49.0,,,,0.0,0.0,0.0,0.0,0.0,0.0,0.0,0.0,0.0,0.0,3.0,83.0,32.0,72.0,89.0,7.0,21.0,9.0,35.0,58.0,3.0,83.0,32.0,72.0,89.0,7.0,21.0,9.0,35.0,58.0,,,,5.0,125.0,39.0,96.0,124.0,8.0,17.0,7.0,51.0,115.0,761.0,1.0,30.0,223.0,42.0,160.0,0.0,218.0,29.0,282.0,8.0,84.0,895.0,4.0
Quantil 2,7.0,11.0,13.0,109.0,143.0,9.0,9.0,14.0,67.0,180.0,1.0,34.0,48.0,40.0,31.0,24.0,37.0,48.0,43.0,39.0,44.0,,,,37.0,17.0,62.0,21.0,34.0,5.0,38.0,63.0,25.0,27.0,22.0,118.0,51.0,74.0,67.0,24.0,69.0,24.0,54.0,83.0,22.0,118.0,51.0,74.0,67.0,24.0,69.0,24.0,54.0,83.0,,,,13.0,108.0,52.0,75.0,50.0,18.0,54.0,19.0,77.0,95.0,569.0,0.0,48.0,192.0,53.0,128.0,0.0,36.0,35.0,73.0,4.0,117.0,658.0,5.0
Quantil 3,11.0,10.0,13.0,69.0,36.0,10.0,9.0,7.0,58.0,42.0,0.0,29.0,31.0,31.0,44.0,34.0,28.0,32.0,29.0,29.0,41.0,,,,0.0,0.0,0.0,0.0,0.0,0.0,0.0,0.0,0.0,0.0,26.0,68.0,45.0,57.0,36.0,49.0,68.0,47.0,50.0,67.0,26.0,68.0,45.0,57.0,36.0,49.0,68.0,47.0,50.0,67.0,,,,51.0,41.0,62.0,42.0,12.0,49.0,93.0,51.0,49.0,32.0,396.0,4.0,25.0,89.0,42.0,141.0,0.0,19.0,37.0,22.0,2.0,54.0,444.0,0.0
Quantil 4,10.0,22.0,39.0,7.0,17.0,19.0,22.0,47.0,59.0,14.0,0.0,14.0,32.0,21.0,30.0,21.0,21.0,19.0,26.0,24.0,27.0,,,,55.0,32.0,0.0,55.0,38.0,28.0,105.0,0.0,72.0,44.0,56.0,32.0,59.0,32.0,22.0,46.0,56.0,47.0,52.0,41.0,56.0,32.0,59.0,32.0,22.0,46.0,56.0,47.0,52.0,41.0,,,,62.0,24.0,56.0,16.0,11.0,59.0,65.0,46.0,50.0,16.0,205.0,2.0,18.0,40.0,17.0,103.0,0.0,1.0,18.0,3.0,1.0,20.0,226.0,2.0
Quantil 5,35.0,11.0,4.0,42.0,5.0,39.0,6.0,6.0,6.0,7.0,0.0,22.0,24.0,17.0,16.0,14.0,20.0,20.0,17.0,12.0,18.0,,,,0.0,0.0,109.0,0.0,0.0,0.0,0.0,72.0,0.0,0.0,62.0,13.0,51.0,23.0,4.0,61.0,45.0,35.0,35.0,19.0,62.0,13.0,51.0,23.0,4.0,61.0,45.0,35.0,35.0,19.0,,,,52.0,8.0,40.0,17.0,2.0,49.0,28.0,38.0,32.0,4.0,113.0,0.0,20.0,11.0,14.0,45.0,0.0,4.0,28.0,1.0,7.0,13.0,117.0,0.0
Quantil 6,89.0,165.0,76.0,29.0,1.0,81.0,163.0,1.0,57.0,0.0,0.0,15.0,14.0,14.0,18.0,16.0,19.0,13.0,16.0,17.0,11.0,,,,0.0,0.0,0.0,69.0,0.0,54.0,83.0,0.0,0.0,0.0,31.0,7.0,30.0,12.0,6.0,42.0,23.0,29.0,30.0,10.0,31.0,7.0,30.0,12.0,6.0,42.0,23.0,29.0,30.0,10.0,,,,31.0,4.0,24.0,6.0,1.0,38.0,18.0,34.0,18.0,2.0,37.0,0.0,15.0,2.0,11.0,13.0,0.0,7.0,20.0,0.0,8.0,2.0,31.0,1.0
Quantil 7,58.0,59.0,7.0,19.0,0.0,95.0,52.0,44.0,19.0,0.0,0.0,8.0,17.0,16.0,14.0,8.0,10.0,17.0,9.0,16.0,14.0,,,,70.0,117.0,0.0,0.0,82.0,0.0,0.0,0.0,64.0,107.0,30.0,5.0,18.0,6.0,1.0,29.0,17.0,25.0,20.0,3.0,30.0,5.0,18.0,6.0,1.0,29.0,17.0,25.0,20.0,3.0,,,,23.0,4.0,15.0,4.0,2.0,32.0,24.0,26.0,9.0,3.0,14.0,2.0,20.0,7.0,13.0,12.0,0.0,7.0,19.0,0.0,17.0,2.0,23.0,0.0
Quantil 8,46.0,8.0,19.0,0.0,0.0,13.0,14.0,17.0,12.0,0.0,1.0,15.0,10.0,10.0,16.0,10.0,10.0,14.0,10.0,15.0,11.0,,,,0.0,0.0,74.0,76.0,0.0,93.0,62.0,80.0,0.0,0.0,13.0,0.0,12.0,6.0,3.0,25.0,14.0,17.0,13.0,0.0,13.0,0.0,12.0,6.0,3.0,25.0,14.0,17.0,13.0,0.0,,,,14.0,1.0,12.0,6.0,5.0,15.0,13.0,17.0,6.0,2.0,14.0,3.0,15.0,1.0,20.0,9.0,0.0,6.0,17.0,0.0,11.0,1.0,7.0,3.0
Quantil 9,7.0,19.0,61.0,1.0,0.0,6.0,17.0,66.0,2.0,0.0,0.0,11.0,11.0,9.0,4.0,8.0,9.0,16.0,3.0,7.0,11.0,,,,66.0,81.0,0.0,0.0,57.0,0.0,0.0,0.0,78.0,78.0,11.0,1.0,15.0,6.0,2.0,11.0,7.0,18.0,3.0,7.0,11.0,1.0,15.0,6.0,2.0,11.0,7.0,18.0,3.0,7.0,,,,5.0,0.0,10.0,4.0,3.0,11.0,7.0,18.0,5.0,3.0,3.0,1.0,21.0,1.0,20.0,3.0,0.0,5.0,18.0,1.0,18.0,1.0,10.0,0.0
Quantil 10,1.0,9.0,10.0,1.0,0.0,6.0,10.0,9.0,0.0,0.0,0.0,12.0,11.0,6.0,9.0,9.0,4.0,9.0,8.0,4.0,6.0,,,,0.0,0.0,0.0,0.0,0.0,0.0,0.0,0.0,0.0,0.0,10.0,0.0,4.0,0.0,4.0,5.0,3.0,13.0,4.0,7.0,10.0,0.0,4.0,0.0,4.0,5.0,3.0,13.0,4.0,7.0,,,,4.0,0.0,4.0,1.0,3.0,9.0,1.0,11.0,5.0,7.0,6.0,0.0,8.0,0.0,26.0,0.0,0.0,2.0,8.0,1.0,10.0,0.0,1.0,1.0
Quantil 11,1.0,4.0,8.0,5.0,0.0,2.0,3.0,8.0,2.0,2.0,1.0,7.0,9.0,10.0,6.0,8.0,5.0,7.0,2.0,6.0,6.0,,,,0.0,0.0,49.0,51.0,0.0,78.0,18.0,43.0,0.0,0.0,2.0,0.0,2.0,2.0,6.0,4.0,3.0,8.0,4.0,2.0,2.0,0.0,2.0,2.0,6.0,4.0,3.0,8.0,4.0,2.0,,,,4.0,0.0,3.0,0.0,4.0,10.0,4.0,9.0,1.0,3.0,3.0,0.0,2.0,0.0,14.0,1.0,0.0,0.0,10.0,0.0,23.0,1.0,2.0,1.0
Quantil 12,2.0,0.0,2.0,0.0,1.0,8.0,0.0,1.0,1.0,0.0,0.0,9.0,7.0,8.0,7.0,5.0,6.0,6.0,4.0,8.0,6.0,,,,35.0,73.0,0.0,0.0,50.0,0.0,0.0,0.0,57.0,44.0,3.0,0.0,3.0,1.0,3.0,1.0,2.0,5.0,2.0,3.0,3.0,0.0,3.0,1.0,3.0,1.0,2.0,5.0,2.0,3.0,,,,4.0,0.0,2.0,1.0,2.0,2.0,2.0,5.0,0.0,3.0,0.0,1.0,4.0,0.0,7.0,1.0,0.0,2.0,6.0,0.0,18.0,1.0,6.0,0.0
Quantil 13,3.0,0.0,0.0,0.0,0.0,0.0,0.0,1.0,0.0,5.0,0.0,3.0,5.0,12.0,5.0,4.0,10.0,8.0,3.0,8.0,7.0,,,,0.0,0.0,0.0,22.0,0.0,40.0,8.0,0.0,0.0,0.0,6.0,0.0,1.0,2.0,1.0,0.0,1.0,4.0,1.0,3.0,6.0,0.0,1.0,2.0,1.0,0.0,1.0,4.0,1.0,3.0,,,,2.0,0.0,0.0,3.0,0.0,2.0,1.0,2.0,2.0,1.0,5.0,1.0,4.0,0.0,1.0,2.0,0.0,1.0,4.0,0.0,14.0,2.0,9.0,0.0
Quantil 14,1.0,0.0,46.0,0.0,1.0,2.0,6.0,43.0,0.0,5.0,0.0,5.0,6.0,1.0,3.0,3.0,5.0,10.0,8.0,6.0,4.0,,,,9.0,21.0,17.0,0.0,19.0,0.0,0.0,19.0,14.0,17.0,0.0,0.0,0.0,0.0,0.0,4.0,0.0,2.0,2.0,0.0,0.0,0.0,0.0,0.0,0.0,4.0,0.0,2.0,2.0,0.0,,,,3.0,0.0,0.0,1.0,0.0,4.0,0.0,0.0,1.0,4.0,11.0,0.0,3.0,0.0,1.0,0.0,0.0,2.0,1.0,0.0,10.0,1.0,11.0,0.0
Quantil 15,0.0,11.0,5.0,3.0,7.0,0.0,13.0,2.0,0.0,10.0,0.0,3.0,4.0,4.0,4.0,6.0,8.0,5.0,3.0,4.0,5.0,,,,0.0,0.0,0.0,14.0,0.0,10.0,2.0,0.0,0.0,0.0,2.0,0.0,0.0,2.0,0.0,2.0,0.0,2.0,1.0,2.0,2.0,0.0,0.0,2.0,0.0,2.0,0.0,2.0,1.0,2.0,,,,2.0,0.0,0.0,0.0,0.0,0.0,0.0,3.0,2.0,1.0,4.0,0.0,8.0,2.0,2.0,0.0,0.0,0.0,1.0,1.0,8.0,0.0,13.0,1.0
Quantil 16,1.0,8.0,1.0,5.0,3.0,0.0,4.0,4.0,1.0,2.0,0.0,7.0,0.0,9.0,3.0,4.0,4.0,5.0,3.0,4.0,5.0,,,,0.0,0.0,0.0,0.0,0.0,0.0,0.0,0.0,0.0,0.0,1.0,0.0,0.0,0.0,0.0,0.0,0.0,2.0,3.0,0.0,1.0,0.0,0.0,0.0,0.0,0.0,0.0,2.0,3.0,0.0,,,,0.0,0.0,0.0,0.0,0.0,1.0,0.0,3.0,2.0,0.0,30.0,1.0,2.0,1.0,3.0,0.0,0.0,1.0,3.0,1.0,4.0,0.0,17.0,1.0
Quantil 17,5.0,8.0,3.0,4.0,8.0,6.0,0.0,4.0,2.0,2.0,0.0,3.0,0.0,4.0,6.0,1.0,5.0,3.0,3.0,1.0,4.0,,,,6.0,10.0,8.0,2.0,2.0,7.0,0.0,5.0,5.0,4.0,0.0,0.0,0.0,0.0,0.0,0.0,0.0,1.0,0.0,2.0,0.0,0.0,0.0,0.0,0.0,0.0,0.0,1.0,0.0,2.0,,,,0.0,0.0,1.0,0.0,1.0,1.0,0.0,0.0,0.0,0.0,4.0,1.0,2.0,0.0,5.0,0.0,0.0,0.0,2.0,0.0,8.0,0.0,1.0,0.0
Quantil 18,0.0,0.0,0.0,1.0,2.0,0.0,0.0,0.0,8.0,0.0,0.0,2.0,2.0,3.0,1.0,5.0,3.0,1.0,2.0,6.0,2.0,,,,0.0,0.0,0.0,0.0,0.0,0.0,0.0,0.0,0.0,0.0,0.0,0.0,1.0,0.0,0.0,0.0,0.0,2.0,0.0,0.0,0.0,0.0,1.0,0.0,0.0,0.0,0.0,2.0,0.0,0.0,,,,1.0,0.0,0.0,0.0,0.0,1.0,0.0,2.0,0.0,1.0,1.0,0.0,0.0,0.0,3.0,0.0,0.0,0.0,1.0,0.0,8.0,0.0,1.0,0.0
Quantil 19,3.0,1.0,2.0,1.0,1.0,4.0,3.0,2.0,2.0,2.0,1.0,2.0,4.0,2.0,1.0,3.0,1.0,2.0,2.0,2.0,2.0,,,,1.0,1.0,1.0,1.0,2.0,1.0,1.0,2.0,1.0,3.0,1.0,1.0,1.0,1.0,2.0,1.0,1.0,1.0,1.0,1.0,1.0,1.0,1.0,1.0,2.0,1.0,1.0,1.0,1.0,1.0,,,,1.0,1.0,1.0,1.0,1.0,1.0,1.0,1.0,1.0,1.0,1.0,1.0,2.0,1.0,3.0,2.0,1.0,1.0,2.0,1.0,2.0,2.0,1.0,2.0
