ID,CircleDistributionStrategyTIME,DWR:FRG:IDF,DWR:FRG:MICF,DWR:FRG:MIPF,DWR:FRG:NCF,DWR:FRG:NPF,DWR:SRG:IDF,DWR:SRG:MICF,DWR:SRG:MIPF,DWR:SRG:NCF,DWR:SRG:NPF,DefaultEnjoyingStrategyLEAVE_TIME,DefaultReconstructionStrategyABORTED_TIME,DefaultReconstructionStrategyFOUND_POINT_ABORTED_TIME,DefaultReconstructionStrategyFOUND_POINT_TIME,DefaultReconstructionStrategyNO_STATION,DefaultReconstructionStrategyPOINTS_FOUND,ESTER:FRG:IDF,ESTER:FRG:MICF,ESTER:FRG:MIPF,ESTER:FRG:NCF,ESTER:FRG:NPF,ESTER:SRG:IDF,ESTER:SRG:MICF,ESTER:SRG:MIPF,ESTER:SRG:NCF,ESTER:SRG:NPF,GraphClusteringAlgorithmCREATE_LINKAGES_TIME,GraphClusteringAlgorithmCREATE_WEIGHTED_CLUSTER_TIME,GraphClusteringAlgorithmWEIGHTED_CLUSTERING_TIME,PVISR:FRG:IDF,PVISR:FRG:MICF,PVISR:FRG:MIPF,PVISR:FRG:NCF,PVISR:FRG:NPF,PVISR:SRG:IDF,PVISR:SRG:MICF,PVISR:SRG:MIPF,PVISR:SRG:NCF,PVISR:SRG:NPF,SSTER:FRG:IDF,SSTER:FRG:MICF,SSTER:FRG:MIPF,SSTER:FRG:NCF,SSTER:FRG:NPF,SSTER:SRG:IDF,SSTER:SRG:MICF,SSTER:SRG:MIPF,SSTER:SRG:NCF,SSTER:SRG:NPF,STIR:FRG:IDF,STIR:FRG:MICF,STIR:FRG:MIPF,STIR:FRG:NCF,STIR:FRG:NPF,STIR:SRG:IDF,STIR:SRG:MICF,STIR:SRG:MIPF,STIR:SRG:NCF,STIR:SRG:NPF,SimulationTime,TRAJECTORY,WSTER:FRG:IDF,WSTER:FRG:MICF,WSTER:FRG:MIPF,WSTER:FRG:NCF,WSTER:FRG:NPF,WSTER:SRG:IDF,WSTER:SRG:MICF,WSTER:SRG:MIPF,WSTER:SRG:NCF,WSTER:SRG:NPF,fastestRouteRoutingStrategyCALCULATED_TIME,fastestRouteRoutingStrategyFROM_CACHE_TIME,intrestDistanceFactorGoalStrategyFOUND_GOAL_TIME,intrestDistanceFactorGoalStrategyNO_INTEREST_TIME,mostInterestingClusterFirstGoalStrategyFOUND_GOAL_TIME,mostInterestingClusterFirstGoalStrategyNO_INTEREST_TIME,mostInterestingPlacesFirstGoalStrategyFOUND_GOAL_TIME,mostInterestingPlacesFirstGoalStrategyNO_INTEREST_TIME,nearestClusterFirstGoalStrategyFOUND_GOAL_TIME,nearestClusterFirstGoalStrategyNO_INTEREST_TIME,nearestPlacesFirstGoalStrategyFOUND_GOAL_TIME,nearestPlacesFirstGoalStrategyNO_INTEREST_TIME,shortestRouteRoutingStrategyCALCULATED_TIME,shortestRouteRoutingStrategyFROM_CACHE_TIME
Count,1.0,258.0,273.0,263.0,252.0,234.0,244.0,254.0,236.0,250.0,236.0,1597500.0,95.0,884.0,134443.0,3.0,135327.0,258.0,273.0,263.0,252.0,234.0,244.0,254.0,236.0,250.0,236.0,1.0,1.0,1.0,258.0,273.0,263.0,252.0,234.0,244.0,254.0,236.0,250.0,236.0,258.0,273.0,263.0,252.0,234.0,244.0,254.0,236.0,250.0,236.0,258.0,273.0,263.0,252.0,234.0,244.0,254.0,236.0,250.0,236.0,1.0,135325.0,258.0,273.0,263.0,252.0,234.0,244.0,254.0,236.0,250.0,236.0,9250.0,108922.0,3919.0,502.0,3976.0,527.0,3254.0,499.0,4153.0,502.0,3866.0,470.0,9102.0,103409.0
Max,5068722.0,4454.007727806519,4163.820328896394,8188.084857057374,4787.364288189821,4744.303275012008,4243.392727806519,4548.13672780652,8046.251138281413,4536.217912829344,5175.735111039858,3.33670352E8,5.99643752E8,1.016630936E9,9.9938069E7,1.23890721E8,10.0,640.0,640.0,640.0,640.0,640.0,640.0,640.0,640.0,640.0,640.0,7778136.0,972719.0,3.188232127E9,12.0,13.0,11.0,12.0,13.0,15.0,13.0,11.0,12.0,12.0,5026.0,4741.0,8715.0,5373.0,5328.0,4818.0,5118.0,8566.0,5125.0,5762.0,5026000.0,4741000.0,8715000.0,5373000.0,5328000.0,4818000.0,5118000.0,8566000.0,5125000.0,5762000.0,39635.0,48.4815630449174,4387.0,4102.0,8076.0,4734.0,4689.0,4179.0,4479.0,7927.0,4486.0,5123.0,1.09123115E9,5.33679921E8,2.379594112E9,1481.0,2.184358998E9,1688.0,5.8909176E7,2891.0,2.110879923E9,3062.0,5.054874598E9,1729.0,1.011277237E9,3.25061142E8
Min,5068722.0,776.7211056634937,1044.626022590494,4406.558168101137,813.4636873674199,515.5570674683796,785.677031084924,896.190022590494,4277.092168101137,577.9467508080554,561.6606600007058,1.0,1.0021145E8,1.00000873E8,30791.0,185.0,1.0,639.0,639.0,639.0,639.0,639.0,639.0,639.0,639.0,639.0,639.0,7778136.0,972719.0,3.188232127E9,4.0,4.0,4.0,6.0,5.0,4.0,4.0,4.0,5.0,5.0,1407.0,1671.0,4985.0,1437.0,1147.0,1412.0,1520.0,4847.0,1209.0,1192.0,1407000.0,1671000.0,4985000.0,1437000.0,1147000.0,1412000.0,1520000.0,4847000.0,1209000.0,1192000.0,39635.0,0.06938517819608686,768.0,1032.0,4346.0,798.0,508.0,773.0,881.0,4208.0,570.0,553.0,2449977.0,1462.0,61162.0,101.0,80425.0,86.0,492.0,60.0,32744.0,105.0,4195.0,51.0,2353292.0,1483.0
Avg,5068722.0,1936.4032987831192,2221.5396476100896,5932.26870311986,1719.2097990613393,1300.965964730772,1913.0222277979765,2178.051634589997,5814.086009923405,1723.0006706933164,1343.8114298946896,395.3798835680751,2.1320621621052632E8,2.1362472960746607E8,837483.0020454766,4.1297124E7,9.967560058229326,639.9883720930233,639.992673992674,639.9847908745247,639.9880952380952,639.9957264957264,639.983606557377,639.9842519685039,639.9957627118644,639.988,639.9872881355932,7778136.0,972719.0,3.188232127E9,7.868217054263566,7.564102564102564,6.513307984790875,8.30952380952381,8.175213675213675,7.741803278688525,7.5236220472440944,6.529661016949152,8.236,8.275423728813559,2550.6201550387595,2828.6959706959706,6492.224334600761,2335.6428571428573,1922.9786324786326,2526.3565573770493,2784.3858267716537,6365.127118644068,2339.52,1965.0677966101696,2550620.1550387596,2828695.9706959706,6492224.334600761,2335642.8571428573,1922978.6324786325,2526356.5573770492,2784385.8267716537,6365127.118644068,2339520.0,1965067.7966101696,39635.0,16.550348162098544,1911.6317829457364,2189.703296703297,5853.239543726236,1696.654761904762,1283.982905982906,1887.372950819672,2145.4015748031497,5726.131355932203,1700.532,1326.0805084745762,6.3506673562486485E7,86530.20063898936,6.158337002143404E7,286.3685258964143,5.862229851483903E7,245.5370018975332,22763.43331284573,263.813627254509,4.782519940645317E7,263.4641434262948,1.5909933941257113E8,190.05957446808512,6.2590424627993844E7,68112.34973745032
variance,0.0,432222.36772985646,415180.0121593965,669335.3655281841,783745.8073050043,673898.8030699067,434420.37243197113,329095.8028751928,581155.1147817445,812226.3507727695,748732.1162151219,8.183132740293092E10,1.1126609390794138E16,1.6463877411029388E16,3.0598161066952223E13,3.4108511327123645E15,0.20684407882799846,0.011492698756084371,0.007272336942666621,0.014977807977562207,0.011763038548752842,0.00425524143472863,0.0161246976619188,0.015500031000062,0.004219333524849225,0.011856000000000018,0.01255027291008326,0.0,0.0,0.0,1.9283696893215483,2.106696722081342,1.991267764460956,1.896258503401359,1.9650266637446137,2.2980885514646605,2.0289695579391185,1.6897981901752397,1.9643039999999987,2.072446854352201,420769.30533020844,404856.1163573907,653168.7519553564,769442.8803854875,660632.9781759075,419046.2949979842,317517.08735817485,567207.6194340708,796141.1776,732615.6987934504,4.207693053302084E11,4.048561163573913E11,6.531687519553557E11,7.69442880385488E11,6.606329781759076E11,4.190462949979845E11,3.1751708735817505E11,5.672076194340718E11,7.961411776E11,7.32615698793449E11,0.0,61.18099412404663,420775.7907727901,404855.22698546853,653150.7677138593,769444.0911281175,660631.1022718969,419054.7666453909,317517.02771405544,567209.2666439243,796124.8729759998,732609.0316539791,1.233728746400734E16,1.911366321846068E13,6.9265966272910784E16,24775.969766352915,6.6611448196489088E16,14475.22016786148,1.066215848913798E12,79002.65263994923,4.4814640792442432E16,30724.292539007376,5.5085053401755757E17,28802.800706201768,1.1586587271937538E16,1.156911599000765E13
Quantil 0,,,,,,,,,,,,,,,,,,,,,,,,,,,,,,,,,,,,,,,,,,,,,,,,,,,,,,,,,,,,,,,,,,,,,,,,,,,,,,,,,,,,,,
Quantil 1,,,,,,,,,,,,,,,,,,,,,,,,,,,,,,,,,,,,,,,,,,,,,,,,,,,,,,,,,,,,,,,,,,,,,,,,,,,,,,,,,,,,,,
Quantil 2,,,,,,,,,,,,,,,,,,,,,,,,,,,,,,,,,,,,,,,,,,,,,,,,,,,,,,,,,,,,,,,,,,,,,,,,,,,,,,,,,,,,,,
Quantil 3,,,,,,,,,,,,,,,,,,,,,,,,,,,,,,,,,,,,,,,,,,,,,,,,,,,,,,,,,,,,,,,,,,,,,,,,,,,,,,,,,,,,,,
Quantil 4,,,,,,,,,,,,,,,,,,,,,,,,,,,,,,,,,,,,,,,,,,,,,,,,,,,,,,,,,,,,,,,,,,,,,,,,,,,,,,,,,,,,,,
Quantil 5,,,,,,,,,,,,,,,,,,,,,,,,,,,,,,,,,,,,,,,,,,,,,,,,,,,,,,,,,,,,,,,,,,,,,,,,,,,,,,,,,,,,,,
Quantil 6,,,,,,,,,,,,,,,,,,,,,,,,,,,,,,,,,,,,,,,,,,,,,,,,,,,,,,,,,,,,,,,,,,,,,,,,,,,,,,,,,,,,,,
Quantil 7,,,,,,,,,,,,,,,,,,,,,,,,,,,,,,,,,,,,,,,,,,,,,,,,,,,,,,,,,,,,,,,,,,,,,,,,,,,,,,,,,,,,,,
Quantil 8,,,,,,,,,,,,,,,,,,,,,,,,,,,,,,,,,,,,,,,,,,,,,,,,,,,,,,,,,,,,,,,,,,,,,,,,,,,,,,,,,,,,,,
Quantil 9,,,,,,,,,,,,,,,,,,,,,,,,,,,,,,,,,,,,,,,,,,,,,,,,,,,,,,,,,,,,,,,,,,,,,,,,,,,,,,,,,,,,,,
Quantil 10,,,,,,,,,,,,,,,,,,,,,,,,,,,,,,,,,,,,,,,,,,,,,,,,,,,,,,,,,,,,,,,,,,,,,,,,,,,,,,,,,,,,,,
Quantil 11,,,,,,,,,,,,,,,,,,,,,,,,,,,,,,,,,,,,,,,,,,,,,,,,,,,,,,,,,,,,,,,,,,,,,,,,,,,,,,,,,,,,,,
Quantil 12,,,,,,,,,,,,,,,,,,,,,,,,,,,,,,,,,,,,,,,,,,,,,,,,,,,,,,,,,,,,,,,,,,,,,,,,,,,,,,,,,,,,,,
Quantil 13,,,,,,,,,,,,,,,,,,,,,,,,,,,,,,,,,,,,,,,,,,,,,,,,,,,,,,,,,,,,,,,,,,,,,,,,,,,,,,,,,,,,,,
Quantil 14,,,,,,,,,,,,,,,,,,,,,,,,,,,,,,,,,,,,,,,,,,,,,,,,,,,,,,,,,,,,,,,,,,,,,,,,,,,,,,,,,,,,,,
Quantil 15,,,,,,,,,,,,,,,,,,,,,,,,,,,,,,,,,,,,,,,,,,,,,,,,,,,,,,,,,,,,,,,,,,,,,,,,,,,,,,,,,,,,,,
Quantil 16,,,,,,,,,,,,,,,,,,,,,,,,,,,,,,,,,,,,,,,,,,,,,,,,,,,,,,,,,,,,,,,,,,,,,,,,,,,,,,,,,,,,,,
Quantil 17,,,,,,,,,,,,,,,,,,,,,,,,,,,,,,,,,,,,,,,,,,,,,,,,,,,,,,,,,,,,,,,,,,,,,,,,,,,,,,,,,,,,,,
Quantil 18,,,,,,,,,,,,,,,,,,,,,,,,,,,,,,,,,,,,,,,,,,,,,,,,,,,,,,,,,,,,,,,,,,,,,,,,,,,,,,,,,,,,,,
Quantil 19,,,,,,,,,,,,,,,,,,,,,,,,,,,,,,,,,,,,,,,,,,,,,,,,,,,,,,,,,,,,,,,,,,,,,,,,,,,,,,,,,,,,,,
