ID,DWR:FRG:IDF,DWR:FRG:MICF,DWR:FRG:MIPF,DWR:FRG:NCF,DWR:FRG:NPF,DWR:SRG:IDF,DWR:SRG:MICF,DWR:SRG:MIPF,DWR:SRG:NCF,DWR:SRG:NPF,DefaultEnjoyingStrategyLEAVE_TIME,ESTER:FRG:IDF,ESTER:FRG:MICF,ESTER:FRG:MIPF,ESTER:FRG:NCF,ESTER:FRG:NPF,ESTER:SRG:IDF,ESTER:SRG:MICF,ESTER:SRG:MIPF,ESTER:SRG:NCF,ESTER:SRG:NPF,GraphClusteringAlgorithmCREATE_LINKAGES_TIME,GraphClusteringAlgorithmCREATE_WEIGHTED_CLUSTER_TIME,GraphClusteringAlgorithmWEIGHTED_CLUSTERING_TIME,PVISR:FRG:IDF,PVISR:FRG:MICF,PVISR:FRG:MIPF,PVISR:FRG:NCF,PVISR:FRG:NPF,PVISR:SRG:IDF,PVISR:SRG:MICF,PVISR:SRG:MIPF,PVISR:SRG:NCF,PVISR:SRG:NPF,SSTER:FRG:IDF,SSTER:FRG:MICF,SSTER:FRG:MIPF,SSTER:FRG:NCF,SSTER:FRG:NPF,SSTER:SRG:IDF,SSTER:SRG:MICF,SSTER:SRG:MIPF,SSTER:SRG:NCF,SSTER:SRG:NPF,STIR:FRG:IDF,STIR:FRG:MICF,STIR:FRG:MIPF,STIR:FRG:NCF,STIR:FRG:NPF,STIR:SRG:IDF,STIR:SRG:MICF,STIR:SRG:MIPF,STIR:SRG:NCF,STIR:SRG:NPF,SimulationTime,WSTER:FRG:IDF,WSTER:FRG:MICF,WSTER:FRG:MIPF,WSTER:FRG:NCF,WSTER:FRG:NPF,WSTER:SRG:IDF,WSTER:SRG:MICF,WSTER:SRG:MIPF,WSTER:SRG:NCF,WSTER:SRG:NPF,fastestRouteRoutingStrategyCALCULATED_TIME,fastestRouteRoutingStrategyFROM_CACHE_TIME,intrestDistanceFactorGoalStrategyFOUND_GOAL_TIME,intrestDistanceFactorGoalStrategyNO_INTEREST_TIME,mostInterestingClusterFirstGoalStrategyFOUND_GOAL_TIME,mostInterestingClusterFirstGoalStrategyNO_INTEREST_TIME,mostInterestingPlacesFirstGoalStrategyFOUND_GOAL_TIME,mostInterestingPlacesFirstGoalStrategyNO_INTEREST_TIME,nearestClusterFirstGoalStrategyFOUND_GOAL_TIME,nearestClusterFirstGoalStrategyNO_INTEREST_TIME,nearestPlacesFirstGoalStrategyFOUND_GOAL_TIME,nearestPlacesFirstGoalStrategyNO_INTEREST_TIME,shortestRouteRoutingStrategyCALCULATED_TIME,shortestRouteRoutingStrategyFROM_CACHE_TIME
Count,317.0,293.0,318.0,306.0,300.0,282.0,288.0,292.0,315.0,288.0,1916361.0,317.0,293.0,318.0,306.0,300.0,282.0,288.0,292.0,315.0,288.0,1.0,1.0,1.0,317.0,293.0,318.0,306.0,300.0,282.0,288.0,292.0,315.0,288.0,317.0,293.0,318.0,306.0,300.0,282.0,288.0,292.0,315.0,288.0,317.0,293.0,318.0,306.0,300.0,282.0,288.0,292.0,315.0,288.0,1.0,317.0,293.0,318.0,306.0,300.0,282.0,288.0,292.0,315.0,288.0,6470.0,137257.0,4875.0,599.0,4384.0,581.0,3966.0,610.0,5257.0,621.0,4829.0,588.0,6170.0,130456.0
Max,4372.367727806519,4334.1477278065195,8186.529138281412,4770.726124217671,4878.806111039858,4214.520090608966,4154.890328896394,8046.251138281413,4564.765748857193,4413.098674764814,2.8815942E7,640.0,640.0,640.0,640.0,640.0,640.0,640.0,640.0,640.0,640.0,7358068.0,999236.0,3.185385059E9,14.0,13.0,11.0,13.0,12.0,13.0,12.0,11.0,13.0,12.0,4946.0,4910.0,8715.0,5358.0,5463.0,4784.0,4732.0,8566.0,5161.0,5000.0,4946000.0,4910000.0,8715000.0,5358000.0,5463000.0,4784000.0,4732000.0,8566000.0,5161000.0,5000000.0,79239.0,4307.0,4271.0,8076.0,4719.0,4824.0,4145.0,4093.0,7927.0,4522.0,4361.0,9.77974541E8,6.17019491E8,2.067650277E9,1510.0,2.055022528E9,2242.0,311383.0,1916.0,1.696012726E9,2310.0,4.202173423E9,1675.0,8.98592253E8,2.63417084E8
Min,813.4636873674199,1089.0960829616376,4452.838377652439,659.5285148288718,522.3437160802384,552.6746276604257,991.8400829616376,4161.000034112252,597.4786276604257,676.0107508078348,1.0,639.0,639.0,639.0,639.0,639.0,639.0,639.0,639.0,639.0,639.0,7358068.0,999236.0,3.185385059E9,4.0,5.0,4.0,4.0,5.0,4.0,4.0,3.0,5.0,5.0,1437.0,1711.0,5029.0,1286.0,1156.0,1184.0,1615.0,4729.0,1226.0,1307.0,1437000.0,1711000.0,5029000.0,1286000.0,1156000.0,1184000.0,1615000.0,4729000.0,1226000.0,1307000.0,79239.0,798.0,1072.0,4390.0,647.0,517.0,545.0,976.0,4090.0,587.0,668.0,2440473.0,1263.0,50819.0,62.0,55575.0,72.0,184.0,48.0,30009.0,68.0,1882.0,59.0,2376551.0,1256.0
Avg,1847.4126142201849,2131.9362236792986,5972.825016814552,1555.642320668676,1161.406633508908,1798.3100700166424,2108.8348251309953,5853.010484942335,1610.4845953174272,1134.5640866780882,74.2015497080143,639.9873817034701,639.9931740614335,639.996855345912,639.9705882352941,639.99,639.9964539007092,639.9756944444445,639.986301369863,639.9968253968254,639.9861111111111,7358068.0,999236.0,3.185385059E9,8.170347003154575,7.621160409556314,6.509433962264151,8.50326797385621,8.233333333333333,8.102836879432624,7.46875,6.493150684931507,8.428571428571429,8.190972222222221,2463.96214511041,2739.9624573378837,6533.028301886792,2174.1143790849674,1785.6266666666668,2415.1560283687945,2717.0520833333335,6404.171232876713,2228.3460317460317,1759.1284722222222,2463962.14511041,2739962.4573378838,6533028.301886792,2174114.3790849675,1785626.6666666667,2415156.0283687944,2717052.0833333335,6404171.232876712,2228346.0317460317,1759128.4722222222,79239.0,1824.9747634069402,2100.9692832764504,5894.03144654088,1535.1437908496732,1146.6366666666668,1776.159574468085,2078.0763888888887,5765.184931506849,1589.3492063492063,1120.142361111111,4.941488105100463E7,17894.696372498307,3.0304289279384617E7,215.12687813021702,3.215782201459854E7,283.51807228915663,3313.1643973777104,177.6655737704918,2.2726258088833936E7,267.57971014492756,6.506202289086767E7,155.76700680272108,4.880650728865478E7,11757.780102103392
variance,219371.2841148692,182874.48520199442,485944.2304860986,362400.8556247225,411226.84062380384,190290.20164674066,167769.0292308335,570764.2648582131,519534.32420732046,376564.2793058871,4.335477947392229E8,0.01245907512265019,0.00677934512923856,0.003134765238716838,0.028546712802768336,0.009899999999999954,0.0035335244706000968,0.023714795524691412,0.013510977669356211,0.003164525069286981,0.013695987654320925,0.0,0.0,0.0,2.090855715550966,1.9213269810947153,1.5329298682805206,2.008159254987399,1.7255555555555584,2.276658618781757,1.6379123263888888,1.7020078814036401,1.8702947845804985,1.9461684992283916,213465.46859855347,177922.86207177717,474075.03379019926,355327.0097932413,403032.11395555537,183803.64941401334,161934.7021484375,557280.1556108085,508806.89296044357,368573.6397448883,2.1346546859855338E11,1.7792286207177728E11,4.740750337901993E11,3.553270097932418E11,4.030321139555546E11,1.838036494140133E11,1.6193470214843732E11,5.572801556108097E11,5.0880689296044275E11,3.6857363974488794E11,0.0,213466.04352715178,177923.05366399136,474066.30718721496,355324.12311504176,403028.4646555554,183803.25467783326,161930.43860918202,557282.2740195161,508810.30980095733,368570.14987220254,6.520107140156108E15,5.680421982169289E12,2.7674583116768148E16,27434.040663208845,3.1460914629180512E16,79935.95018974341,1.1241089562199019E8,45085.29471647394,1.7037999470486116E16,77113.39018413503,1.88995029463653504E17,22545.396394442138,5.753486434695617E15,1.8022761059653599E12
Quantil 0,,,,,,,,,,,,,,,,,,,,,,,,,,,,,,,,,,,,,,,,,,,,,,,,,,,,,,,,,,,,,,,,,,,,,,,,,,,,,,,
Quantil 1,,,,,,,,,,,,,,,,,,,,,,,,,,,,,,,,,,,,,,,,,,,,,,,,,,,,,,,,,,,,,,,,,,,,,,,,,,,,,,,
Quantil 2,,,,,,,,,,,,,,,,,,,,,,,,,,,,,,,,,,,,,,,,,,,,,,,,,,,,,,,,,,,,,,,,,,,,,,,,,,,,,,,
Quantil 3,,,,,,,,,,,,,,,,,,,,,,,,,,,,,,,,,,,,,,,,,,,,,,,,,,,,,,,,,,,,,,,,,,,,,,,,,,,,,,,
Quantil 4,,,,,,,,,,,,,,,,,,,,,,,,,,,,,,,,,,,,,,,,,,,,,,,,,,,,,,,,,,,,,,,,,,,,,,,,,,,,,,,
Quantil 5,,,,,,,,,,,,,,,,,,,,,,,,,,,,,,,,,,,,,,,,,,,,,,,,,,,,,,,,,,,,,,,,,,,,,,,,,,,,,,,
Quantil 6,,,,,,,,,,,,,,,,,,,,,,,,,,,,,,,,,,,,,,,,,,,,,,,,,,,,,,,,,,,,,,,,,,,,,,,,,,,,,,,
Quantil 7,,,,,,,,,,,,,,,,,,,,,,,,,,,,,,,,,,,,,,,,,,,,,,,,,,,,,,,,,,,,,,,,,,,,,,,,,,,,,,,
Quantil 8,,,,,,,,,,,,,,,,,,,,,,,,,,,,,,,,,,,,,,,,,,,,,,,,,,,,,,,,,,,,,,,,,,,,,,,,,,,,,,,
Quantil 9,,,,,,,,,,,,,,,,,,,,,,,,,,,,,,,,,,,,,,,,,,,,,,,,,,,,,,,,,,,,,,,,,,,,,,,,,,,,,,,
Quantil 10,,,,,,,,,,,,,,,,,,,,,,,,,,,,,,,,,,,,,,,,,,,,,,,,,,,,,,,,,,,,,,,,,,,,,,,,,,,,,,,
Quantil 11,,,,,,,,,,,,,,,,,,,,,,,,,,,,,,,,,,,,,,,,,,,,,,,,,,,,,,,,,,,,,,,,,,,,,,,,,,,,,,,
Quantil 12,,,,,,,,,,,,,,,,,,,,,,,,,,,,,,,,,,,,,,,,,,,,,,,,,,,,,,,,,,,,,,,,,,,,,,,,,,,,,,,
Quantil 13,,,,,,,,,,,,,,,,,,,,,,,,,,,,,,,,,,,,,,,,,,,,,,,,,,,,,,,,,,,,,,,,,,,,,,,,,,,,,,,
Quantil 14,,,,,,,,,,,,,,,,,,,,,,,,,,,,,,,,,,,,,,,,,,,,,,,,,,,,,,,,,,,,,,,,,,,,,,,,,,,,,,,
Quantil 15,,,,,,,,,,,,,,,,,,,,,,,,,,,,,,,,,,,,,,,,,,,,,,,,,,,,,,,,,,,,,,,,,,,,,,,,,,,,,,,
Quantil 16,,,,,,,,,,,,,,,,,,,,,,,,,,,,,,,,,,,,,,,,,,,,,,,,,,,,,,,,,,,,,,,,,,,,,,,,,,,,,,,
Quantil 17,,,,,,,,,,,,,,,,,,,,,,,,,,,,,,,,,,,,,,,,,,,,,,,,,,,,,,,,,,,,,,,,,,,,,,,,,,,,,,,
Quantil 18,,,,,,,,,,,,,,,,,,,,,,,,,,,,,,,,,,,,,,,,,,,,,,,,,,,,,,,,,,,,,,,,,,,,,,,,,,,,,,,
Quantil 19,,,,,,,,,,,,,,,,,,,,,,,,,,,,,,,,,,,,,,,,,,,,,,,,,,,,,,,,,,,,,,,,,,,,,,,,,,,,,,,
