ID,DWR:FRG:IDF,DWR:FRG:MICF,DWR:FRG:MIPF,DWR:FRG:NCF,DWR:FRG:NPF,DWR:SRG:IDF,DWR:SRG:MICF,DWR:SRG:MIPF,DWR:SRG:NCF,DWR:SRG:NPF,DefaultEnjoyingStrategyLEAVE_TIME,ESTER:FRG:IDF,ESTER:FRG:MICF,ESTER:FRG:MIPF,ESTER:FRG:NCF,ESTER:FRG:NPF,ESTER:SRG:IDF,ESTER:SRG:MICF,ESTER:SRG:MIPF,ESTER:SRG:NCF,ESTER:SRG:NPF,GraphClusteringAlgorithmCREATE_LINKAGES_TIME,GraphClusteringAlgorithmCREATE_WEIGHTED_CLUSTER_TIME,GraphClusteringAlgorithmWEIGHTED_CLUSTERING_TIME,PVISR:FRG:IDF,PVISR:FRG:MICF,PVISR:FRG:MIPF,PVISR:FRG:NCF,PVISR:FRG:NPF,PVISR:SRG:IDF,PVISR:SRG:MICF,PVISR:SRG:MIPF,PVISR:SRG:NCF,PVISR:SRG:NPF,SSTER:FRG:IDF,SSTER:FRG:MICF,SSTER:FRG:MIPF,SSTER:FRG:NCF,SSTER:FRG:NPF,SSTER:SRG:IDF,SSTER:SRG:MICF,SSTER:SRG:MIPF,SSTER:SRG:NCF,SSTER:SRG:NPF,STIR:FRG:IDF,STIR:FRG:MICF,STIR:FRG:MIPF,STIR:FRG:NCF,STIR:FRG:NPF,STIR:SRG:IDF,STIR:SRG:MICF,STIR:SRG:MIPF,STIR:SRG:NCF,STIR:SRG:NPF,SimulationTime,WSTER:FRG:IDF,WSTER:FRG:MICF,WSTER:FRG:MIPF,WSTER:FRG:NCF,WSTER:FRG:NPF,WSTER:SRG:IDF,WSTER:SRG:MICF,WSTER:SRG:MIPF,WSTER:SRG:NCF,WSTER:SRG:NPF,fastestRouteRoutingStrategyCALCULATED_TIME,fastestRouteRoutingStrategyFROM_CACHE_TIME,intrestDistanceFactorGoalStrategyFOUND_GOAL_TIME,intrestDistanceFactorGoalStrategyNO_INTEREST_TIME,mostInterestingClusterFirstGoalStrategyFOUND_GOAL_TIME,mostInterestingClusterFirstGoalStrategyNO_INTEREST_TIME,mostInterestingPlacesFirstGoalStrategyFOUND_GOAL_TIME,mostInterestingPlacesFirstGoalStrategyNO_INTEREST_TIME,nearestClusterFirstGoalStrategyFOUND_GOAL_TIME,nearestClusterFirstGoalStrategyNO_INTEREST_TIME,nearestPlacesFirstGoalStrategyFOUND_GOAL_TIME,nearestPlacesFirstGoalStrategyNO_INTEREST_TIME,shortestRouteRoutingStrategyCALCULATED_TIME,shortestRouteRoutingStrategyFROM_CACHE_TIME
Count,102.0,107.0,116.0,88.0,101.0,98.0,88.0,90.0,119.0,91.0,639000.0,102.0,107.0,116.0,88.0,101.0,98.0,88.0,90.0,119.0,91.0,1.0,1.0,1.0,102.0,107.0,116.0,88.0,101.0,98.0,88.0,90.0,119.0,91.0,102.0,107.0,116.0,88.0,101.0,98.0,88.0,90.0,119.0,91.0,102.0,107.0,116.0,88.0,101.0,98.0,88.0,90.0,119.0,91.0,1.0,102.0,107.0,116.0,88.0,101.0,98.0,88.0,90.0,119.0,91.0,7816.0,38274.0,1594.0,200.0,1452.0,195.0,1288.0,206.0,1709.0,207.0,1555.0,192.0,7876.0,38518.0
Max,3992.076328896394,3690.8413288963943,7824.148857057374,4711.004288189821,5368.353612904074,3827.5383288963944,4675.852103166996,7970.8431382814115,4956.865288189821,4266.886510792664,2.41529994E8,640.0,640.0,640.0,640.0,640.0,640.0,640.0,640.0,640.0,640.0,6402701.0,2043195.0,3.216767749E9,13.0,12.0,9.0,12.0,12.0,11.0,13.0,12.0,13.0,12.0,4580.0,4281.0,8354.0,5297.0,5942.0,4402.0,5236.0,8490.0,5548.0,4856.0,4580000.0,4281000.0,8354000.0,5297000.0,5942000.0,4402000.0,5236000.0,8490000.0,5548000.0,4856000.0,13900.0,3941.0,3642.0,7715.0,4658.0,5303.0,3763.0,4597.0,7851.0,4909.0,4217.0,5.67934735E8,9.5997822E7,2.141979635E9,1487.0,2.091294282E9,2081.0,284073.0,2799.0,1.881163075E9,1738.0,4.270802306E9,1215.0,5.58236812E8,2.83868399E8
Min,813.4636873674199,986.022022590494,4406.558168101138,755.1976600007058,726.9250674683796,700.5924348441074,654.4528215336225,4108.558168101138,589.3606600007058,571.944031084924,1.0,639.0,639.0,639.0,639.0,640.0,640.0,639.0,639.0,640.0,639.0,6402701.0,2043195.0,3.216767749E9,5.0,4.0,4.0,6.0,6.0,5.0,4.0,3.0,5.0,5.0,1437.0,1612.0,4985.0,1384.0,1356.0,1336.0,1280.0,4681.0,1220.0,1203.0,1437000.0,1612000.0,4985000.0,1384000.0,1356000.0,1336000.0,1280000.0,4681000.0,1220000.0,1203000.0,13900.0,798.0,973.0,4346.0,745.0,717.0,697.0,642.0,4042.0,581.0,564.0,2435924.0,1624.0,66928.0,139.0,103886.0,147.0,541.0,53.0,35451.0,203.0,6817.0,149.0,2354993.0,1944.0
Avg,1884.3826188437915,2025.8333110585727,5740.941901459737,1705.8764375491555,1408.1622751044163,1734.343766251297,2070.642839727279,5614.527708334939,1771.7899270857506,1466.4558773944532,452.49672456964004,639.9803921568628,639.9626168224299,639.9741379310345,639.9886363636364,640.0,640.0,639.9772727272727,639.9444444444445,640.0,639.978021978022,6402701.0,2043195.0,3.216767749E9,8.058823529411764,7.411214953271028,6.258620689655173,8.215909090909092,8.257425742574258,7.877551020408164,7.488636363636363,6.2444444444444445,8.285714285714286,7.923076923076923,2496.401960784314,2633.96261682243,6301.836206896552,2321.034090909091,2028.148514851485,2348.387755102041,2677.465909090909,6166.977777777778,2386.2605042016808,2086.032967032967,2496401.9607843137,2633962.61682243,6301836.206896552,2321034.090909091,2028148.5148514851,2348387.7551020407,2677465.909090909,6166977.777777778,2386260.504201681,2086032.9670329671,13900.0,1857.421568627451,1995.0,5662.862068965517,1682.0454545454545,1389.148514851485,1709.3877551020407,2038.4886363636363,5528.033333333334,1747.2605042016808,1447.0549450549452,5.10009913645087E7,9373.195145529602,1.2105026590526976E8,300.595,1.1861963343663912E8,348.1794871794872,5339.568322981367,319.27669902912623,9.580507561556466E7,360.78743961352654,2.274335383414791E8,307.4010416666667,4.9627615683976635E7,28598.551326652476
variance,526560.049525679,350553.32692403777,715169.3343967672,725451.537628624,817626.115925706,336298.67053985613,481339.88602353574,559000.995894459,684149.7688241693,924851.2234755018,9.136738222122765E10,0.019223375624759745,0.03598567560485634,0.02519322235434008,0.01123450413223142,0.0,0.0,0.02221074380165289,0.052469135802469216,0.0,0.02149498852795557,0.0,0.0,0.0,2.2318339100346023,1.8682854397763982,1.7434601664684883,2.1920196280991724,2.01293990785217,2.168679716784676,2.1589617768595044,1.6513580246913575,2.674669867947177,1.8512256973795425,514007.16195693956,341240.2789763298,697230.2921373368,711395.2147469007,802135.611606705,325919.82923781767,466834.8397469008,545452.821728395,671745.4699526869,906753.7681439442,5.140071619569397E11,3.4124027897632983E11,6.972302921373367E11,7.113952147469009E11,8.02135611606705E11,3.259198292378175E11,4.668348397469008E11,5.4545282172839514E11,6.717454699526868E11,9.067537681439447E11,0.0,514017.2242406767,341206.2990654206,697190.4120095125,711457.134297521,802135.611606705,325919.82923781767,466799.1589617769,545425.8544444443,671745.4699526869,906749.722255766,5.80073308697605E15,2.822295571908829E11,1.15402908486013792E17,27855.960974999984,1.150813778111004E17,60215.58316896779,2.4519556097359243E8,185983.45256386074,6.5910998235761016E16,39851.37510793718,6.2536986385311962E17,33306.6047905815,5.702354587655076E15,3.433584743313577E12
Quantil 0,,,,,,,,,,,,,,,,,,,,,,,,,,,,,,,,,,,,,,,,,,,,,,,,,,,,,,,,,,,,,,,,,,,,,,,,,,,,,,,
Quantil 1,,,,,,,,,,,,,,,,,,,,,,,,,,,,,,,,,,,,,,,,,,,,,,,,,,,,,,,,,,,,,,,,,,,,,,,,,,,,,,,
Quantil 2,,,,,,,,,,,,,,,,,,,,,,,,,,,,,,,,,,,,,,,,,,,,,,,,,,,,,,,,,,,,,,,,,,,,,,,,,,,,,,,
Quantil 3,,,,,,,,,,,,,,,,,,,,,,,,,,,,,,,,,,,,,,,,,,,,,,,,,,,,,,,,,,,,,,,,,,,,,,,,,,,,,,,
Quantil 4,,,,,,,,,,,,,,,,,,,,,,,,,,,,,,,,,,,,,,,,,,,,,,,,,,,,,,,,,,,,,,,,,,,,,,,,,,,,,,,
Quantil 5,,,,,,,,,,,,,,,,,,,,,,,,,,,,,,,,,,,,,,,,,,,,,,,,,,,,,,,,,,,,,,,,,,,,,,,,,,,,,,,
Quantil 6,,,,,,,,,,,,,,,,,,,,,,,,,,,,,,,,,,,,,,,,,,,,,,,,,,,,,,,,,,,,,,,,,,,,,,,,,,,,,,,
Quantil 7,,,,,,,,,,,,,,,,,,,,,,,,,,,,,,,,,,,,,,,,,,,,,,,,,,,,,,,,,,,,,,,,,,,,,,,,,,,,,,,
Quantil 8,,,,,,,,,,,,,,,,,,,,,,,,,,,,,,,,,,,,,,,,,,,,,,,,,,,,,,,,,,,,,,,,,,,,,,,,,,,,,,,
Quantil 9,,,,,,,,,,,,,,,,,,,,,,,,,,,,,,,,,,,,,,,,,,,,,,,,,,,,,,,,,,,,,,,,,,,,,,,,,,,,,,,
Quantil 10,,,,,,,,,,,,,,,,,,,,,,,,,,,,,,,,,,,,,,,,,,,,,,,,,,,,,,,,,,,,,,,,,,,,,,,,,,,,,,,
Quantil 11,,,,,,,,,,,,,,,,,,,,,,,,,,,,,,,,,,,,,,,,,,,,,,,,,,,,,,,,,,,,,,,,,,,,,,,,,,,,,,,
Quantil 12,,,,,,,,,,,,,,,,,,,,,,,,,,,,,,,,,,,,,,,,,,,,,,,,,,,,,,,,,,,,,,,,,,,,,,,,,,,,,,,
Quantil 13,,,,,,,,,,,,,,,,,,,,,,,,,,,,,,,,,,,,,,,,,,,,,,,,,,,,,,,,,,,,,,,,,,,,,,,,,,,,,,,
Quantil 14,,,,,,,,,,,,,,,,,,,,,,,,,,,,,,,,,,,,,,,,,,,,,,,,,,,,,,,,,,,,,,,,,,,,,,,,,,,,,,,
Quantil 15,,,,,,,,,,,,,,,,,,,,,,,,,,,,,,,,,,,,,,,,,,,,,,,,,,,,,,,,,,,,,,,,,,,,,,,,,,,,,,,
Quantil 16,,,,,,,,,,,,,,,,,,,,,,,,,,,,,,,,,,,,,,,,,,,,,,,,,,,,,,,,,,,,,,,,,,,,,,,,,,,,,,,
Quantil 17,,,,,,,,,,,,,,,,,,,,,,,,,,,,,,,,,,,,,,,,,,,,,,,,,,,,,,,,,,,,,,,,,,,,,,,,,,,,,,,
Quantil 18,,,,,,,,,,,,,,,,,,,,,,,,,,,,,,,,,,,,,,,,,,,,,,,,,,,,,,,,,,,,,,,,,,,,,,,,,,,,,,,
Quantil 19,,,,,,,,,,,,,,,,,,,,,,,,,,,,,,,,,,,,,,,,,,,,,,,,,,,,,,,,,,,,,,,,,,,,,,,,,,,,,,,
