ID,CircleDistributionStrategyTIME,DWR:FRG:IDF,DWR:FRG:MICF,DWR:FRG:MIPF,DWR:FRG:NCF,DWR:FRG:NPF,DWR:SRG:IDF,DWR:SRG:MICF,DWR:SRG:MIPF,DWR:SRG:NCF,DWR:SRG:NPF,DefaultEnjoyingStrategyLEAVE_TIME,DefaultReconstructionStrategyABORTED_TIME,DefaultReconstructionStrategyFOUND_POINT_ABORTED_TIME,DefaultReconstructionStrategyFOUND_POINT_TIME,DefaultReconstructionStrategyNO_STATION,DefaultReconstructionStrategyPOINTS_FOUND,ESTER:FRG:IDF,ESTER:FRG:MICF,ESTER:FRG:MIPF,ESTER:FRG:NCF,ESTER:FRG:NPF,ESTER:SRG:IDF,ESTER:SRG:MICF,ESTER:SRG:MIPF,ESTER:SRG:NCF,ESTER:SRG:NPF,GraphClusteringAlgorithmCREATE_LINKAGES_TIME,GraphClusteringAlgorithmCREATE_WEIGHTED_CLUSTER_TIME,GraphClusteringAlgorithmWEIGHTED_CLUSTERING_TIME,PVISR:FRG:IDF,PVISR:FRG:MICF,PVISR:FRG:MIPF,PVISR:FRG:NCF,PVISR:FRG:NPF,PVISR:SRG:IDF,PVISR:SRG:MICF,PVISR:SRG:MIPF,PVISR:SRG:NCF,PVISR:SRG:NPF,SSTER:FRG:IDF,SSTER:FRG:MICF,SSTER:FRG:MIPF,SSTER:FRG:NCF,SSTER:FRG:NPF,SSTER:SRG:IDF,SSTER:SRG:MICF,SSTER:SRG:MIPF,SSTER:SRG:NCF,SSTER:SRG:NPF,STIR:FRG:IDF,STIR:FRG:MICF,STIR:FRG:MIPF,STIR:FRG:NCF,STIR:FRG:NPF,STIR:SRG:IDF,STIR:SRG:MICF,STIR:SRG:MIPF,STIR:SRG:NCF,STIR:SRG:NPF,SimulationTime,TRAJECTORY,WSTER:FRG:IDF,WSTER:FRG:MICF,WSTER:FRG:MIPF,WSTER:FRG:NCF,WSTER:FRG:NPF,WSTER:SRG:IDF,WSTER:SRG:MICF,WSTER:SRG:MIPF,WSTER:SRG:NCF,WSTER:SRG:NPF,fastestRouteRoutingStrategyCALCULATED_TIME,fastestRouteRoutingStrategyFROM_CACHE_TIME,intrestDistanceFactorGoalStrategyFOUND_GOAL_TIME,intrestDistanceFactorGoalStrategyNO_INTEREST_TIME,mostInterestingClusterFirstGoalStrategyFOUND_GOAL_TIME,mostInterestingClusterFirstGoalStrategyNO_INTEREST_TIME,mostInterestingPlacesFirstGoalStrategyFOUND_GOAL_TIME,mostInterestingPlacesFirstGoalStrategyNO_INTEREST_TIME,nearestClusterFirstGoalStrategyFOUND_GOAL_TIME,nearestClusterFirstGoalStrategyNO_INTEREST_TIME,nearestPlacesFirstGoalStrategyFOUND_GOAL_TIME,nearestPlacesFirstGoalStrategyNO_INTEREST_TIME,shortestRouteRoutingStrategyCALCULATED_TIME,shortestRouteRoutingStrategyFROM_CACHE_TIME
Count,1.0,299.0,299.0,289.0,273.0,308.0,315.0,288.0,331.0,302.0,296.0,1917000.0,92.0,1038.0,160013.0,0.0,161051.0,299.0,299.0,289.0,273.0,308.0,315.0,288.0,331.0,302.0,296.0,1.0,1.0,1.0,299.0,299.0,289.0,273.0,308.0,315.0,288.0,331.0,302.0,296.0,299.0,299.0,289.0,273.0,308.0,315.0,288.0,331.0,302.0,296.0,299.0,299.0,289.0,273.0,308.0,315.0,288.0,331.0,302.0,296.0,1.0,161049.0,299.0,299.0,289.0,273.0,308.0,315.0,288.0,331.0,302.0,296.0,8890.0,125958.0,4860.0,614.0,4387.0,587.0,4031.0,620.0,4819.0,575.0,4934.0,604.0,9051.0,130075.0
Max,4986033.0,3986.644328896394,4174.0543288963945,8186.529138281412,4700.114912829344,4776.812275012008,3961.5373288963942,4737.636103166997,8055.429138281412,4663.821748857194,4461.411674764814,1.08898449E8,1.289378499E9,1.380089535E9,9.9995306E7,4.9E-324,10.0,640.0,640.0,640.0,640.0,640.0,640.0,640.0,640.0,640.0,640.0,6129617.0,936958.0,3.225015703E9,12.0,12.0,11.0,13.0,13.0,13.0,13.0,12.0,12.0,13.0,4574.0,4758.0,8715.0,5290.0,5360.0,4542.0,5297.0,8574.0,5262.0,5048.0,4574000.0,4758000.0,8715000.0,5290000.0,5360000.0,4542000.0,5297000.0,8574000.0,5262000.0,5048000.0,47269.0,52.38422385476144,3935.0,4119.0,8076.0,4651.0,4721.0,3903.0,4658.0,7935.0,4623.0,4409.0,1.415451992E9,3.27431311E8,2.969853359E9,859.0,2.777777677E9,803.0,1.27988146E8,2556.0,2.749344563E9,1452.0,5.52048739E9,1344.0,1.286318648E9,2.61219387E8
Min,4986033.0,552.6746276604258,793.9590225904941,4406.558168101138,523.3829866382032,522.3437160802384,717.192022590494,850.1860829616376,4312.56037765244,735.0236600007058,522.3437160802384,1.0,1.01786436E8,1.0000086E8,33400.0,1.7976931348623157E308,1.0,639.0,639.0,639.0,639.0,639.0,639.0,639.0,639.0,639.0,639.0,6129617.0,936958.0,3.225015703E9,4.0,4.0,4.0,5.0,5.0,4.0,5.0,4.0,5.0,4.0,1184.0,1421.0,4985.0,1157.0,1156.0,1348.0,1478.0,4879.0,1362.0,1156.0,1184000.0,1421000.0,4985000.0,1157000.0,1156000.0,1348000.0,1478000.0,4879000.0,1362000.0,1156000.0,47269.0,0.023521157173583655,545.0,782.0,4346.0,518.0,517.0,709.0,839.0,4240.0,723.0,517.0,2399481.0,1460.0,60902.0,65.0,89296.0,97.0,442.0,70.0,31037.0,91.0,2111.0,77.0,2505263.0,1515.0
Avg,4986033.0,1836.6330045103862,2116.1859519238064,5956.858659985128,1688.9771886251683,1352.7684069202794,1846.0774765009962,2155.216905105123,5789.588852004069,1640.9076518816692,1270.430834594624,161.76103234220136,1.9804247048913044E8,2.054249871637765E8,938306.5556173561,NaN,9.96870556531782,639.9933110367894,639.9966555183946,639.9965397923876,639.989010989011,639.9837662337662,639.9777777777778,639.9895833333334,639.987915407855,639.9867549668874,639.9864864864865,6129617.0,936958.0,3.225015703E9,7.976588628762542,7.404682274247492,6.515570934256055,8.36996336996337,8.162337662337663,7.857142857142857,7.545138888888889,6.4894259818731115,8.390728476821192,8.175675675675675,2452.8996655518395,2724.648829431438,6516.674740484429,2305.5531135531137,1974.7694805194806,2461.1079365079363,2762.0173611111113,6341.190332326284,2258.201986754967,1893.1722972972973,2452899.6655518394,2724648.8294314384,6516674.7404844295,2305553.113553114,1974769.4805194805,2461107.9365079366,2762017.361111111,6341190.332326284,2258201.986754967,1893172.2972972973,47269.0,16.566132338592585,1813.9063545150502,2085.6521739130435,5877.678200692041,1666.5641025641025,1335.7857142857142,1822.1301587301587,2123.027777777778,5702.202416918429,1619.2152317880796,1254.1858108108108,5.942322474071991E7,31268.272630559393,5.835200087736625E7,225.84527687296418,5.505063781057671E7,246.9335604770017,37150.21359464153,256.26290322580644,4.889028356858269E7,252.14608695652174,1.1472275675820835E8,192.24668874172184,5.962967099955806E7,16670.54144147607
variance,0.0,264827.09005229775,254864.26453672565,615220.7792787593,713067.1872031459,849243.8222936447,295318.30882315635,360704.7649968163,606992.2598369346,570326.2662416707,662456.1668815882,7.306061537456015E9,1.9167167295511824E16,2.3287207907745132E16,3.468153904986542E13,NaN,0.19489649893065042,0.006644220981868218,0.0033332960481426087,0.0034482345757354564,0.010868252626494462,0.01597023106763364,0.02172839506172822,0.010308159722222248,0.01193855477770379,0.013069602210429342,0.013330898466033555,0.0,0.0,0.0,2.0964418742519673,2.0134897819934974,2.014463428359334,1.991332233090474,1.9346854444257124,2.109750566893422,1.942406925154324,1.7967159847025798,2.0791193368711887,1.9150840029218332,257885.94979921877,248325.41848525216,599903.236766801,699775.6098163119,832797.9501075221,285133.6454925672,348448.7184485915,592322.0030485305,559074.3664861186,648336.9128812093,2.5788594979921942E11,2.4832541848525174E11,5.999032367668021E11,6.997756098163137E11,8.327979501075226E11,2.851336454925673E11,3.484487184485918E11,5.923220030485305E11,5.59074366486119E11,6.483369128812089E11,0.0,61.623534872898674,257882.37250142617,248325.22349861846,599898.8618431301,699766.4803230956,832786.0514842295,285131.24972537137,348460.429783951,592321.986217724,559066.4338077282,648323.8742581266,1.227202642329962E16,5.444419729435036E12,7.3939426374389648E16,12828.844138929846,6.713248979141648E16,11890.126761258269,4.0717006777342554E12,68078.37120447449,5.4254852478291136E16,16286.615180340266,3.9195885413797683E17,15062.288482413076,1.38279376117505E16,1.743445176343247E12
Quantil 0,,,,,,,,,,,,,,,,,,,,,,,,,,,,,,,,,,,,,,,,,,,,,,,,,,,,,,,,,,,,,,,,,,,,,,,,,,,,,,,,,,,,,,
Quantil 1,,,,,,,,,,,,,,,,,,,,,,,,,,,,,,,,,,,,,,,,,,,,,,,,,,,,,,,,,,,,,,,,,,,,,,,,,,,,,,,,,,,,,,
Quantil 2,,,,,,,,,,,,,,,,,,,,,,,,,,,,,,,,,,,,,,,,,,,,,,,,,,,,,,,,,,,,,,,,,,,,,,,,,,,,,,,,,,,,,,
Quantil 3,,,,,,,,,,,,,,,,,,,,,,,,,,,,,,,,,,,,,,,,,,,,,,,,,,,,,,,,,,,,,,,,,,,,,,,,,,,,,,,,,,,,,,
Quantil 4,,,,,,,,,,,,,,,,,,,,,,,,,,,,,,,,,,,,,,,,,,,,,,,,,,,,,,,,,,,,,,,,,,,,,,,,,,,,,,,,,,,,,,
Quantil 5,,,,,,,,,,,,,,,,,,,,,,,,,,,,,,,,,,,,,,,,,,,,,,,,,,,,,,,,,,,,,,,,,,,,,,,,,,,,,,,,,,,,,,
Quantil 6,,,,,,,,,,,,,,,,,,,,,,,,,,,,,,,,,,,,,,,,,,,,,,,,,,,,,,,,,,,,,,,,,,,,,,,,,,,,,,,,,,,,,,
Quantil 7,,,,,,,,,,,,,,,,,,,,,,,,,,,,,,,,,,,,,,,,,,,,,,,,,,,,,,,,,,,,,,,,,,,,,,,,,,,,,,,,,,,,,,
Quantil 8,,,,,,,,,,,,,,,,,,,,,,,,,,,,,,,,,,,,,,,,,,,,,,,,,,,,,,,,,,,,,,,,,,,,,,,,,,,,,,,,,,,,,,
Quantil 9,,,,,,,,,,,,,,,,,,,,,,,,,,,,,,,,,,,,,,,,,,,,,,,,,,,,,,,,,,,,,,,,,,,,,,,,,,,,,,,,,,,,,,
Quantil 10,,,,,,,,,,,,,,,,,,,,,,,,,,,,,,,,,,,,,,,,,,,,,,,,,,,,,,,,,,,,,,,,,,,,,,,,,,,,,,,,,,,,,,
Quantil 11,,,,,,,,,,,,,,,,,,,,,,,,,,,,,,,,,,,,,,,,,,,,,,,,,,,,,,,,,,,,,,,,,,,,,,,,,,,,,,,,,,,,,,
Quantil 12,,,,,,,,,,,,,,,,,,,,,,,,,,,,,,,,,,,,,,,,,,,,,,,,,,,,,,,,,,,,,,,,,,,,,,,,,,,,,,,,,,,,,,
Quantil 13,,,,,,,,,,,,,,,,,,,,,,,,,,,,,,,,,,,,,,,,,,,,,,,,,,,,,,,,,,,,,,,,,,,,,,,,,,,,,,,,,,,,,,
Quantil 14,,,,,,,,,,,,,,,,,,,,,,,,,,,,,,,,,,,,,,,,,,,,,,,,,,,,,,,,,,,,,,,,,,,,,,,,,,,,,,,,,,,,,,
Quantil 15,,,,,,,,,,,,,,,,,,,,,,,,,,,,,,,,,,,,,,,,,,,,,,,,,,,,,,,,,,,,,,,,,,,,,,,,,,,,,,,,,,,,,,
Quantil 16,,,,,,,,,,,,,,,,,,,,,,,,,,,,,,,,,,,,,,,,,,,,,,,,,,,,,,,,,,,,,,,,,,,,,,,,,,,,,,,,,,,,,,
Quantil 17,,,,,,,,,,,,,,,,,,,,,,,,,,,,,,,,,,,,,,,,,,,,,,,,,,,,,,,,,,,,,,,,,,,,,,,,,,,,,,,,,,,,,,
Quantil 18,,,,,,,,,,,,,,,,,,,,,,,,,,,,,,,,,,,,,,,,,,,,,,,,,,,,,,,,,,,,,,,,,,,,,,,,,,,,,,,,,,,,,,
Quantil 19,,,,,,,,,,,,,,,,,,,,,,,,,,,,,,,,,,,,,,,,,,,,,,,,,,,,,,,,,,,,,,,,,,,,,,,,,,,,,,,,,,,,,,
