ID,CircleDistributionStrategyTIME,DWR:FRG:IDF,DWR:FRG:MICF,DWR:FRG:MIPF,DWR:FRG:NCF,DWR:FRG:NPF,DWR:SRG:IDF,DWR:SRG:MICF,DWR:SRG:MIPF,DWR:SRG:NCF,DWR:SRG:NPF,DefaultEnjoyingStrategyLEAVE_TIME,DefaultReconstructionStrategyABORTED_TIME,DefaultReconstructionStrategyFOUND_POINT_ABORTED_TIME,DefaultReconstructionStrategyFOUND_POINT_TIME,DefaultReconstructionStrategyNO_STATION,DefaultReconstructionStrategyPOINTS_FOUND,ESTER:FRG:IDF,ESTER:FRG:MICF,ESTER:FRG:MIPF,ESTER:FRG:NCF,ESTER:FRG:NPF,ESTER:SRG:IDF,ESTER:SRG:MICF,ESTER:SRG:MIPF,ESTER:SRG:NCF,ESTER:SRG:NPF,GraphClusteringAlgorithmCREATE_LINKAGES_TIME,GraphClusteringAlgorithmCREATE_WEIGHTED_CLUSTER_TIME,GraphClusteringAlgorithmWEIGHTED_CLUSTERING_TIME,PVISR:FRG:IDF,PVISR:FRG:MICF,PVISR:FRG:MIPF,PVISR:FRG:NCF,PVISR:FRG:NPF,PVISR:SRG:IDF,PVISR:SRG:MICF,PVISR:SRG:MIPF,PVISR:SRG:NCF,PVISR:SRG:NPF,SSTER:FRG:IDF,SSTER:FRG:MICF,SSTER:FRG:MIPF,SSTER:FRG:NCF,SSTER:FRG:NPF,SSTER:SRG:IDF,SSTER:SRG:MICF,SSTER:SRG:MIPF,SSTER:SRG:NCF,SSTER:SRG:NPF,STIR:FRG:IDF,STIR:FRG:MICF,STIR:FRG:MIPF,STIR:FRG:NCF,STIR:FRG:NPF,STIR:SRG:IDF,STIR:SRG:MICF,STIR:SRG:MIPF,STIR:SRG:NCF,STIR:SRG:NPF,SimulationTime,TRAJECTORY,WSTER:FRG:IDF,WSTER:FRG:MICF,WSTER:FRG:MIPF,WSTER:FRG:NCF,WSTER:FRG:NPF,WSTER:SRG:IDF,WSTER:SRG:MICF,WSTER:SRG:MIPF,WSTER:SRG:NCF,WSTER:SRG:NPF,fastestRouteRoutingStrategyCALCULATED_TIME,fastestRouteRoutingStrategyFROM_CACHE_TIME,intrestDistanceFactorGoalStrategyFOUND_GOAL_TIME,intrestDistanceFactorGoalStrategyNO_INTEREST_TIME,mostInterestingClusterFirstGoalStrategyFOUND_GOAL_TIME,mostInterestingClusterFirstGoalStrategyNO_INTEREST_TIME,mostInterestingPlacesFirstGoalStrategyFOUND_GOAL_TIME,mostInterestingPlacesFirstGoalStrategyNO_INTEREST_TIME,nearestClusterFirstGoalStrategyFOUND_GOAL_TIME,nearestClusterFirstGoalStrategyNO_INTEREST_TIME,nearestPlacesFirstGoalStrategyFOUND_GOAL_TIME,nearestPlacesFirstGoalStrategyNO_INTEREST_TIME,shortestRouteRoutingStrategyCALCULATED_TIME,shortestRouteRoutingStrategyFROM_CACHE_TIME
Count,1.0,291.0,301.0,297.0,305.0,301.0,303.0,309.0,319.0,283.0,291.0,1917000.0,215.0,2242.0,169663.0,11.0,171905.0,291.0,301.0,297.0,305.0,301.0,303.0,309.0,319.0,283.0,291.0,1.0,1.0,1.0,291.0,301.0,297.0,305.0,301.0,303.0,309.0,319.0,283.0,291.0,291.0,301.0,297.0,305.0,301.0,303.0,309.0,319.0,283.0,291.0,291.0,301.0,297.0,305.0,301.0,303.0,309.0,319.0,283.0,291.0,1.0,171902.0,291.0,301.0,297.0,305.0,301.0,303.0,309.0,319.0,283.0,291.0,15523.0,118573.0,4677.0,594.0,4637.0,610.0,3898.0,616.0,4788.0,588.0,4794.0,592.0,16179.0,119154.0
Max,5025508.0,4260.562127559325,4408.771727806519,8611.942857057373,5272.577912829344,5061.361111039858,4416.89472780652,4267.178727806519,8057.250138281412,4989.174751097962,4613.472275012009,2.7218572E8,7.77214657E8,9.17217751E8,2.01170167E8,68815.0,10.0,640.0,640.0,640.0,640.0,640.0,640.0,640.0,640.0,640.0,640.0,7550545.0,978560.0,3.162557569E9,12.0,11.0,10.0,13.0,13.0,13.0,12.0,12.0,14.0,12.0,4839.0,4981.0,9123.0,5855.0,5645.0,4986.0,4838.0,8574.0,5565.0,5194.0,4839000.0,4981000.0,9123000.0,5855000.0,5645000.0,4986000.0,4838000.0,8574000.0,5565000.0,5194000.0,55420.0,57.46353749370745,4200.0,4342.0,8484.0,5216.0,5006.0,4347.0,4199.0,7935.0,4926.0,4555.0,9.1651746E8,2.82143085E8,2.310769262E9,1469.0,2.403381308E9,42972.0,1.0331391E7,3072.0,2.437724907E9,2336.0,5.618544835E9,1262.0,8.45882418E8,4.10899267E8
Min,5025508.0,706.2668382686186,850.1860829616376,4406.558168101137,705.1040829616376,515.5570674683795,666.0750375321486,876.6740829616375,4015.013168101138,734.1240829616376,582.0000440251977,1.0,1.00075339E8,1.00000982E8,33570.0,103.0,1.0,640.0,639.0,639.0,639.0,639.0,639.0,640.0,639.0,639.0,639.0,7550545.0,978560.0,3.162557569E9,4.0,5.0,4.0,5.0,4.0,5.0,4.0,3.0,5.0,5.0,1334.0,1477.0,4985.0,1334.0,1146.0,1295.0,1504.0,4592.0,1363.0,1214.0,1334000.0,1477000.0,4985000.0,1334000.0,1146000.0,1295000.0,1504000.0,4592000.0,1363000.0,1214000.0,55420.0,0.035271273414380175,695.0,838.0,4346.0,695.0,507.0,656.0,865.0,3953.0,724.0,575.0,2369471.0,1543.0,61944.0,82.0,85978.0,102.0,531.0,77.0,31623.0,98.0,5366.0,64.0,2381435.0,1467.0
Avg,5025508.0,2023.2768742104436,2322.5259161783583,5761.945468106854,2170.7252841369373,1720.9151102550375,2046.9920769984496,2311.8940892010464,5666.466413729489,2223.4103122083316,1679.6743322245334,661.4386238914972,1.9606659019069767E8,1.992256069986619E8,1004267.3511136783,6472.636363636364,9.935051336493993,640.0,639.9833887043189,639.986531986532,639.9901639344263,639.9867109634552,639.996699669967,640.0,639.9843260188088,639.9858657243816,639.9896907216495,7550545.0,978560.0,3.162557569E9,7.756013745704467,7.574750830564784,6.2727272727272725,8.085245901639345,8.132890365448505,7.986798679867987,7.627831715210356,6.379310344827586,8.20494699646643,8.061855670103093,2634.085910652921,2927.182724252492,6322.649831649832,2782.2524590163935,2338.4551495016613,2655.4191419141916,2914.883495145631,6218.316614420062,2833.964664310954,2296.5876288659792,2634085.910652921,2927182.7242524917,6322649.8316498315,2782252.4590163934,2338455.1495016613,2655419.141914191,2914883.495145631,6218316.614420063,2833964.664310954,2296587.6288659796,55420.0,16.29843671950537,1995.085910652921,2288.1993355481727,5683.6632996633,2143.2622950819673,1699.4684385382059,2016.4224422442244,2275.883495145631,5579.332288401254,2194.9787985865723,1657.5979381443299,5.838636625104684E7,52673.51772325909,9.252139881633526E7,313.5286195286195,9.188022225210266E7,393.60983606557375,6575.5974858902,293.1461038961039,6.728730536612365E7,333.0952380952381,2.3396249299812266E8,235.96114864864865,5.690389886655541E7,72580.76215653692
variance,0.0,659163.2055797384,594449.2325377557,679106.9387096534,1510118.4896566763,1408443.1848315697,650287.9762479789,601788.0686417635,651709.3902558915,1386430.128328688,1199079.790994955,9.018430414832133E10,1.165353717799494E16,1.1500963913739874E16,4.248144122543952E13,3.886661336859504E8,0.4096323444447853,0.0,0.01633536053685933,0.013286626081238904,0.009739317387799014,0.01311243805256007,0.003289437854676536,0.0,0.015428307504839716,0.013934497871118362,0.010202997130407116,0.0,0.0,0.0,2.040127065103152,1.7062063332634279,1.5922865013774101,2.11076592313894,2.181675698943719,2.3298587284470984,1.7417496674731114,1.5833963895794922,2.03573524454045,1.7487511956637285,642917.535574686,579670.7539872634,661488.5238467728,1484497.9920021489,1382489.3177558735,628326.1378514091,581706.5042259715,635473.7963070327,1361561.461648917,1175482.2079569208,6.429175355746859E11,5.796707539872628E11,6.614885238467733E11,1.4844979920021487E12,1.3824893177558743E12,6.283261378514088E11,5.817065042259712E11,6.35473796307034E11,1.3615614616489155E12,1.1754822079569211E12,0.0,59.33628955587738,642917.535574686,579662.7642520497,661487.2064982028,1484523.9312012903,1382488.5612962318,628322.9370541016,581706.5042259715,635486.1779856717,1361560.6285257642,1175502.7902362978,8.232577649560888E15,6.340079833959747E12,1.0356153842257632E17,22388.528642202044,1.09714996345818128E17,3001214.214985219,2.7503142376143078E10,63671.559822482624,6.1725465197124008E16,32668.773242630396,7.9601233114327258E17,22812.294098680657,8.220012213352761E15,1.094742079466696E13
Quantil 0,,,,,,,,,,,,,,,,,,,,,,,,,,,,,,,,,,,,,,,,,,,,,,,,,,,,,,,,,,,,,,,,,,,,,,,,,,,,,,,,,,,,,,
Quantil 1,,,,,,,,,,,,,,,,,,,,,,,,,,,,,,,,,,,,,,,,,,,,,,,,,,,,,,,,,,,,,,,,,,,,,,,,,,,,,,,,,,,,,,
Quantil 2,,,,,,,,,,,,,,,,,,,,,,,,,,,,,,,,,,,,,,,,,,,,,,,,,,,,,,,,,,,,,,,,,,,,,,,,,,,,,,,,,,,,,,
Quantil 3,,,,,,,,,,,,,,,,,,,,,,,,,,,,,,,,,,,,,,,,,,,,,,,,,,,,,,,,,,,,,,,,,,,,,,,,,,,,,,,,,,,,,,
Quantil 4,,,,,,,,,,,,,,,,,,,,,,,,,,,,,,,,,,,,,,,,,,,,,,,,,,,,,,,,,,,,,,,,,,,,,,,,,,,,,,,,,,,,,,
Quantil 5,,,,,,,,,,,,,,,,,,,,,,,,,,,,,,,,,,,,,,,,,,,,,,,,,,,,,,,,,,,,,,,,,,,,,,,,,,,,,,,,,,,,,,
Quantil 6,,,,,,,,,,,,,,,,,,,,,,,,,,,,,,,,,,,,,,,,,,,,,,,,,,,,,,,,,,,,,,,,,,,,,,,,,,,,,,,,,,,,,,
Quantil 7,,,,,,,,,,,,,,,,,,,,,,,,,,,,,,,,,,,,,,,,,,,,,,,,,,,,,,,,,,,,,,,,,,,,,,,,,,,,,,,,,,,,,,
Quantil 8,,,,,,,,,,,,,,,,,,,,,,,,,,,,,,,,,,,,,,,,,,,,,,,,,,,,,,,,,,,,,,,,,,,,,,,,,,,,,,,,,,,,,,
Quantil 9,,,,,,,,,,,,,,,,,,,,,,,,,,,,,,,,,,,,,,,,,,,,,,,,,,,,,,,,,,,,,,,,,,,,,,,,,,,,,,,,,,,,,,
Quantil 10,,,,,,,,,,,,,,,,,,,,,,,,,,,,,,,,,,,,,,,,,,,,,,,,,,,,,,,,,,,,,,,,,,,,,,,,,,,,,,,,,,,,,,
Quantil 11,,,,,,,,,,,,,,,,,,,,,,,,,,,,,,,,,,,,,,,,,,,,,,,,,,,,,,,,,,,,,,,,,,,,,,,,,,,,,,,,,,,,,,
Quantil 12,,,,,,,,,,,,,,,,,,,,,,,,,,,,,,,,,,,,,,,,,,,,,,,,,,,,,,,,,,,,,,,,,,,,,,,,,,,,,,,,,,,,,,
Quantil 13,,,,,,,,,,,,,,,,,,,,,,,,,,,,,,,,,,,,,,,,,,,,,,,,,,,,,,,,,,,,,,,,,,,,,,,,,,,,,,,,,,,,,,
Quantil 14,,,,,,,,,,,,,,,,,,,,,,,,,,,,,,,,,,,,,,,,,,,,,,,,,,,,,,,,,,,,,,,,,,,,,,,,,,,,,,,,,,,,,,
Quantil 15,,,,,,,,,,,,,,,,,,,,,,,,,,,,,,,,,,,,,,,,,,,,,,,,,,,,,,,,,,,,,,,,,,,,,,,,,,,,,,,,,,,,,,
Quantil 16,,,,,,,,,,,,,,,,,,,,,,,,,,,,,,,,,,,,,,,,,,,,,,,,,,,,,,,,,,,,,,,,,,,,,,,,,,,,,,,,,,,,,,
Quantil 17,,,,,,,,,,,,,,,,,,,,,,,,,,,,,,,,,,,,,,,,,,,,,,,,,,,,,,,,,,,,,,,,,,,,,,,,,,,,,,,,,,,,,,
Quantil 18,,,,,,,,,,,,,,,,,,,,,,,,,,,,,,,,,,,,,,,,,,,,,,,,,,,,,,,,,,,,,,,,,,,,,,,,,,,,,,,,,,,,,,
Quantil 19,,,,,,,,,,,,,,,,,,,,,,,,,,,,,,,,,,,,,,,,,,,,,,,,,,,,,,,,,,,,,,,,,,,,,,,,,,,,,,,,,,,,,,
