ID,CircleDistributionStrategyTIME,DWR:FRG:IDF,DWR:FRG:MICF,DWR:FRG:MIPF,DWR:FRG:NCF,DWR:FRG:NPF,DWR:SRG:IDF,DWR:SRG:MICF,DWR:SRG:MIPF,DWR:SRG:NCF,DWR:SRG:NPF,DefaultEnjoyingStrategyLEAVE_TIME,DefaultReconstructionStrategyABORTED_TIME,DefaultReconstructionStrategyFOUND_POINT_ABORTED_TIME,DefaultReconstructionStrategyFOUND_POINT_TIME,DefaultReconstructionStrategyPOINTS_FOUND,ESTER:FRG:IDF,ESTER:FRG:MICF,ESTER:FRG:MIPF,ESTER:FRG:NCF,ESTER:FRG:NPF,ESTER:SRG:IDF,ESTER:SRG:MICF,ESTER:SRG:MIPF,ESTER:SRG:NCF,ESTER:SRG:NPF,GraphClusteringAlgorithmCREATE_LINKAGES_TIME,GraphClusteringAlgorithmCREATE_WEIGHTED_CLUSTER_TIME,GraphClusteringAlgorithmWEIGHTED_CLUSTERING_TIME,PVISR:FRG:IDF,PVISR:FRG:MICF,PVISR:FRG:MIPF,PVISR:FRG:NCF,PVISR:FRG:NPF,PVISR:SRG:IDF,PVISR:SRG:MICF,PVISR:SRG:MIPF,PVISR:SRG:NCF,PVISR:SRG:NPF,SSTER:FRG:IDF,SSTER:FRG:MICF,SSTER:FRG:MIPF,SSTER:FRG:NCF,SSTER:FRG:NPF,SSTER:SRG:IDF,SSTER:SRG:MICF,SSTER:SRG:MIPF,SSTER:SRG:NCF,SSTER:SRG:NPF,STIR:FRG:IDF,STIR:FRG:MICF,STIR:FRG:MIPF,STIR:FRG:NCF,STIR:FRG:NPF,STIR:SRG:IDF,STIR:SRG:MICF,STIR:SRG:MIPF,STIR:SRG:NCF,STIR:SRG:NPF,TRAJECTORY_AVG,TRAJECTORY_MAX,TRAJECTORY_MIN,WSTER:FRG:IDF,WSTER:FRG:MICF,WSTER:FRG:MIPF,WSTER:FRG:NCF,WSTER:FRG:NPF,WSTER:SRG:IDF,WSTER:SRG:MICF,WSTER:SRG:MIPF,WSTER:SRG:NCF,WSTER:SRG:NPF,fastestRouteRoutingStrategyCALCULATED_TIME,fastestRouteRoutingStrategyFROM_CACHE_TIME,intrestDistanceFactorGoalStrategyFOUND_GOAL_TIME,intrestDistanceFactorGoalStrategyNO_INTEREST_TIME,mostInterestingClusterFirstGoalStrategyFOUND_GOAL_TIME,mostInterestingClusterFirstGoalStrategyNO_INTEREST_TIME,mostInterestingPlacesFirstGoalStrategyFOUND_GOAL_TIME,mostInterestingPlacesFirstGoalStrategyNO_INTEREST_TIME,nearestClusterFirstGoalStrategyFOUND_GOAL_TIME,nearestClusterFirstGoalStrategyNO_INTEREST_TIME,nearestPlacesFirstGoalStrategyFOUND_GOAL_TIME,nearestPlacesFirstGoalStrategyNO_INTEREST_TIME,shortestRouteRoutingStrategyCALCULATED_TIME,shortestRouteRoutingStrategyFROM_CACHE_TIME
Count,1.0,309.0,316.0,300.0,296.0,317.0,310.0,300.0,308.0,290.0,318.0,2066328.0,5360.0,15428.0,150628.0,166056.0,309.0,316.0,300.0,296.0,317.0,310.0,300.0,308.0,290.0,318.0,1.0,1.0,1.0,309.0,316.0,300.0,296.0,317.0,310.0,300.0,308.0,290.0,318.0,309.0,316.0,300.0,296.0,317.0,310.0,300.0,308.0,290.0,318.0,309.0,316.0,300.0,296.0,317.0,310.0,300.0,308.0,290.0,318.0,3064.0,3064.0,3064.0,309.0,316.0,300.0,296.0,317.0,310.0,300.0,308.0,290.0,318.0,6675.0,140398.0,5125.0,619.0,4782.0,616.0,4021.0,608.0,5081.0,586.0,5428.0,635.0,6508.0,137781.0
Max,9068225.0,4372.367727806519,4476.322727806519,8186.529138281412,4690.228912829343,4878.806111039858,3983.0403288963944,4328.96272780652,8055.429138281412,4475.300912829344,4605.800111039858,3.49860864E8,1.772802188E9,1.702806387E9,2.19319012E8,10.0,1671.0,1738.0,1785.0,1646.0,1683.0,1739.0,1719.0,1681.0,1755.0,1654.0,7190640.0,1146446.0,3.651506511E9,13.0,13.0,11.0,13.0,16.0,14.0,13.0,12.0,15.0,13.0,7623.0,6073.0,14733.0,7622.0,7448.0,6207.0,6570.0,16457.0,6939.0,11414.0,7623000.0,6073000.0,1.4733E7,7622000.0,7448000.0,6207000.0,6570000.0,1.6457E7,6939000.0,1.1414E7,0.037138088978546986,0.11007702241470542,0.001740084953167552,6970.0,4592.0,14398.0,6567.0,6568.0,5653.0,6070.0,16124.0,6368.0,10898.0,1.429332879E9,3.47926925E8,5.368428353E9,1031.0,4.202402131E9,862.0,227599.0,3656.0,4.139133974E9,731.0,9.354811849E9,1542.0,1.406228972E9,3.89462172E8
Min,9068225.0,720.5143384992872,725.9020829616376,4406.558168101138,850.1860829616376,522.3437160802384,819.712229910367,850.1860829616376,4266.280168101138,766.4956600007058,522.3437160802384,1.0,1.0000024E8,1.00000337E8,46499.0,1.0,304.0,303.0,309.0,309.0,303.0,314.0,304.0,317.0,316.0,321.0,7190640.0,1146446.0,3.651506511E9,4.0,5.0,4.0,5.0,5.0,5.0,4.0,4.0,6.0,5.0,1048.0,1489.0,3976.0,1209.0,994.0,1313.0,1318.0,3665.0,1161.0,897.0,1048000.0,1489000.0,3976000.0,1209000.0,994000.0,1313000.0,1318000.0,3665000.0,1161000.0,897000.0,0.007109366166637968,0.0215805721482718,4.503261379062375E-6,660.0,916.0,3550.0,682.0,507.0,828.0,909.0,2808.0,662.0,510.0,2479475.0,1563.0,64779.0,103.0,96526.0,97.0,514.0,30.0,34880.0,129.0,2336.0,54.0,2398890.0,1690.0
Avg,9068225.0,1858.6687350664622,2120.6063461124522,6066.242691073465,1678.284700404424,1229.1786743596585,1892.5125005200407,2133.9740518016333,5835.129391463521,1653.2213156086161,1184.187817874578,946.8146814058562,2.412999671727612E8,2.3363320904543686E8,2754381.483309876,9.471124199065375,652.5275080906149,665.8924050632911,687.5566666666666,701.6891891891892,658.2365930599369,653.6806451612903,677.6533333333333,698.1623376623377,686.1517241379311,675.2106918238994,7190640.0,1146446.0,3.651506511E9,8.288025889967637,7.734177215189874,6.676666666666667,8.712837837837839,8.46372239747634,8.270967741935484,7.793333333333333,6.5519480519480515,8.627586206896552,8.632075471698114,2559.873786407767,2816.3069620253164,6896.1466666666665,2435.6452702702704,1929.9179810725552,2598.6677419354837,2904.75,6903.025974025974,2405.189655172414,1912.7861635220127,2559873.786407767,2816306.9620253164,6896146.666666667,2435645.2702702703,1929917.9810725553,2598667.7419354836,2904750.0,6903025.974025974,2405189.6551724137,1912786.1635220125,0.0209324472746252,0.06645475003431775,2.9432715985618123E-4,1908.3462783171522,2151.4145569620255,6209.59,1734.956081081081,1272.6813880126183,1945.9870967741936,2228.096666666667,6205.863636363636,1720.0379310344827,1238.5754716981132,8.208287092928839E7,24748.186298950128,6.044443611707317E7,291.39095315024235,6.005042513069845E7,270.35714285714283,4157.046505844317,286.7483552631579,6.016129731352096E7,292.8532423208191,1.1063041034100959E8,199.8740157480315,8.396046177612169E7,27869.986747084142
variance,0.0,225787.5895582368,166697.99866636295,556376.6085229494,558185.6673317245,527365.2777431683,280799.25906253356,174807.71005797188,524247.3499065957,515927.631955685,389643.4900776772,2.0153785706927005E11,3.2653486800223236E16,2.9004180465399296E16,1.2937614405819636E14,3.3755572851179223,97101.53726919492,103040.98842332957,109263.67345555553,102144.41015339665,100790.96295116871,104476.53349635797,118344.77315555558,104922.25286726256,116058.80456599282,111187.65686681701,0.0,0.0,0.0,2.3539342905918486,2.0749078673289456,1.658788888888892,2.0628081628926145,2.30546626993999,2.2749635796045853,2.1639555555555536,1.7408078934052933,2.350963139120092,2.3772101578260454,592527.2559147896,551635.1557743151,2443248.3984888885,893151.4856533054,776670.3781309394,567391.1315400623,672397.7475,3016872.252572104,870650.8847205706,852998.1869783632,5.925272559147892E11,5.516351557743151E11,2.44324839848889E12,8.931514856533053E11,7.766703781309397E11,5.67391131540062E11,6.723977475E11,3.0168722525721045E12,8.706508847205707E11,8.52998186978363E11,1.9610412719118938E-5,1.2922777364653671E-4,3.169656823360145E-8,434834.679444078,416881.66675012006,2373113.368566667,753774.9000981554,703621.1129974425,471112.2256399582,552948.3939888887,2839680.9619244374,775037.0158026161,731554.7851845259,2.1535358640325224E16,3.5672603793032305E12,1.1241900978073432E17,13500.797074858878,1.16684546919800288E17,14725.219851576969,8.745726284265192E7,44770.32976703168,1.01011783161023424E17,9868.562079931044,6.0032877113495744E17,19471.004600409207,2.1382518969120992E16,5.71539749033163E12
Quantil 0,1.0,2.0,1.0,10.0,7.0,20.0,8.0,2.0,14.0,10.0,1.0,2066316.0,2526.0,7266.0,144891.0,2849.0,39.0,52.0,43.0,31.0,42.0,55.0,51.0,45.0,53.0,60.0,1.0,1.0,1.0,1.0,16.0,8.0,1.0,2.0,5.0,2.0,13.0,13.0,1.0,4.0,8.0,8.0,25.0,49.0,11.0,3.0,6.0,24.0,76.0,4.0,8.0,8.0,25.0,49.0,11.0,3.0,6.0,24.0,76.0,1.0,1.0,161.0,7.0,4.0,10.0,20.0,51.0,13.0,5.0,3.0,19.0,149.0,4670.0,140371.0,4884.0,27.0,4549.0,16.0,3706.0,246.0,4803.0,20.0,5297.0,254.0,4509.0,137760.0
Quantil 1,,8.0,0.0,3.0,53.0,40.0,2.0,2.0,0.0,52.0,65.0,0.0,1351.0,3870.0,1157.0,0.0,57.0,49.0,45.0,44.0,59.0,56.0,45.0,40.0,52.0,44.0,,,,0.0,0.0,0.0,0.0,25.0,0.0,0.0,0.0,0.0,0.0,22.0,14.0,13.0,61.0,89.0,17.0,8.0,24.0,40.0,141.0,22.0,14.0,13.0,61.0,89.0,17.0,8.0,24.0,40.0,141.0,1.0,0.0,699.0,25.0,11.0,21.0,68.0,138.0,12.0,15.0,18.0,68.0,127.0,532.0,3.0,70.0,79.0,54.0,85.0,222.0,227.0,63.0,42.0,12.0,170.0,475.0,3.0
Quantil 2,,10.0,5.0,8.0,56.0,193.0,11.0,2.0,11.0,59.0,175.0,2.0,710.0,2067.0,656.0,2289.0,39.0,42.0,39.0,33.0,39.0,42.0,37.0,38.0,30.0,35.0,,,,5.0,41.0,44.0,9.0,0.0,34.0,12.0,44.0,62.0,27.0,52.0,33.0,30.0,62.0,81.0,42.0,25.0,41.0,50.0,55.0,52.0,33.0,30.0,62.0,81.0,42.0,25.0,41.0,50.0,55.0,11.0,5.0,744.0,74.0,11.0,47.0,77.0,66.0,61.0,43.0,40.0,68.0,24.0,470.0,5.0,38.0,142.0,42.0,154.0,22.0,121.0,55.0,80.0,7.0,66.0,475.0,2.0
Quantil 3,,6.0,4.0,2.0,66.0,34.0,2.0,8.0,3.0,56.0,33.0,1.0,364.0,1060.0,658.0,0.0,34.0,33.0,37.0,27.0,34.0,32.0,31.0,24.0,20.0,30.0,,,,0.0,0.0,0.0,0.0,52.0,0.0,0.0,0.0,0.0,0.0,63.0,42.0,52.0,29.0,41.0,56.0,40.0,44.0,50.0,29.0,63.0,42.0,52.0,29.0,41.0,56.0,40.0,44.0,50.0,29.0,45.0,15.0,549.0,84.0,32.0,62.0,42.0,27.0,70.0,53.0,54.0,44.0,3.0,420.0,2.0,26.0,131.0,25.0,93.0,3.0,9.0,36.0,81.0,4.0,72.0,434.0,2.0
Quantil 4,,39.0,4.0,36.0,4.0,6.0,32.0,5.0,43.0,6.0,25.0,2.0,145.0,482.0,583.0,1869.0,25.0,24.0,21.0,24.0,19.0,16.0,22.0,27.0,16.0,22.0,,,,37.0,90.0,0.0,58.0,0.0,64.0,29.0,110.0,73.0,42.0,62.0,54.0,50.0,51.0,25.0,52.0,46.0,52.0,38.0,2.0,62.0,54.0,50.0,51.0,25.0,52.0,46.0,52.0,38.0,2.0,140.0,38.0,375.0,54.0,43.0,37.0,32.0,10.0,60.0,63.0,48.0,34.0,2.0,255.0,2.0,22.0,87.0,20.0,72.0,30.0,1.0,23.0,69.0,0.0,41.0,270.0,0.0
Quantil 5,,94.0,17.0,4.0,54.0,1.0,105.0,13.0,2.0,6.0,5.0,2.0,90.0,211.0,593.0,0.0,23.0,13.0,21.0,15.0,24.0,25.0,20.0,25.0,24.0,29.0,,,,0.0,0.0,84.0,0.0,100.0,0.0,0.0,0.0,0.0,0.0,39.0,31.0,38.0,29.0,11.0,31.0,46.0,50.0,27.0,4.0,39.0,31.0,38.0,29.0,11.0,31.0,46.0,50.0,27.0,4.0,203.0,87.0,225.0,27.0,57.0,34.0,24.0,5.0,30.0,41.0,57.0,15.0,4.0,164.0,2.0,22.0,50.0,17.0,44.0,31.0,1.0,15.0,89.0,5.0,14.0,168.0,1.0
Quantil 6,,67.0,116.0,2.0,26.0,3.0,65.0,105.0,90.0,65.0,0.0,0.0,23.0,99.0,602.0,1660.0,12.0,10.0,14.0,20.0,16.0,13.0,16.0,20.0,12.0,11.0,,,,53.0,0.0,0.0,0.0,0.0,64.0,96.0,0.0,65.0,0.0,30.0,39.0,39.0,12.0,2.0,27.0,42.0,31.0,16.0,4.0,30.0,39.0,39.0,12.0,2.0,27.0,42.0,31.0,16.0,4.0,347.0,184.0,161.0,14.0,41.0,26.0,8.0,1.0,18.0,28.0,32.0,12.0,4.0,82.0,4.0,14.0,28.0,12.0,50.0,3.0,0.0,16.0,60.0,3.0,12.0,87.0,3.0
Quantil 7,,55.0,120.0,66.0,12.0,0.0,39.0,111.0,1.0,14.0,1.0,0.0,21.0,38.0,670.0,0.0,8.0,10.0,9.0,18.0,10.0,9.0,5.0,10.0,7.0,11.0,,,,0.0,80.0,0.0,65.0,60.0,0.0,0.0,77.0,0.0,93.0,13.0,35.0,19.0,6.0,0.0,27.0,35.0,17.0,12.0,4.0,13.0,35.0,19.0,6.0,0.0,27.0,35.0,17.0,12.0,4.0,395.0,313.0,71.0,10.0,29.0,23.0,6.0,1.0,14.0,17.0,19.0,6.0,2.0,36.0,3.0,16.0,18.0,10.0,21.0,0.0,0.0,13.0,45.0,13.0,3.0,33.0,1.0
Quantil 8,,6.0,7.0,12.0,2.0,0.0,18.0,6.0,9.0,4.0,0.0,1.0,11.0,35.0,732.0,1517.0,14.0,18.0,10.0,14.0,13.0,6.0,8.0,8.0,15.0,13.0,,,,70.0,0.0,98.0,0.0,0.0,82.0,80.0,0.0,45.0,0.0,10.0,22.0,18.0,4.0,2.0,15.0,19.0,18.0,10.0,0.0,10.0,22.0,18.0,4.0,2.0,15.0,19.0,18.0,10.0,0.0,411.0,397.0,26.0,6.0,27.0,20.0,2.0,2.0,11.0,14.0,15.0,6.0,1.0,9.0,2.0,4.0,21.0,6.0,20.0,1.0,0.0,7.0,31.0,13.0,0.0,14.0,2.0
Quantil 9,,2.0,17.0,88.0,0.0,1.0,1.0,16.0,70.0,1.0,0.0,0.0,10.0,22.0,84.0,0.0,12.0,18.0,14.0,12.0,12.0,7.0,12.0,13.0,6.0,10.0,,,,0.0,60.0,0.0,79.0,54.0,0.0,0.0,39.0,0.0,62.0,4.0,14.0,16.0,5.0,3.0,9.0,14.0,8.0,6.0,1.0,4.0,14.0,16.0,5.0,3.0,9.0,14.0,8.0,6.0,1.0,400.0,463.0,22.0,5.0,16.0,7.0,3.0,3.0,5.0,5.0,9.0,3.0,1.0,1.0,0.0,7.0,18.0,4.0,9.0,0.0,2.0,12.0,17.0,10.0,0.0,11.0,1.0
Quantil 10,,1.0,8.0,4.0,0.0,0.0,0.0,9.0,7.0,0.0,0.0,0.0,21.0,53.0,0.0,0.0,10.0,5.0,6.0,9.0,8.0,8.0,3.0,9.0,12.0,4.0,,,,0.0,0.0,0.0,0.0,16.0,0.0,0.0,0.0,0.0,0.0,3.0,7.0,4.0,0.0,4.0,6.0,1.0,10.0,3.0,1.0,3.0,7.0,4.0,0.0,4.0,6.0,1.0,10.0,3.0,1.0,307.0,433.0,11.0,1.0,12.0,1.0,2.0,2.0,5.0,2.0,8.0,3.0,0.0,2.0,1.0,5.0,7.0,2.0,17.0,1.0,0.0,9.0,17.0,14.0,0.0,2.0,1.0
Quantil 11,,0.0,4.0,1.0,0.0,1.0,2.0,8.0,3.0,0.0,0.0,0.0,29.0,67.0,0.0,1381.0,1.0,10.0,9.0,9.0,6.0,11.0,6.0,7.0,12.0,0.0,,,,79.0,0.0,47.0,0.0,0.0,42.0,48.0,0.0,18.0,0.0,3.0,4.0,2.0,0.0,2.0,5.0,7.0,3.0,4.0,0.0,3.0,4.0,2.0,0.0,2.0,5.0,7.0,3.0,4.0,0.0,260.0,400.0,4.0,0.0,8.0,4.0,2.0,3.0,3.0,4.0,1.0,1.0,0.0,0.0,0.0,4.0,3.0,4.0,8.0,0.0,0.0,4.0,6.0,15.0,0.0,0.0,0.0
Quantil 12,,10.0,2.0,2.0,0.0,0.0,6.0,2.0,2.0,2.0,0.0,0.0,24.0,49.0,0.0,0.0,7.0,6.0,10.0,6.0,7.0,6.0,10.0,9.0,5.0,15.0,,,,0.0,17.0,0.0,53.0,6.0,0.0,0.0,17.0,0.0,54.0,3.0,2.0,3.0,6.0,1.0,6.0,3.0,0.0,1.0,0.0,3.0,2.0,3.0,6.0,1.0,6.0,3.0,0.0,1.0,0.0,202.0,322.0,4.0,1.0,8.0,3.0,2.0,0.0,3.0,1.0,0.0,3.0,0.0,1.0,1.0,3.0,4.0,7.0,9.0,1.0,0.0,4.0,8.0,12.0,0.0,1.0,2.0
Quantil 13,,0.0,2.0,1.0,0.0,0.0,2.0,0.0,0.0,0.0,0.0,0.0,6.0,28.0,0.0,1369.0,8.0,5.0,5.0,10.0,4.0,5.0,6.0,7.0,9.0,7.0,,,,43.0,0.0,0.0,0.0,0.0,13.0,19.0,0.0,11.0,0.0,0.0,2.0,4.0,2.0,2.0,2.0,3.0,0.0,2.0,0.0,0.0,2.0,4.0,2.0,2.0,2.0,3.0,0.0,2.0,0.0,137.0,207.0,4.0,0.0,5.0,2.0,4.0,1.0,1.0,3.0,0.0,2.0,0.0,2.0,0.0,3.0,2.0,9.0,6.0,0.0,0.0,5.0,6.0,3.0,0.0,2.0,0.0
Quantil 14,,1.0,1.0,48.0,0.0,5.0,0.0,1.0,45.0,0.0,1.0,0.0,8.0,15.0,0.0,0.0,5.0,9.0,4.0,7.0,5.0,7.0,5.0,7.0,2.0,5.0,,,,0.0,7.0,7.0,21.0,0.0,0.0,0.0,7.0,0.0,28.0,0.0,3.0,1.0,1.0,3.0,0.0,0.0,1.0,1.0,0.0,0.0,3.0,1.0,1.0,3.0,0.0,0.0,1.0,1.0,0.0,89.0,108.0,2.0,0.0,4.0,2.0,1.0,3.0,0.0,2.0,3.0,1.0,0.0,0.0,0.0,2.0,1.0,3.0,6.0,0.0,0.0,3.0,1.0,2.0,0.0,2.0,0.0
Quantil 15,,3.0,4.0,0.0,0.0,7.0,1.0,5.0,0.0,0.0,1.0,2.0,4.0,13.0,0.0,1210.0,2.0,7.0,2.0,4.0,8.0,3.0,12.0,7.0,5.0,4.0,,,,15.0,0.0,0.0,0.0,0.0,5.0,8.0,0.0,2.0,0.0,0.0,1.0,2.0,1.0,0.0,1.0,2.0,2.0,2.0,0.0,0.0,1.0,2.0,1.0,0.0,1.0,2.0,2.0,2.0,0.0,63.0,48.0,2.0,0.0,0.0,0.0,1.0,2.0,0.0,1.0,0.0,1.0,0.0,1.0,0.0,1.0,0.0,5.0,3.0,0.0,0.0,4.0,5.0,2.0,0.0,0.0,0.0
Quantil 16,,2.0,0.0,1.0,0.0,2.0,2.0,3.0,0.0,0.0,0.0,1.0,12.0,11.0,0.0,0.0,2.0,1.0,7.0,3.0,5.0,1.0,4.0,6.0,4.0,3.0,,,,0.0,0.0,0.0,0.0,0.0,0.0,0.0,0.0,0.0,0.0,0.0,0.0,0.0,0.0,1.0,0.0,1.0,0.0,2.0,0.0,0.0,0.0,0.0,0.0,1.0,0.0,1.0,0.0,2.0,0.0,27.0,25.0,1.0,0.0,0.0,0.0,0.0,0.0,1.0,0.0,0.0,2.0,0.0,1.0,0.0,1.0,0.0,3.0,1.0,0.0,0.0,2.0,2.0,3.0,0.0,3.0,0.0
Quantil 17,,2.0,3.0,10.0,2.0,2.0,5.0,1.0,6.0,3.0,9.0,0.0,2.0,18.0,1.0,1191.0,6.0,2.0,1.0,5.0,1.0,1.0,5.0,2.0,3.0,5.0,,,,5.0,4.0,10.0,8.0,0.0,0.0,4.0,0.0,0.0,9.0,0.0,0.0,0.0,0.0,0.0,2.0,3.0,0.0,1.0,0.0,0.0,0.0,0.0,0.0,0.0,2.0,3.0,0.0,1.0,0.0,13.0,11.0,1.0,0.0,0.0,0.0,0.0,1.0,1.0,1.0,0.0,1.0,0.0,12.0,0.0,1.0,0.0,1.0,1.0,0.0,0.0,1.0,3.0,3.0,1.0,5.0,0.0
Quantil 18,,0.0,0.0,0.0,12.0,1.0,5.0,0.0,1.0,7.0,1.0,0.0,1.0,19.0,0.0,0.0,3.0,1.0,1.0,3.0,3.0,4.0,1.0,3.0,0.0,5.0,,,,0.0,0.0,0.0,0.0,1.0,0.0,0.0,0.0,0.0,0.0,0.0,2.0,0.0,0.0,0.0,0.0,0.0,0.0,0.0,0.0,0.0,2.0,0.0,0.0,0.0,0.0,0.0,0.0,0.0,0.0,9.0,3.0,0.0,0.0,3.0,0.0,0.0,0.0,1.0,0.0,0.0,0.0,0.0,13.0,0.0,1.0,0.0,7.0,0.0,0.0,0.0,4.0,2.0,7.0,1.0,12.0,0.0
Quantil 19,,1.0,1.0,2.0,2.0,1.0,3.0,1.0,1.0,5.0,1.0,1.0,2.0,5.0,1.0,150721.0,2.0,1.0,2.0,2.0,2.0,3.0,1.0,1.0,3.0,5.0,,,,1.0,1.0,2.0,2.0,1.0,1.0,2.0,1.0,1.0,2.0,1.0,3.0,1.0,2.0,1.0,1.0,2.0,1.0,1.0,1.0,1.0,3.0,1.0,2.0,1.0,1.0,2.0,1.0,1.0,1.0,3.0,3.0,2.0,1.0,5.0,1.0,2.0,1.0,1.0,2.0,1.0,1.0,1.0,4.0,2.0,1.0,1.0,2.0,1.0,1.0,1.0,2.0,2.0,3.0,1.0,5.0,3.0
