ID,CircleDistributionStrategyTIME,DWR:FRG:IDF,DWR:FRG:MICF,DWR:FRG:MIPF,DWR:FRG:NCF,DWR:FRG:NPF,DWR:SRG:IDF,DWR:SRG:MICF,DWR:SRG:MIPF,DWR:SRG:NCF,DWR:SRG:NPF,DefaultEnjoyingStrategyLEAVE_TIME,DefaultReconstructionStrategyABORTED_TIME,DefaultReconstructionStrategyFOUND_POINT_ABORTED_TIME,DefaultReconstructionStrategyFOUND_POINT_TIME,DefaultReconstructionStrategyNO_STATION,DefaultReconstructionStrategyPOINTS_FOUND,ESTER:FRG:IDF,ESTER:FRG:MICF,ESTER:FRG:MIPF,ESTER:FRG:NCF,ESTER:FRG:NPF,ESTER:SRG:IDF,ESTER:SRG:MICF,ESTER:SRG:MIPF,ESTER:SRG:NCF,ESTER:SRG:NPF,GraphClusteringAlgorithmCREATE_LINKAGES_TIME,GraphClusteringAlgorithmCREATE_WEIGHTED_CLUSTER_TIME,GraphClusteringAlgorithmWEIGHTED_CLUSTERING_TIME,PVISR:FRG:IDF,PVISR:FRG:MICF,PVISR:FRG:MIPF,PVISR:FRG:NCF,PVISR:FRG:NPF,PVISR:SRG:IDF,PVISR:SRG:MICF,PVISR:SRG:MIPF,PVISR:SRG:NCF,PVISR:SRG:NPF,SSTER:FRG:IDF,SSTER:FRG:MICF,SSTER:FRG:MIPF,SSTER:FRG:NCF,SSTER:FRG:NPF,SSTER:SRG:IDF,SSTER:SRG:MICF,SSTER:SRG:MIPF,SSTER:SRG:NCF,SSTER:SRG:NPF,STIR:FRG:IDF,STIR:FRG:MICF,STIR:FRG:MIPF,STIR:FRG:NCF,STIR:FRG:NPF,STIR:SRG:IDF,STIR:SRG:MICF,STIR:SRG:MIPF,STIR:SRG:NCF,STIR:SRG:NPF,SimulationTime,TRAJECTORY,WSTER:FRG:IDF,WSTER:FRG:MICF,WSTER:FRG:MIPF,WSTER:FRG:NCF,WSTER:FRG:NPF,WSTER:SRG:IDF,WSTER:SRG:MICF,WSTER:SRG:MIPF,WSTER:SRG:NCF,WSTER:SRG:NPF,fastestRouteRoutingStrategyCALCULATED_TIME,fastestRouteRoutingStrategyFROM_CACHE_TIME,intrestDistanceFactorGoalStrategyFOUND_GOAL_TIME,intrestDistanceFactorGoalStrategyNO_INTEREST_TIME,mostInterestingClusterFirstGoalStrategyFOUND_GOAL_TIME,mostInterestingClusterFirstGoalStrategyNO_INTEREST_TIME,mostInterestingPlacesFirstGoalStrategyFOUND_GOAL_TIME,mostInterestingPlacesFirstGoalStrategyNO_INTEREST_TIME,nearestClusterFirstGoalStrategyFOUND_GOAL_TIME,nearestClusterFirstGoalStrategyNO_INTEREST_TIME,nearestPlacesFirstGoalStrategyFOUND_GOAL_TIME,nearestPlacesFirstGoalStrategyNO_INTEREST_TIME,shortestRouteRoutingStrategyCALCULATED_TIME,shortestRouteRoutingStrategyFROM_CACHE_TIME
Count,1.0,106.0,88.0,109.0,96.0,95.0,129.0,103.0,96.0,91.0,87.0,639000.0,30.0,354.0,52777.0,0.0,53131.0,106.0,88.0,109.0,96.0,95.0,129.0,103.0,96.0,91.0,87.0,1.0,1.0,1.0,106.0,88.0,109.0,96.0,95.0,129.0,103.0,96.0,91.0,87.0,106.0,88.0,109.0,96.0,95.0,129.0,103.0,96.0,91.0,87.0,106.0,88.0,109.0,96.0,95.0,129.0,103.0,96.0,91.0,87.0,1.0,53125.0,106.0,88.0,109.0,96.0,95.0,129.0,103.0,96.0,91.0,87.0,3857.0,41711.0,1884.0,235.0,1473.0,191.0,1307.0,205.0,1600.0,187.0,1495.0,182.0,3514.0,45742.0
Max,5463566.0,3727.529328896395,4115.094127559325,8159.835857057375,4787.364288189821,4878.806111039858,3719.2273288963943,3763.8663288963944,7627.404857057375,4483.618124217671,4828.8092750120095,6.4441716E7,6.61216926E8,7.24429098E8,1.09061697E8,4.9E-324,10.0,640.0,640.0,640.0,640.0,640.0,640.0,640.0,640.0,640.0,640.0,6818697.0,1023112.0,3.205687952E9,12.0,12.0,10.0,12.0,12.0,14.0,11.0,10.0,13.0,12.0,4313.0,4694.0,8687.0,5373.0,5463.0,4297.0,4344.0,8153.0,5069.0,5408.0,4313000.0,4694000.0,8687000.0,5373000.0,5463000.0,4297000.0,4344000.0,8153000.0,5069000.0,5408000.0,17284.0,49.59787009326225,3674.0,4055.0,8048.0,4734.0,4824.0,3658.0,3705.0,7514.0,4430.0,4769.0,8.11997809E8,2.04642648E8,1.900379983E9,35760.0,1.91104529E9,636.0,482106.0,3213.0,1.789743177E9,490.0,3.764970713E9,1803.0,8.50123661E8,1.95425298E8
Min,5463566.0,848.533229910367,898.491022590494,4509.225341268983,552.6746276604258,522.3437160802384,785.677031084924,1376.7143288963946,4035.009168101137,922.0058292318279,538.4189866382033,1.0,1.02013141E8,1.00002228E8,36409.0,1.7976931348623157E308,1.0,640.0,639.0,639.0,639.0,640.0,639.0,639.0,640.0,639.0,639.0,6818697.0,1023112.0,3.205687952E9,5.0,5.0,4.0,5.0,5.0,5.0,5.0,3.0,6.0,4.0,1473.0,1521.0,5086.0,1184.0,1156.0,1412.0,1993.0,4608.0,1543.0,1169.0,1473000.0,1521000.0,5086000.0,1184000.0,1156000.0,1412000.0,1993000.0,4608000.0,1543000.0,1169000.0,17284.0,0.04846704578428687,834.0,882.0,4447.0,545.0,517.0,773.0,1354.0,3969.0,904.0,530.0,2775153.0,1656.0,61039.0,117.0,84310.0,108.0,576.0,96.0,33401.0,117.0,4810.0,47.0,2789402.0,1528.0
Avg,5463566.0,1812.5637379423106,2138.5673264105385,5975.81884770541,1582.0607841130807,1238.865514138238,1806.8421131603973,2152.4715353645947,5666.01095937593,1689.8193339862044,1195.2137367527696,237.80841940532082,1.8557409656666666E8,1.8291275528248587E8,1181224.6437084335,NaN,9.96600854491728,640.0,639.9772727272727,639.9724770642201,639.9895833333334,640.0,639.9922480620155,639.9805825242719,640.0,639.989010989011,639.9770114942529,6818697.0,1023112.0,3.205687952E9,7.886792452830188,7.886363636363637,6.532110091743119,8.53125,8.189473684210526,8.124031007751938,7.563106796116505,6.197916666666667,8.582417582417582,8.241379310344827,2429.198113207547,2746.284090909091,6535.880733944954,2200.0625,1862.2315789473685,2422.860465116279,2759.747572815534,6219.135416666667,2306.7912087912086,1818.8735632183907,2429198.113207547,2746284.090909091,6535880.733944954,2200062.5,1862231.5789473683,2422860.465116279,2759747.572815534,6219135.416666667,2306791.208791209,1818873.5632183908,17284.0,16.64764703208963,1790.198113207547,2107.306818181818,5896.908256880734,1561.0729166666667,1223.2315789473685,1783.8682170542636,2120.766990291262,5580.135416666667,1667.8021978021977,1179.896551724138,4.5253890536427274E7,10875.503728033373,6.3782356043524414E7,369.8,6.080939806313646E7,210.77486910994764,6692.508033664882,361.25853658536585,5.2503175685E7,210.41711229946523,9.486194058595318E7,218.8186813186813,4.607546681474104E7,17866.93002055004
variance,0.0,237594.63818461564,287341.78818964766,553923.3058078494,411106.8975278604,614735.0540327901,234573.22349674025,153728.44055653663,517436.3637146258,720575.3624263121,525343.89072545,9.680234099533056E9,1.53203787435519E16,1.1162385173781476E16,4.616588119810166E13,NaN,0.21532836634211525,0.0,0.022210743801652867,0.02676542378587663,0.01030815972222221,0.0,0.0076918454419806544,0.01904043736450185,0.0,0.010868252626494377,0.022460034350640767,0.0,0.0,0.0,2.119259522961907,2.28254132231405,1.625115730999075,1.9781901041666667,2.111468144044326,2.403220960278825,1.2945612216042983,1.700412326388889,2.023427122328221,1.930241775663892,231151.53622285495,279656.11247417337,540187.0408214794,403108.1627604167,602571.6937396121,227191.62394086897,148063.35375624473,504977.67957899347,705790.956406231,514010.7541286829,2.311515362228551E11,2.796561124741739E11,5.401870408214794E11,4.031081627604167E11,6.025716937396125E11,2.2719162394086884E11,1.4806335375624472E11,5.049776795789929E11,7.057909564062311E11,5.140107541286828E11,0.0,61.927964045214075,231151.53622285495,279640.8490444217,540137.624610723,403101.1925998263,602571.6937396121,227190.64154798392,148086.17871618437,504977.67957899347,705785.2795556091,514001.2651605232,5.412392699323404E15,1.142537726696308E12,4.9251210447863184E16,5364160.653617021,5.000153327035268E16,5894.666593569255,3.7094239446722746E8,295839.7721832242,3.66150246422118E16,3673.6228087734853,2.68336232561962368E17,26224.752837821503,5.727685849153817E15,1.6894006027755564E12
Quantil 0,,,,,,,,,,,,,,,,,,,,,,,,,,,,,,,,,,,,,,,,,,,,,,,,,,,,,,,,,,,,,,,,,,,,,,,,,,,,,,,,,,,,,,
Quantil 1,,,,,,,,,,,,,,,,,,,,,,,,,,,,,,,,,,,,,,,,,,,,,,,,,,,,,,,,,,,,,,,,,,,,,,,,,,,,,,,,,,,,,,
Quantil 2,,,,,,,,,,,,,,,,,,,,,,,,,,,,,,,,,,,,,,,,,,,,,,,,,,,,,,,,,,,,,,,,,,,,,,,,,,,,,,,,,,,,,,
Quantil 3,,,,,,,,,,,,,,,,,,,,,,,,,,,,,,,,,,,,,,,,,,,,,,,,,,,,,,,,,,,,,,,,,,,,,,,,,,,,,,,,,,,,,,
Quantil 4,,,,,,,,,,,,,,,,,,,,,,,,,,,,,,,,,,,,,,,,,,,,,,,,,,,,,,,,,,,,,,,,,,,,,,,,,,,,,,,,,,,,,,
Quantil 5,,,,,,,,,,,,,,,,,,,,,,,,,,,,,,,,,,,,,,,,,,,,,,,,,,,,,,,,,,,,,,,,,,,,,,,,,,,,,,,,,,,,,,
Quantil 6,,,,,,,,,,,,,,,,,,,,,,,,,,,,,,,,,,,,,,,,,,,,,,,,,,,,,,,,,,,,,,,,,,,,,,,,,,,,,,,,,,,,,,
Quantil 7,,,,,,,,,,,,,,,,,,,,,,,,,,,,,,,,,,,,,,,,,,,,,,,,,,,,,,,,,,,,,,,,,,,,,,,,,,,,,,,,,,,,,,
Quantil 8,,,,,,,,,,,,,,,,,,,,,,,,,,,,,,,,,,,,,,,,,,,,,,,,,,,,,,,,,,,,,,,,,,,,,,,,,,,,,,,,,,,,,,
Quantil 9,,,,,,,,,,,,,,,,,,,,,,,,,,,,,,,,,,,,,,,,,,,,,,,,,,,,,,,,,,,,,,,,,,,,,,,,,,,,,,,,,,,,,,
Quantil 10,,,,,,,,,,,,,,,,,,,,,,,,,,,,,,,,,,,,,,,,,,,,,,,,,,,,,,,,,,,,,,,,,,,,,,,,,,,,,,,,,,,,,,
Quantil 11,,,,,,,,,,,,,,,,,,,,,,,,,,,,,,,,,,,,,,,,,,,,,,,,,,,,,,,,,,,,,,,,,,,,,,,,,,,,,,,,,,,,,,
Quantil 12,,,,,,,,,,,,,,,,,,,,,,,,,,,,,,,,,,,,,,,,,,,,,,,,,,,,,,,,,,,,,,,,,,,,,,,,,,,,,,,,,,,,,,
Quantil 13,,,,,,,,,,,,,,,,,,,,,,,,,,,,,,,,,,,,,,,,,,,,,,,,,,,,,,,,,,,,,,,,,,,,,,,,,,,,,,,,,,,,,,
Quantil 14,,,,,,,,,,,,,,,,,,,,,,,,,,,,,,,,,,,,,,,,,,,,,,,,,,,,,,,,,,,,,,,,,,,,,,,,,,,,,,,,,,,,,,
Quantil 15,,,,,,,,,,,,,,,,,,,,,,,,,,,,,,,,,,,,,,,,,,,,,,,,,,,,,,,,,,,,,,,,,,,,,,,,,,,,,,,,,,,,,,
Quantil 16,,,,,,,,,,,,,,,,,,,,,,,,,,,,,,,,,,,,,,,,,,,,,,,,,,,,,,,,,,,,,,,,,,,,,,,,,,,,,,,,,,,,,,
Quantil 17,,,,,,,,,,,,,,,,,,,,,,,,,,,,,,,,,,,,,,,,,,,,,,,,,,,,,,,,,,,,,,,,,,,,,,,,,,,,,,,,,,,,,,
Quantil 18,,,,,,,,,,,,,,,,,,,,,,,,,,,,,,,,,,,,,,,,,,,,,,,,,,,,,,,,,,,,,,,,,,,,,,,,,,,,,,,,,,,,,,
Quantil 19,,,,,,,,,,,,,,,,,,,,,,,,,,,,,,,,,,,,,,,,,,,,,,,,,,,,,,,,,,,,,,,,,,,,,,,,,,,,,,,,,,,,,,
