ID,CircleDistributionStrategyTIME,DWR:FRG:IDF,DWR:FRG:MICF,DWR:FRG:MIPF,DWR:FRG:NCF,DWR:FRG:NPF,DWR:SRG:IDF,DWR:SRG:MICF,DWR:SRG:MIPF,DWR:SRG:NCF,DWR:SRG:NPF,DefaultEnjoyingStrategyLEAVE_TIME,DefaultReconstructionStrategyABORTED_TIME,DefaultReconstructionStrategyFOUND_POINT_ABORTED_TIME,DefaultReconstructionStrategyFOUND_POINT_TIME,DefaultReconstructionStrategyNO_STATION,DefaultReconstructionStrategyPOINTS_FOUND,ESTER:FRG:IDF,ESTER:FRG:MICF,ESTER:FRG:MIPF,ESTER:FRG:NCF,ESTER:FRG:NPF,ESTER:SRG:IDF,ESTER:SRG:MICF,ESTER:SRG:MIPF,ESTER:SRG:NCF,ESTER:SRG:NPF,GraphClusteringAlgorithmCREATE_LINKAGES_TIME,GraphClusteringAlgorithmCREATE_WEIGHTED_CLUSTER_TIME,GraphClusteringAlgorithmWEIGHTED_CLUSTERING_TIME,PVISR:FRG:IDF,PVISR:FRG:MICF,PVISR:FRG:MIPF,PVISR:FRG:NCF,PVISR:FRG:NPF,PVISR:SRG:IDF,PVISR:SRG:MICF,PVISR:SRG:MIPF,PVISR:SRG:NCF,PVISR:SRG:NPF,SSTER:FRG:IDF,SSTER:FRG:MICF,SSTER:FRG:MIPF,SSTER:FRG:NCF,SSTER:FRG:NPF,SSTER:SRG:IDF,SSTER:SRG:MICF,SSTER:SRG:MIPF,SSTER:SRG:NCF,SSTER:SRG:NPF,STIR:FRG:IDF,STIR:FRG:MICF,STIR:FRG:MIPF,STIR:FRG:NCF,STIR:FRG:NPF,STIR:SRG:IDF,STIR:SRG:MICF,STIR:SRG:MIPF,STIR:SRG:NCF,STIR:SRG:NPF,SimulationTime,TRAJECTORY,WSTER:FRG:IDF,WSTER:FRG:MICF,WSTER:FRG:MIPF,WSTER:FRG:NCF,WSTER:FRG:NPF,WSTER:SRG:IDF,WSTER:SRG:MICF,WSTER:SRG:MIPF,WSTER:SRG:NCF,WSTER:SRG:NPF,fastestRouteRoutingStrategyCALCULATED_TIME,fastestRouteRoutingStrategyFROM_CACHE_TIME,intrestDistanceFactorGoalStrategyFOUND_GOAL_TIME,intrestDistanceFactorGoalStrategyNO_INTEREST_TIME,mostInterestingClusterFirstGoalStrategyFOUND_GOAL_TIME,mostInterestingClusterFirstGoalStrategyNO_INTEREST_TIME,mostInterestingPlacesFirstGoalStrategyFOUND_GOAL_TIME,mostInterestingPlacesFirstGoalStrategyNO_INTEREST_TIME,nearestClusterFirstGoalStrategyFOUND_GOAL_TIME,nearestClusterFirstGoalStrategyNO_INTEREST_TIME,nearestPlacesFirstGoalStrategyFOUND_GOAL_TIME,nearestPlacesFirstGoalStrategyNO_INTEREST_TIME,shortestRouteRoutingStrategyCALCULATED_TIME,shortestRouteRoutingStrategyFROM_CACHE_TIME
Count,1.0,300.0,309.0,287.0,327.0,301.0,279.0,271.0,323.0,293.0,310.0,1917000.0,109.0,1154.0,160023.0,1.0,161177.0,300.0,309.0,287.0,327.0,301.0,279.0,271.0,323.0,293.0,310.0,1.0,1.0,1.0,300.0,309.0,287.0,327.0,301.0,279.0,271.0,323.0,293.0,310.0,300.0,309.0,287.0,327.0,301.0,279.0,271.0,323.0,293.0,310.0,300.0,309.0,287.0,327.0,301.0,279.0,271.0,323.0,293.0,310.0,1.0,161172.0,300.0,309.0,287.0,327.0,301.0,279.0,271.0,323.0,293.0,310.0,11713.0,130525.0,4640.0,579.0,4329.0,580.0,3937.0,610.0,5120.0,620.0,4979.0,611.0,11123.0,119909.0
Max,5262246.0,4414.7817278065195,4242.6753288963955,8195.707138281412,4808.768288189821,5101.815275012008,3918.628127559325,4033.7763288963943,7627.404857057375,5483.792748857193,4898.979889616889,1.05117948E8,1.303209986E9,1.354639013E9,1.41118983E8,49765.0,10.0,640.0,640.0,640.0,640.0,640.0,640.0,640.0,640.0,640.0,640.0,8030302.0,977357.0,3.184870124E9,13.0,12.0,12.0,12.0,12.0,13.0,13.0,10.0,13.0,13.0,4991.0,4828.0,8723.0,5394.0,5683.0,4487.0,4609.0,8153.0,6059.0,5484.0,4991000.0,4828000.0,8723000.0,5394000.0,5683000.0,4487000.0,4609000.0,8153000.0,6059000.0,5484000.0,49432.0,55.29130928665962,4352.0,4189.0,8084.0,4755.0,5044.0,3848.0,3970.0,7514.0,5420.0,4845.0,1.3145791E9,3.15209511E8,2.924274102E9,20569.0,2.840388396E9,2236.0,5842177.0,2331.0,2.462354139E9,743.0,5.502290892E9,2586.0,1.298142814E9,6.2950873E8
Min,5262246.0,725.0924291738971,850.1860829616376,4406.558168101138,577.9467508080554,515.5760674683795,813.4636873674199,656.9888215336225,4266.280168101138,577.9467508080554,530.1231731461542,1.0,1.00003975E8,1.00001312E8,32745.0,49765.0,1.0,639.0,639.0,639.0,639.0,639.0,639.0,639.0,639.0,639.0,639.0,8030302.0,977357.0,3.184870124E9,5.0,4.0,4.0,5.0,5.0,5.0,4.0,4.0,5.0,5.0,1351.0,1479.0,4985.0,1209.0,1146.0,1437.0,1283.0,4835.0,1209.0,1165.0,1351000.0,1479000.0,4985000.0,1209000.0,1146000.0,1437000.0,1283000.0,4835000.0,1209000.0,1165000.0,49432.0,0.06252474641866858,712.0,840.0,4346.0,570.0,507.0,798.0,644.0,4197.0,570.0,526.0,2374946.0,1562.0,60278.0,103.0,89401.0,88.0,480.0,77.0,30665.0,103.0,2664.0,53.0,2499022.0,1504.0
Avg,5262246.0,1841.0613633598189,2164.5466423417724,5926.113392710141,1696.8512071089183,1310.0299422643538,1890.3201595347928,2076.4234566581167,5761.945647853544,1850.9537897652694,1339.8487690995312,200.73039801773604,2.0342540579816514E8,2.057385982677643E8,955687.4937415246,49765.0,9.964523474192967,639.99,639.9805825242719,639.9895470383275,639.9877675840978,639.9933554817276,639.989247311828,639.9852398523985,639.9876160990713,639.9863481228668,639.9935483870968,8030302.0,977357.0,3.184870124E9,7.96,7.472491909385114,6.498257839721254,8.223241590214068,8.043189368770765,8.07168458781362,7.453874538745388,6.414860681114551,8.296928327645052,8.251612903225807,2456.44,2772.064724919094,6485.912891986062,2313.250764525994,1932.0033222591362,2504.2974910394264,2684.4428044280444,6313.476780185759,2465.7986348122868,1961.4064516129033,2456440.0,2772064.724919094,6485912.891986063,2313250.7645259937,1932003.3222591362,2504297.4910394265,2684442.8044280442,6313476.780185758,2465798.6348122866,1961406.4516129033,49432.0,16.54889643955028,1817.45,2133.084142394822,5846.923344947735,1674.262996941896,1293.0099667774086,1865.3082437275987,2045.4575645756458,5674.489164086687,1826.8122866894198,1322.4129032258065,5.86467267033211E7,36650.85196705612,5.9864383373922415E7,315.7633851468048,6.352624960683761E7,297.68275862068964,5274.414020828041,256.42622950819674,4.777706983339844E7,278.208064516129,1.7329720718879294E8,188.3469721767594,5.6810759711678505E7,35244.51426498428
variance,0.0,362751.9762304622,317984.31253694237,646677.7266804784,736661.436404286,717961.4583398585,311930.97177546524,304182.91999774316,595071.5378969546,908748.8118924124,727621.6986343653,1.0462249202043777E10,2.1830424916297468E16,2.0824476552454004E16,3.644521787965696E13,0.0,0.2230910441661079,0.009899999999999952,0.019040437364501846,0.01034369726474765,0.012082783903337896,0.00660036864935263,0.010637067869117882,0.014542285644258567,0.012230539926578389,0.013465503383848436,0.0064099895941727375,0.0,0.0,0.0,2.0450666666666697,2.307495732135188,1.894596268013452,1.7269216021846265,1.748965243209234,2.073714366464976,2.0043300063996954,1.6359401508688844,1.8674649675593176,1.8915296566076918,352970.51973333326,309539.3679789694,631194.4070463406,723361.7230498747,704155.8039756732,300922.5315707666,294142.3574297734,580930.6395537194,890737.4372677596,711840.8477003119,3.529705197333333E11,3.095393679789695E11,6.3119440704634E11,7.233617230498735E11,7.041558039756736E11,3.0092253157076575E11,2.9414235742977356E11,5.809306395537194E11,8.907374372677612E11,7.118408477003126E11,0.0,61.18060868782542,352963.18750000047,309539.17091358517,631174.844298219,723351.9247163997,704158.847076743,300926.49279942433,294141.30354978784,580921.2901302616,890758.8623746347,711853.30693028,1.1153555654446878E16,6.166858766847572E12,7.579001825094264E16,734161.3067077111,8.1398297672147648E16,54219.91315101066,8.866874184703876E9,90341.34619725864,4.9132126572521104E16,11857.419612382933,6.3509309247387917E17,27811.146386086002,1.0403708384766492E16,9.124427215566238E12
Quantil 0,,,,,,,,,,,,,,,,,,,,,,,,,,,,,,,,,,,,,,,,,,,,,,,,,,,,,,,,,,,,,,,,,,,,,,,,,,,,,,,,,,,,,,
Quantil 1,,,,,,,,,,,,,,,,,,,,,,,,,,,,,,,,,,,,,,,,,,,,,,,,,,,,,,,,,,,,,,,,,,,,,,,,,,,,,,,,,,,,,,
Quantil 2,,,,,,,,,,,,,,,,,,,,,,,,,,,,,,,,,,,,,,,,,,,,,,,,,,,,,,,,,,,,,,,,,,,,,,,,,,,,,,,,,,,,,,
Quantil 3,,,,,,,,,,,,,,,,,,,,,,,,,,,,,,,,,,,,,,,,,,,,,,,,,,,,,,,,,,,,,,,,,,,,,,,,,,,,,,,,,,,,,,
Quantil 4,,,,,,,,,,,,,,,,,,,,,,,,,,,,,,,,,,,,,,,,,,,,,,,,,,,,,,,,,,,,,,,,,,,,,,,,,,,,,,,,,,,,,,
Quantil 5,,,,,,,,,,,,,,,,,,,,,,,,,,,,,,,,,,,,,,,,,,,,,,,,,,,,,,,,,,,,,,,,,,,,,,,,,,,,,,,,,,,,,,
Quantil 6,,,,,,,,,,,,,,,,,,,,,,,,,,,,,,,,,,,,,,,,,,,,,,,,,,,,,,,,,,,,,,,,,,,,,,,,,,,,,,,,,,,,,,
Quantil 7,,,,,,,,,,,,,,,,,,,,,,,,,,,,,,,,,,,,,,,,,,,,,,,,,,,,,,,,,,,,,,,,,,,,,,,,,,,,,,,,,,,,,,
Quantil 8,,,,,,,,,,,,,,,,,,,,,,,,,,,,,,,,,,,,,,,,,,,,,,,,,,,,,,,,,,,,,,,,,,,,,,,,,,,,,,,,,,,,,,
Quantil 9,,,,,,,,,,,,,,,,,,,,,,,,,,,,,,,,,,,,,,,,,,,,,,,,,,,,,,,,,,,,,,,,,,,,,,,,,,,,,,,,,,,,,,
Quantil 10,,,,,,,,,,,,,,,,,,,,,,,,,,,,,,,,,,,,,,,,,,,,,,,,,,,,,,,,,,,,,,,,,,,,,,,,,,,,,,,,,,,,,,
Quantil 11,,,,,,,,,,,,,,,,,,,,,,,,,,,,,,,,,,,,,,,,,,,,,,,,,,,,,,,,,,,,,,,,,,,,,,,,,,,,,,,,,,,,,,
Quantil 12,,,,,,,,,,,,,,,,,,,,,,,,,,,,,,,,,,,,,,,,,,,,,,,,,,,,,,,,,,,,,,,,,,,,,,,,,,,,,,,,,,,,,,
Quantil 13,,,,,,,,,,,,,,,,,,,,,,,,,,,,,,,,,,,,,,,,,,,,,,,,,,,,,,,,,,,,,,,,,,,,,,,,,,,,,,,,,,,,,,
Quantil 14,,,,,,,,,,,,,,,,,,,,,,,,,,,,,,,,,,,,,,,,,,,,,,,,,,,,,,,,,,,,,,,,,,,,,,,,,,,,,,,,,,,,,,
Quantil 15,,,,,,,,,,,,,,,,,,,,,,,,,,,,,,,,,,,,,,,,,,,,,,,,,,,,,,,,,,,,,,,,,,,,,,,,,,,,,,,,,,,,,,
Quantil 16,,,,,,,,,,,,,,,,,,,,,,,,,,,,,,,,,,,,,,,,,,,,,,,,,,,,,,,,,,,,,,,,,,,,,,,,,,,,,,,,,,,,,,
Quantil 17,,,,,,,,,,,,,,,,,,,,,,,,,,,,,,,,,,,,,,,,,,,,,,,,,,,,,,,,,,,,,,,,,,,,,,,,,,,,,,,,,,,,,,
Quantil 18,,,,,,,,,,,,,,,,,,,,,,,,,,,,,,,,,,,,,,,,,,,,,,,,,,,,,,,,,,,,,,,,,,,,,,,,,,,,,,,,,,,,,,
Quantil 19,,,,,,,,,,,,,,,,,,,,,,,,,,,,,,,,,,,,,,,,,,,,,,,,,,,,,,,,,,,,,,,,,,,,,,,,,,,,,,,,,,,,,,
