ID,DWR:FRG:IDF,DWR:FRG:MICF,DWR:FRG:MIPF,DWR:FRG:NCF,DWR:FRG:NPF,DWR:SRG:IDF,DWR:SRG:MICF,DWR:SRG:MIPF,DWR:SRG:NCF,DWR:SRG:NPF,DefaultEnjoyingStrategyLEAVE_TIME,ESTER:FRG:IDF,ESTER:FRG:MICF,ESTER:FRG:MIPF,ESTER:FRG:NCF,ESTER:FRG:NPF,ESTER:SRG:IDF,ESTER:SRG:MICF,ESTER:SRG:MIPF,ESTER:SRG:NCF,ESTER:SRG:NPF,GraphClusteringAlgorithmCREATE_LINKAGES_TIME,GraphClusteringAlgorithmCREATE_WEIGHTED_CLUSTER_TIME,GraphClusteringAlgorithmWEIGHTED_CLUSTERING_TIME,PVISR:FRG:IDF,PVISR:FRG:MICF,PVISR:FRG:MIPF,PVISR:FRG:NCF,PVISR:FRG:NPF,PVISR:SRG:IDF,PVISR:SRG:MICF,PVISR:SRG:MIPF,PVISR:SRG:NCF,PVISR:SRG:NPF,SSTER:FRG:IDF,SSTER:FRG:MICF,SSTER:FRG:MIPF,SSTER:FRG:NCF,SSTER:FRG:NPF,SSTER:SRG:IDF,SSTER:SRG:MICF,SSTER:SRG:MIPF,SSTER:SRG:NCF,SSTER:SRG:NPF,STIR:FRG:IDF,STIR:FRG:MICF,STIR:FRG:MIPF,STIR:FRG:NCF,STIR:FRG:NPF,STIR:SRG:IDF,STIR:SRG:MICF,STIR:SRG:MIPF,STIR:SRG:NCF,STIR:SRG:NPF,TRAJECTORY_AVG,TRAJECTORY_MAX,TRAJECTORY_MIN,WSTER:FRG:IDF,WSTER:FRG:MICF,WSTER:FRG:MIPF,WSTER:FRG:NCF,WSTER:FRG:NPF,WSTER:SRG:IDF,WSTER:SRG:MICF,WSTER:SRG:MIPF,WSTER:SRG:NCF,WSTER:SRG:NPF,fastestRouteRoutingStrategyCALCULATED_TIME,fastestRouteRoutingStrategyFROM_CACHE_TIME,intrestDistanceFactorGoalStrategyFOUND_GOAL_TIME,intrestDistanceFactorGoalStrategyNO_INTEREST_TIME,mostInterestingClusterFirstGoalStrategyFOUND_GOAL_TIME,mostInterestingClusterFirstGoalStrategyNO_INTEREST_TIME,mostInterestingPlacesFirstGoalStrategyFOUND_GOAL_TIME,mostInterestingPlacesFirstGoalStrategyNO_INTEREST_TIME,nearestClusterFirstGoalStrategyFOUND_GOAL_TIME,nearestClusterFirstGoalStrategyNO_INTEREST_TIME,nearestPlacesFirstGoalStrategyFOUND_GOAL_TIME,nearestPlacesFirstGoalStrategyNO_INTEREST_TIME,shortestRouteRoutingStrategyCALCULATED_TIME,shortestRouteRoutingStrategyFROM_CACHE_TIME
Count,104.0,106.0,100.0,80.0,101.0,108.0,87.0,97.0,110.0,107.0,650205.0,104.0,106.0,100.0,80.0,101.0,108.0,87.0,97.0,110.0,107.0,1.0,1.0,1.0,104.0,106.0,100.0,80.0,101.0,108.0,87.0,97.0,110.0,107.0,104.0,106.0,100.0,80.0,101.0,108.0,87.0,97.0,110.0,107.0,104.0,106.0,100.0,80.0,101.0,108.0,87.0,97.0,110.0,107.0,999.0,1000.0,1000.0,104.0,106.0,100.0,80.0,101.0,108.0,87.0,97.0,110.0,107.0,6269.0,40348.0,1718.0,212.0,1487.0,193.0,1334.0,197.0,1649.0,190.0,1731.0,208.0,6393.0,42343.0
Max,4078.434127559324,4476.322727806519,7728.099857057374,4770.726124217671,4405.389674764814,5334.581328896393,3983.0403288963944,8289.741138281412,4462.842748857193,4740.893111039858,2.0012711E7,1479.0,1699.0,1487.0,1493.0,1628.0,1518.0,1662.0,1685.0,1744.0,1551.0,8429367.0,1157669.0,3.249092426E9,12.0,12.0,10.0,14.0,12.0,14.0,11.0,13.0,13.0,12.0,6346.0,7296.0,9907.0,5130.0,6575.0,6838.0,6642.0,16263.0,6566.0,6630.0,6346000.0,7296000.0,9907000.0,5130000.0,6575000.0,6838000.0,6642000.0,1.6263E7,6566000.0,6630000.0,4.9E-324,4.9E-324,1.7976931348623157E308,5965.0,5800.0,8997.0,4794.0,5464.0,6040.0,5541.0,14949.0,5828.0,5740.0,5.74391139E8,5.5707301E8,1.925740534E9,1324.0,1.590686869E9,1837.0,2.3250622E7,1917.0,1.65080238E9,1979.0,4.283001034E9,1365.0,5.88710276E8,5.62112766E8
Min,713.9495197299191,1087.406022590494,4406.558168101138,597.4786276604257,613.4398292317687,794.7812299103671,1083.8950829616376,4266.280168101138,705.1040829616376,522.3437160802384,1.0,312.0,320.0,313.0,316.0,301.0,304.0,311.0,314.0,318.0,318.0,8429367.0,1157669.0,3.249092426E9,5.0,5.0,4.0,5.0,6.0,5.0,4.0,4.0,5.0,5.0,1041.0,1412.0,3868.0,1050.0,1194.0,1015.0,1542.0,3919.0,1225.0,883.0,1041000.0,1412000.0,3868000.0,1050000.0,1194000.0,1015000.0,1542000.0,3919000.0,1225000.0,883000.0,0.0,4.9E-324,1.7976931348623157E308,542.0,874.0,3296.0,588.0,617.0,691.0,857.0,3362.0,677.0,527.0,2434429.0,1533.0,69223.0,82.0,78946.0,87.0,542.0,67.0,32713.0,96.0,6335.0,70.0,2654733.0,1429.0
Avg,1908.802320963057,2137.26046327144,6099.287180916332,1783.105119459909,1415.1395482380324,1877.9368008102194,2225.9609059893555,5893.580017947085,1680.9332856524836,1391.4170871450553,136.003585023185,653.75,677.2641509433962,653.87,608.5375,656.5841584158416,631.4629629629629,635.1379310344828,667.2268041237113,683.9363636363636,631.9439252336449,8429367.0,1157669.0,3.249092426E9,8.173076923076923,7.754716981132075,6.8,8.75,8.425742574257425,8.037037037037036,7.64367816091954,6.742268041237113,8.627272727272727,8.22429906542056,2612.644230769231,2855.9811320754716,6807.16,2350.0125,2086.09900990099,2572.027777777778,2836.689655172414,6874.278350515464,2449.809090909091,2062.5140186915887,2612644.230769231,2855981.132075472,6807160.0,2350012.5,2086099.0099009902,2572027.777777778,2836689.6551724137,6874278.350515464,2449809.090909091,2062514.018691589,0.0,4.9E-324,Infinity,1959.8942307692307,2179.7169811320755,6154.29,1742.475,1430.5148514851485,1941.5648148148148,2202.551724137931,6208.051546391753,1766.8727272727272,1431.5700934579438,4.4422541618918486E7,78616.88631406761,6.96738744959255E7,232.43867924528303,7.281093503429724E7,180.0777202072539,22288.07796101949,295.33502538071065,5.969381717161916E7,281.68947368421055,1.648088088549971E8,263.2548076923077,4.6992386904113874E7,105926.5400656543
variance,526207.358397838,421009.5453728371,612422.6852216462,888822.9574622808,789905.7928147104,601731.5811776797,426690.5930371101,578782.8848706324,496908.7424343012,826336.0947345289,1.0582129312156547E9,84615.53365384616,108771.62833748665,114985.9931,87013.49859374999,109660.50034310363,94079.65603566529,86604.16488307569,99523.43309597192,129338.85958677685,81498.27722945235,0.0,0.0,0.0,2.0085059171597637,1.7511569953720167,1.7000000000000022,2.7875,1.709832369375552,2.294924554183814,2.0454485400977656,2.3974917632054438,2.4701652892561983,2.3235217049523964,1043079.9791974853,901817.1883232465,1992245.6744,896322.76234375,857678.9802960494,1025643.3233024691,859857.8921918352,4120713.9740673816,915126.8090082647,903235.670364224,1.0430799791974855E12,9.018171883232466E11,1.9922456744E12,8.9632276234375E11,8.576789802960493E11,1.0256433233024688E12,8.598578921918351E11,4.1207139740673813E12,9.151268090082644E11,9.03235670364224E11,0.0,0.0,Infinity,976261.8638128699,746463.6746173014,1759295.5259000002,756049.8493750002,809107.1606705226,876454.8754286693,746098.8910027745,3930942.9354873006,813797.6383471073,818472.0394794304,5.057982506999145E15,2.149856490434207E13,5.0777293062367984E16,34393.68020202919,5.2146144011959016E16,22501.2426642326,4.048840446486475E11,135927.39029606534,3.882909203967348E16,88294.414099723,4.4719565203345152E17,51752.76680380918,5.671755561579703E15,3.266374306852854E13
Quantil 0,4.0,6.0,5.0,2.0,6.0,7.0,3.0,2.0,2.0,5.0,650200.0,13.0,17.0,20.0,13.0,13.0,21.0,16.0,10.0,22.0,21.0,1.0,1.0,1.0,2.0,4.0,4.0,2.0,9.0,1.0,1.0,7.0,1.0,2.0,5.0,5.0,2.0,2.0,23.0,2.0,7.0,4.0,15.0,10.0,5.0,5.0,2.0,2.0,23.0,2.0,7.0,4.0,15.0,10.0,999.0,1000.0,1000.0,4.0,8.0,1.0,4.0,16.0,6.0,4.0,6.0,7.0,15.0,4125.0,40331.0,1486.0,91.0,1267.0,133.0,1333.0,114.0,1445.0,88.0,1608.0,64.0,4195.0,42325.0
Quantil 1,4.0,4.0,1.0,5.0,26.0,8.0,3.0,2.0,8.0,19.0,2.0,13.0,19.0,14.0,17.0,20.0,17.0,16.0,19.0,23.0,13.0,,,,0.0,0.0,0.0,0.0,0.0,0.0,0.0,0.0,0.0,0.0,6.0,7.0,0.0,7.0,24.0,5.0,8.0,11.0,14.0,18.0,6.0,7.0,0.0,7.0,24.0,5.0,8.0,11.0,14.0,18.0,,,,8.0,5.0,3.0,8.0,34.0,11.0,4.0,12.0,24.0,26.0,522.0,5.0,59.0,41.0,53.0,45.0,0.0,32.0,39.0,65.0,5.0,30.0,485.0,2.0
Quantil 2,5.0,8.0,1.0,6.0,32.0,9.0,4.0,7.0,27.0,41.0,0.0,13.0,15.0,12.0,11.0,11.0,9.0,9.0,14.0,8.0,14.0,,,,9.0,8.0,0.0,3.0,0.0,14.0,5.0,12.0,8.0,14.0,7.0,18.0,6.0,10.0,14.0,19.0,14.0,16.0,11.0,20.0,7.0,18.0,6.0,10.0,14.0,19.0,14.0,16.0,11.0,20.0,,,,8.0,8.0,2.0,12.0,21.0,19.0,11.0,10.0,18.0,26.0,435.0,2.0,38.0,24.0,32.0,5.0,0.0,19.0,36.0,15.0,2.0,42.0,459.0,0.0
Quantil 3,10.0,5.0,5.0,31.0,8.0,27.0,3.0,4.0,24.0,18.0,0.0,12.0,5.0,8.0,7.0,11.0,11.0,6.0,6.0,12.0,5.0,,,,0.0,0.0,10.0,0.0,14.0,0.0,0.0,0.0,0.0,0.0,17.0,20.0,3.0,10.0,14.0,18.0,9.0,18.0,11.0,17.0,17.0,20.0,3.0,10.0,14.0,18.0,9.0,18.0,11.0,17.0,,,,25.0,18.0,3.0,11.0,6.0,19.0,14.0,17.0,13.0,14.0,358.0,2.0,29.0,20.0,24.0,3.0,0.0,1.0,26.0,7.0,7.0,33.0,379.0,1.0
Quantil 4,3.0,4.0,1.0,3.0,13.0,24.0,3.0,9.0,5.0,11.0,0.0,9.0,9.0,9.0,5.0,6.0,9.0,8.0,10.0,5.0,12.0,,,,0.0,0.0,0.0,11.0,0.0,28.0,0.0,22.0,21.0,0.0,12.0,14.0,4.0,15.0,8.0,19.0,12.0,10.0,19.0,14.0,12.0,14.0,4.0,15.0,8.0,19.0,12.0,10.0,19.0,14.0,,,,19.0,18.0,4.0,13.0,9.0,20.0,11.0,16.0,15.0,9.0,288.0,0.0,19.0,10.0,16.0,3.0,0.0,1.0,9.0,2.0,9.0,16.0,275.0,3.0
Quantil 5,15.0,44.0,8.0,3.0,3.0,17.0,5.0,2.0,3.0,1.0,0.0,5.0,5.0,2.0,3.0,7.0,5.0,6.0,7.0,5.0,6.0,,,,24.0,37.0,0.0,0.0,0.0,0.0,9.0,0.0,0.0,19.0,20.0,14.0,5.0,5.0,6.0,14.0,9.0,11.0,12.0,10.0,20.0,14.0,5.0,5.0,6.0,14.0,9.0,11.0,12.0,10.0,,,,17.0,16.0,5.0,8.0,1.0,10.0,12.0,10.0,17.0,3.0,181.0,3.0,12.0,4.0,14.0,1.0,0.0,3.0,18.0,2.0,2.0,3.0,177.0,6.0
Quantil 6,27.0,12.0,1.0,11.0,3.0,4.0,25.0,10.0,17.0,1.0,0.0,9.0,4.0,2.0,3.0,8.0,6.0,4.0,6.0,2.0,6.0,,,,0.0,0.0,28.0,21.0,29.0,30.0,0.0,31.0,0.0,0.0,12.0,9.0,13.0,7.0,1.0,8.0,8.0,10.0,10.0,1.0,12.0,9.0,13.0,7.0,1.0,8.0,8.0,10.0,10.0,1.0,,,,7.0,10.0,12.0,5.0,3.0,7.0,4.0,4.0,3.0,2.0,118.0,1.0,11.0,5.0,9.0,1.0,0.0,1.0,13.0,2.0,3.0,3.0,141.0,0.0
Quantil 7,13.0,4.0,14.0,7.0,0.0,0.0,16.0,8.0,9.0,0.0,0.0,2.0,6.0,3.0,3.0,3.0,3.0,2.0,5.0,5.0,7.0,,,,0.0,0.0,0.0,0.0,0.0,0.0,0.0,0.0,19.0,0.0,5.0,5.0,10.0,2.0,0.0,6.0,4.0,4.0,6.0,5.0,5.0,5.0,10.0,2.0,0.0,6.0,4.0,4.0,6.0,5.0,,,,2.0,7.0,13.0,4.0,1.0,4.0,8.0,10.0,2.0,0.0,91.0,0.0,10.0,3.0,10.0,1.0,0.0,1.0,11.0,0.0,17.0,3.0,115.0,0.0
Quantil 8,9.0,7.0,1.0,4.0,0.0,2.0,5.0,20.0,8.0,0.0,0.0,1.0,5.0,4.0,0.0,2.0,4.0,2.0,2.0,2.0,3.0,,,,28.0,34.0,0.0,21.0,0.0,18.0,28.0,17.0,0.0,25.0,3.0,7.0,10.0,4.0,0.0,4.0,4.0,5.0,3.0,2.0,3.0,7.0,10.0,4.0,0.0,4.0,4.0,5.0,3.0,2.0,,,,0.0,5.0,2.0,3.0,0.0,2.0,5.0,1.0,3.0,1.0,58.0,1.0,11.0,4.0,4.0,0.0,0.0,4.0,8.0,0.0,11.0,0.0,60.0,0.0
Quantil 9,0.0,0.0,8.0,1.0,0.0,0.0,3.0,11.0,1.0,0.0,0.0,3.0,2.0,5.0,5.0,4.0,2.0,4.0,3.0,3.0,3.0,,,,0.0,0.0,31.0,0.0,29.0,0.0,0.0,0.0,31.0,0.0,3.0,0.0,3.0,3.0,4.0,4.0,4.0,3.0,2.0,3.0,3.0,0.0,3.0,3.0,4.0,4.0,4.0,3.0,2.0,3.0,,,,1.0,3.0,10.0,1.0,1.0,1.0,5.0,6.0,2.0,2.0,17.0,0.0,4.0,4.0,9.0,0.0,0.0,1.0,9.0,2.0,5.0,1.0,18.0,1.0
Quantil 10,0.0,1.0,18.0,0.0,0.0,0.0,1.0,4.0,0.0,0.0,1.0,3.0,4.0,2.0,5.0,3.0,2.0,4.0,2.0,5.0,6.0,,,,0.0,0.0,0.0,0.0,0.0,0.0,0.0,0.0,0.0,0.0,1.0,2.0,2.0,2.0,1.0,3.0,3.0,2.0,1.0,2.0,1.0,2.0,2.0,2.0,1.0,3.0,3.0,2.0,1.0,2.0,,,,2.0,3.0,7.0,2.0,0.0,3.0,1.0,1.0,0.0,3.0,9.0,0.0,9.0,3.0,5.0,0.0,0.0,5.0,9.0,0.0,10.0,0.0,15.0,0.0
Quantil 11,1.0,1.0,8.0,0.0,0.0,4.0,3.0,2.0,1.0,1.0,0.0,5.0,4.0,1.0,1.0,1.0,1.0,3.0,4.0,4.0,0.0,,,,24.0,13.0,0.0,13.0,0.0,10.0,21.0,2.0,0.0,26.0,3.0,1.0,9.0,1.0,2.0,1.0,1.0,0.0,0.0,2.0,3.0,1.0,9.0,1.0,2.0,1.0,1.0,0.0,0.0,2.0,,,,1.0,0.0,1.0,1.0,2.0,1.0,3.0,1.0,0.0,1.0,11.0,0.0,9.0,0.0,7.0,0.0,0.0,3.0,6.0,0.0,5.0,3.0,11.0,0.0
Quantil 12,0.0,1.0,6.0,0.0,0.0,3.0,1.0,2.0,0.0,0.0,1.0,3.0,2.0,0.0,0.0,1.0,4.0,3.0,1.0,4.0,3.0,,,,0.0,0.0,0.0,0.0,0.0,0.0,0.0,0.0,17.0,0.0,1.0,1.0,7.0,2.0,3.0,0.0,1.0,1.0,2.0,0.0,1.0,1.0,7.0,2.0,3.0,0.0,1.0,1.0,2.0,0.0,,,,2.0,0.0,8.0,2.0,3.0,2.0,2.0,1.0,0.0,2.0,12.0,0.0,4.0,0.0,7.0,0.0,0.0,2.0,1.0,2.0,0.0,3.0,14.0,1.0
Quantil 13,3.0,0.0,1.0,0.0,0.0,0.0,0.0,9.0,0.0,0.0,0.0,5.0,1.0,2.0,1.0,1.0,1.0,2.0,1.0,1.0,0.0,,,,0.0,0.0,16.0,4.0,15.0,5.0,0.0,5.0,0.0,0.0,5.0,0.0,3.0,1.0,0.0,2.0,1.0,0.0,0.0,1.0,5.0,0.0,3.0,1.0,0.0,2.0,1.0,0.0,0.0,1.0,,,,5.0,0.0,5.0,1.0,0.0,0.0,1.0,0.0,2.0,1.0,10.0,0.0,10.0,0.0,9.0,0.0,0.0,4.0,8.0,0.0,4.0,1.0,12.0,0.0
Quantil 14,0.0,1.0,0.0,0.0,0.0,0.0,0.0,2.0,0.0,2.0,0.0,2.0,3.0,2.0,0.0,2.0,7.0,0.0,2.0,1.0,1.0,,,,10.0,6.0,0.0,0.0,0.0,0.0,16.0,0.0,9.0,15.0,1.0,1.0,3.0,1.0,0.0,0.0,0.0,0.0,1.0,0.0,1.0,1.0,3.0,1.0,0.0,0.0,0.0,0.0,1.0,0.0,,,,0.0,1.0,5.0,1.0,3.0,0.0,0.0,0.0,0.0,0.0,6.0,0.0,1.0,0.0,5.0,0.0,0.0,3.0,4.0,1.0,7.0,1.0,5.0,1.0
Quantil 15,0.0,3.0,0.0,0.0,0.0,1.0,1.0,0.0,0.0,1.0,0.0,1.0,1.0,3.0,0.0,1.0,2.0,0.0,1.0,4.0,3.0,,,,0.0,0.0,0.0,2.0,0.0,1.0,0.0,0.0,0.0,0.0,1.0,0.0,8.0,4.0,0.0,0.0,0.0,0.0,1.0,1.0,1.0,0.0,8.0,4.0,0.0,0.0,0.0,0.0,1.0,1.0,,,,1.0,1.0,6.0,2.0,0.0,0.0,0.0,0.0,1.0,1.0,4.0,2.0,3.0,1.0,7.0,0.0,0.0,1.0,1.0,0.0,7.0,1.0,2.0,0.0
Quantil 16,0.0,2.0,14.0,0.0,2.0,0.0,7.0,2.0,0.0,3.0,0.0,2.0,0.0,6.0,2.0,1.0,1.0,0.0,0.0,1.0,2.0,,,,0.0,0.0,9.0,0.0,4.0,0.0,0.0,0.0,0.0,0.0,0.0,1.0,6.0,1.0,0.0,0.0,1.0,0.0,1.0,0.0,0.0,1.0,6.0,1.0,0.0,0.0,1.0,0.0,1.0,0.0,,,,1.0,1.0,4.0,0.0,0.0,0.0,0.0,0.0,2.0,0.0,1.0,0.0,1.0,1.0,1.0,0.0,0.0,0.0,2.0,1.0,10.0,1.0,3.0,1.0
Quantil 17,8.0,2.0,6.0,2.0,4.0,0.0,1.0,0.0,2.0,3.0,0.0,0.0,2.0,1.0,1.0,2.0,1.0,0.0,2.0,1.0,0.0,,,,6.0,2.0,0.0,2.0,0.0,0.0,3.0,0.0,3.0,3.0,0.0,0.0,2.0,1.0,0.0,1.0,0.0,0.0,0.0,0.0,0.0,0.0,2.0,1.0,0.0,1.0,0.0,0.0,0.0,0.0,,,,0.0,1.0,3.0,0.0,0.0,0.0,0.0,0.0,0.0,0.0,6.0,0.0,1.0,0.0,1.0,0.0,0.0,1.0,2.0,0.0,4.0,1.0,9.0,0.0
Quantil 18,1.0,0.0,1.0,3.0,3.0,1.0,0.0,0.0,0.0,0.0,0.0,1.0,0.0,1.0,1.0,1.0,1.0,1.0,1.0,1.0,1.0,,,,0.0,0.0,0.0,0.0,0.0,0.0,0.0,0.0,0.0,0.0,0.0,0.0,3.0,1.0,0.0,0.0,0.0,1.0,0.0,0.0,0.0,0.0,3.0,1.0,0.0,0.0,0.0,1.0,0.0,0.0,,,,0.0,0.0,5.0,1.0,0.0,2.0,0.0,0.0,0.0,0.0,8.0,0.0,0.0,0.0,3.0,0.0,0.0,0.0,1.0,1.0,4.0,0.0,12.0,0.0
Quantil 19,1.0,1.0,1.0,2.0,1.0,1.0,3.0,1.0,3.0,1.0,1.0,2.0,2.0,3.0,2.0,3.0,1.0,1.0,1.0,1.0,1.0,,,,1.0,2.0,2.0,1.0,1.0,1.0,4.0,1.0,1.0,3.0,2.0,1.0,1.0,1.0,1.0,2.0,1.0,1.0,1.0,1.0,2.0,1.0,1.0,1.0,1.0,2.0,1.0,1.0,1.0,1.0,,,,1.0,1.0,1.0,1.0,1.0,1.0,2.0,2.0,1.0,1.0,9.0,1.0,1.0,1.0,4.0,1.0,1.0,1.0,1.0,2.0,11.0,2.0,6.0,2.0
