ID,CircleDistributionStrategyTIME,DWR:FRG:IDF,DWR:FRG:MICF,DWR:FRG:MIPF,DWR:FRG:NCF,DWR:FRG:NPF,DWR:SRG:IDF,DWR:SRG:MICF,DWR:SRG:MIPF,DWR:SRG:NCF,DWR:SRG:NPF,DefaultEnjoyingStrategyLEAVE_TIME,DefaultReconstructionStrategyABORTED_TIME,DefaultReconstructionStrategyFOUND_POINT_ABORTED_TIME,DefaultReconstructionStrategyFOUND_POINT_TIME,DefaultReconstructionStrategyPOINTS_FOUND,ESTER:FRG:IDF,ESTER:FRG:MICF,ESTER:FRG:MIPF,ESTER:FRG:NCF,ESTER:FRG:NPF,ESTER:SRG:IDF,ESTER:SRG:MICF,ESTER:SRG:MIPF,ESTER:SRG:NCF,ESTER:SRG:NPF,GraphClusteringAlgorithmCREATE_LINKAGES_TIME,GraphClusteringAlgorithmCREATE_WEIGHTED_CLUSTER_TIME,GraphClusteringAlgorithmWEIGHTED_CLUSTERING_TIME,PVISR:FRG:IDF,PVISR:FRG:MICF,PVISR:FRG:MIPF,PVISR:FRG:NCF,PVISR:FRG:NPF,PVISR:SRG:IDF,PVISR:SRG:MICF,PVISR:SRG:MIPF,PVISR:SRG:NCF,PVISR:SRG:NPF,SSTER:FRG:IDF,SSTER:FRG:MICF,SSTER:FRG:MIPF,SSTER:FRG:NCF,SSTER:FRG:NPF,SSTER:SRG:IDF,SSTER:SRG:MICF,SSTER:SRG:MIPF,SSTER:SRG:NCF,SSTER:SRG:NPF,STIR:FRG:IDF,STIR:FRG:MICF,STIR:FRG:MIPF,STIR:FRG:NCF,STIR:FRG:NPF,STIR:SRG:IDF,STIR:SRG:MICF,STIR:SRG:MIPF,STIR:SRG:NCF,STIR:SRG:NPF,TRAJECTORY_AVG,TRAJECTORY_MAX,TRAJECTORY_MIN,WSTER:FRG:IDF,WSTER:FRG:MICF,WSTER:FRG:MIPF,WSTER:FRG:NCF,WSTER:FRG:NPF,WSTER:SRG:IDF,WSTER:SRG:MICF,WSTER:SRG:MIPF,WSTER:SRG:NCF,WSTER:SRG:NPF,fastestRouteRoutingStrategyCALCULATED_TIME,fastestRouteRoutingStrategyFROM_CACHE_TIME,intrestDistanceFactorGoalStrategyFOUND_GOAL_TIME,intrestDistanceFactorGoalStrategyNO_INTEREST_TIME,mostInterestingClusterFirstGoalStrategyFOUND_GOAL_TIME,mostInterestingClusterFirstGoalStrategyNO_INTEREST_TIME,mostInterestingPlacesFirstGoalStrategyFOUND_GOAL_TIME,mostInterestingPlacesFirstGoalStrategyNO_INTEREST_TIME,nearestClusterFirstGoalStrategyFOUND_GOAL_TIME,nearestClusterFirstGoalStrategyNO_INTEREST_TIME,nearestPlacesFirstGoalStrategyFOUND_GOAL_TIME,nearestPlacesFirstGoalStrategyNO_INTEREST_TIME,shortestRouteRoutingStrategyCALCULATED_TIME,shortestRouteRoutingStrategyFROM_CACHE_TIME
Count,1.0,284.0,301.0,299.0,296.0,316.0,317.0,258.0,299.0,323.0,309.0,1983271.0,5350.0,15233.0,148065.0,163298.0,284.0,301.0,299.0,296.0,316.0,317.0,258.0,299.0,323.0,309.0,1.0,1.0,1.0,284.0,301.0,299.0,296.0,316.0,317.0,258.0,299.0,323.0,309.0,284.0,301.0,299.0,296.0,316.0,317.0,258.0,299.0,323.0,309.0,284.0,301.0,299.0,296.0,316.0,317.0,258.0,299.0,323.0,309.0,3002.0,3002.0,3002.0,284.0,301.0,299.0,296.0,316.0,317.0,258.0,299.0,323.0,309.0,10573.0,129074.0,4894.0,601.0,4370.0,559.0,3977.0,598.0,5214.0,619.0,5258.0,625.0,10006.0,131859.0
Max,9641134.0,4042.0783288963944,4532.7907278065195,8195.707138281412,4614.44912421767,4858.156275012008,4246.18172780652,4193.86972780652,8055.429138281412,4677.937288189822,4605.800111039858,2.74718614E8,1.242771991E9,1.320897654E9,9.9986975E7,10.0,1688.0,1769.0,1740.0,1681.0,1795.0,1768.0,1749.0,1713.0,1603.0,1681.0,7256740.0,1323570.0,3.158534693E9,12.0,12.0,12.0,14.0,13.0,14.0,12.0,12.0,14.0,12.0,6338.0,7167.0,13482.0,6839.0,7542.0,5713.0,6660.0,31605.0,7211.0,7135.0,6338000.0,7167000.0,1.3482E7,6839000.0,7542000.0,5713000.0,6660000.0,3.1605E7,7211000.0,7135000.0,0.03608811384304915,0.10682937683616736,0.0015476007151989217,5308.0,6828.0,13091.0,6368.0,6338.0,4861.0,6139.0,31203.0,6813.0,5991.0,1.007951133E9,6.16438312E8,4.989804097E9,1130.0,3.781876021E9,880.0,803327.0,15224.0,3.807999594E9,855.0,8.210782784E9,1290.0,9.20840334E8,5.74872223E8
Min,9641134.0,794.7812299103671,964.312022590494,4284.628168101137,522.4484538712915,515.5570674683795,783.7790375321487,940.4920829616376,4312.5603776524395,577.9467508080554,597.4786276604257,1.0,1.00000196E8,1.00000474E8,57096.0,1.0,307.0,310.0,308.0,304.0,312.0,310.0,304.0,314.0,307.0,309.0,7256740.0,1323570.0,3.158534693E9,5.0,4.0,3.0,4.0,5.0,5.0,4.0,4.0,5.0,5.0,1245.0,1391.0,3447.0,927.0,879.0,1199.0,1204.0,3655.0,997.0,971.0,1245000.0,1391000.0,3447000.0,927000.0,879000.0,1199000.0,1204000.0,3655000.0,997000.0,971000.0,0.008907392824203981,0.02840557176789268,4.276204363081248E-6,819.0,894.0,3054.0,497.0,482.0,686.0,895.0,3301.0,541.0,536.0,2147801.0,1840.0,65523.0,96.0,95834.0,80.0,420.0,80.0,34476.0,113.0,3462.0,59.0,2472953.0,1710.0
Avg,9641134.0,1887.199848544688,2209.7741800109325,6030.525783729609,1676.7043295941353,1455.8473464934843,1920.3675175019014,2137.8745926985757,5824.226392185338,1760.2095733630838,1247.017680746515,904.5096166887934,2.2129002382392523E8,2.2186025003820652E8,2558847.297517982,9.470226212201007,635.1267605633802,672.0166112956811,639.4882943143813,677.5405405405405,656.3575949367089,652.8517350157729,658.8217054263566,687.5050167224081,639.749226006192,696.6893203883495,7256740.0,1323570.0,3.158534693E9,8.059859154929578,7.850498338870432,6.7157190635451505,8.39864864864865,8.408227848101266,8.217665615141955,7.77906976744186,6.585284280936455,8.445820433436532,8.41747572815534,2546.919014084507,2964.405315614618,6815.257525083612,2407.9425675675675,2130.3575949367087,2646.3312302839117,2896.5503875968993,6698.879598662207,2433.455108359133,1981.4530744336569,2546919.0140845072,2964405.315614618,6815257.525083612,2407942.5675675673,2130357.594936709,2646331.230283912,2896550.387596899,6698879.598662207,2433455.1083591334,1981453.0744336569,0.021151305655947097,0.06666476270398103,2.9350813920219344E-4,1912.7922535211267,2293.388704318937,6176.7692307692305,1731.402027027027,1475.0,1994.4794952681389,2238.7286821705425,6012.374581939799,1794.7058823529412,1285.7637540453075,7.317660103802137E7,159973.35315400467,6.838369788128321E7,291.44093178036604,7.080182515926774E7,305.63685152057246,4224.560221272316,306.31772575250835,6.572058211526659E7,304.52988691437804,1.792464712793838E8,190.5152,7.436872181930842E7,156511.285001403
variance,0.0,355602.37486064713,412978.2006376175,626611.2088986266,589999.8146060032,969861.7963220575,354941.23352854606,276336.2483412388,672887.6201558199,755463.5390897557,509825.044639647,1.6507957515716956E11,1.6204883958661392E16,1.8067725952845608E16,1.1756495394592586E14,3.3738302970521046,94451.37125570327,115415.38510612465,91463.87528103714,108292.28889700514,104102.54617649416,90021.06003642186,97134.71239709154,107950.33693135422,98249.59345915332,102450.1364878877,0.0,0.0,0.0,2.035149275937309,2.1005728413593663,1.9693515732486278,2.138376552227908,2.1719576189713155,2.4478898187861353,1.6992518478456868,1.9283453205221377,2.4390150389632836,1.9001476733591032,642846.5040046615,893455.437048156,2730967.7564233067,944117.9325123266,1195704.2297207983,608687.7357123665,703534.3792440357,4832394.326640642,1147449.5606782387,769549.1021669231,6.428465040046613E11,8.934554370481564E11,2.730967756423304E12,9.441179325123267E11,1.1957042297207976E12,6.086877357123667E11,7.035343792440358E11,4.832394326640642E12,1.1474495606782397E12,7.695491021669235E11,2.0049357695763387E-5,1.2613207052283547E-4,2.8748864956492356E-8,504218.4462780206,787052.2708358628,2643498.5186519185,799652.5647256213,1084443.0253164556,539560.4767088937,600198.3217354729,4836466.133935861,1002023.0373338193,582192.8082655187,1.343744084582963E16,3.1006082465325402E13,9.3023072551791376E16,13937.993599131789,9.798064881367392E16,15504.0917367776,3.032873128684504E8,421828.6883480051,7.787826556835376E16,17336.559284478328,8.0326981522853619E17,12018.441768960001,1.364603363560719E16,3.0854964831853875E13
Quantil 0,1.0,4.0,5.0,3.0,3.0,16.0,7.0,1.0,21.0,3.0,18.0,1983260.0,2026.0,6133.0,139854.0,2756.0,37.0,57.0,47.0,45.0,52.0,49.0,39.0,40.0,41.0,35.0,1.0,1.0,1.0,8.0,2.0,1.0,1.0,2.0,4.0,1.0,15.0,5.0,2.0,8.0,7.0,3.0,7.0,24.0,7.0,4.0,35.0,16.0,35.0,8.0,7.0,3.0,7.0,24.0,7.0,4.0,35.0,16.0,35.0,4.0,2.0,133.0,10.0,8.0,3.0,8.0,35.0,7.0,6.0,57.0,10.0,44.0,7079.0,128945.0,4574.0,13.0,4076.0,13.0,3961.0,577.0,4819.0,44.0,5034.0,204.0,6603.0,131727.0
Quantil 1,,6.0,15.0,11.0,8.0,46.0,11.0,7.0,6.0,17.0,106.0,0.0,1233.0,3598.0,2797.0,0.0,65.0,44.0,55.0,41.0,56.0,57.0,40.0,51.0,64.0,46.0,,,,0.0,0.0,0.0,2.0,0.0,0.0,0.0,0.0,0.0,0.0,24.0,19.0,8.0,30.0,71.0,5.0,6.0,131.0,45.0,73.0,24.0,19.0,8.0,30.0,71.0,5.0,6.0,131.0,45.0,73.0,7.0,4.0,490.0,33.0,23.0,10.0,50.0,103.0,12.0,18.0,131.0,71.0,110.0,701.0,7.0,113.0,84.0,72.0,46.0,10.0,17.0,110.0,66.0,5.0,167.0,629.0,9.0
Quantil 2,,17.0,10.0,5.0,48.0,134.0,9.0,7.0,19.0,45.0,105.0,0.0,786.0,2235.0,703.0,2266.0,36.0,33.0,39.0,40.0,39.0,32.0,34.0,34.0,55.0,37.0,,,,35.0,11.0,11.0,0.0,27.0,40.0,8.0,49.0,24.0,21.0,45.0,36.0,14.0,49.0,85.0,22.0,14.0,86.0,59.0,82.0,45.0,36.0,14.0,49.0,85.0,22.0,14.0,86.0,59.0,82.0,43.0,15.0,690.0,32.0,59.0,20.0,69.0,84.0,18.0,28.0,74.0,82.0,80.0,686.0,6.0,55.0,165.0,53.0,62.0,2.0,3.0,89.0,79.0,6.0,117.0,555.0,5.0
Quantil 3,,12.0,12.0,18.0,49.0,49.0,10.0,15.0,5.0,72.0,40.0,1.0,550.0,1370.0,395.0,0.0,28.0,33.0,28.0,26.0,41.0,42.0,27.0,25.0,24.0,25.0,,,,0.0,0.0,0.0,23.0,0.0,0.0,0.0,0.0,0.0,0.0,44.0,58.0,31.0,54.0,51.0,44.0,35.0,26.0,57.0,46.0,44.0,58.0,31.0,54.0,51.0,44.0,35.0,26.0,57.0,46.0,86.0,36.0,573.0,58.0,56.0,43.0,56.0,36.0,43.0,54.0,19.0,44.0,33.0,592.0,29.0,38.0,138.0,34.0,54.0,1.0,0.0,51.0,91.0,7.0,49.0,537.0,19.0
Quantil 4,,30.0,11.0,5.0,71.0,21.0,38.0,13.0,29.0,51.0,17.0,2.0,279.0,761.0,353.0,1878.0,21.0,26.0,25.0,21.0,28.0,28.0,24.0,36.0,27.0,29.0,,,,0.0,35.0,45.0,0.0,59.0,67.0,23.0,84.0,61.0,0.0,47.0,43.0,46.0,36.0,27.0,51.0,45.0,9.0,44.0,28.0,47.0,43.0,46.0,36.0,27.0,51.0,45.0,9.0,44.0,28.0,192.0,78.0,400.0,50.0,52.0,51.0,33.0,14.0,54.0,45.0,9.0,46.0,12.0,493.0,54.0,20.0,85.0,15.0,87.0,1.0,0.0,26.0,78.0,4.0,45.0,497.0,57.0
Quantil 5,,89.0,74.0,37.0,13.0,10.0,97.0,4.0,6.0,7.0,4.0,0.0,182.0,424.0,286.0,0.0,15.0,17.0,22.0,19.0,16.0,17.0,20.0,17.0,15.0,24.0,,,,57.0,0.0,0.0,58.0,0.0,0.0,0.0,0.0,0.0,56.0,35.0,29.0,45.0,39.0,12.0,45.0,40.0,6.0,29.0,16.0,35.0,29.0,45.0,39.0,12.0,45.0,40.0,6.0,29.0,16.0,235.0,157.0,299.0,32.0,34.0,36.0,21.0,4.0,43.0,33.0,4.0,25.0,5.0,421.0,14.0,30.0,44.0,13.0,82.0,0.0,0.0,24.0,69.0,16.0,23.0,400.0,21.0
Quantil 6,,45.0,89.0,0.0,45.0,0.0,42.0,71.0,51.0,60.0,0.0,1.0,99.0,187.0,268.0,1630.0,21.0,16.0,16.0,17.0,9.0,12.0,11.0,12.0,12.0,18.0,,,,0.0,0.0,78.0,0.0,0.0,78.0,0.0,0.0,86.0,0.0,20.0,31.0,32.0,21.0,8.0,33.0,36.0,4.0,26.0,6.0,20.0,31.0,32.0,21.0,8.0,33.0,36.0,4.0,26.0,6.0,313.0,215.0,172.0,14.0,23.0,30.0,18.0,1.0,45.0,22.0,3.0,7.0,6.0,247.0,4.0,16.0,20.0,16.0,59.0,0.0,0.0,31.0,48.0,9.0,9.0,282.0,5.0
Quantil 7,,41.0,13.0,49.0,19.0,1.0,55.0,83.0,1.0,15.0,0.0,1.0,62.0,138.0,261.0,0.0,5.0,15.0,17.0,11.0,16.0,14.0,11.0,14.0,12.0,14.0,,,,0.0,81.0,0.0,69.0,88.0,0.0,86.0,86.0,0.0,0.0,17.0,30.0,33.0,18.0,4.0,24.0,20.0,1.0,6.0,3.0,17.0,30.0,33.0,18.0,4.0,24.0,20.0,1.0,6.0,3.0,366.0,290.0,106.0,13.0,13.0,33.0,11.0,4.0,26.0,19.0,1.0,6.0,1.0,171.0,3.0,22.0,7.0,15.0,41.0,0.0,0.0,10.0,28.0,15.0,5.0,195.0,1.0
Quantil 8,,7.0,22.0,15.0,12.0,0.0,7.0,14.0,17.0,20.0,0.0,1.0,48.0,91.0,249.0,1510.0,10.0,7.0,8.0,14.0,7.0,17.0,9.0,12.0,12.0,7.0,,,,75.0,0.0,85.0,0.0,0.0,64.0,0.0,0.0,73.0,94.0,13.0,15.0,28.0,8.0,4.0,26.0,17.0,0.0,6.0,3.0,13.0,15.0,28.0,8.0,4.0,26.0,17.0,0.0,6.0,3.0,325.0,409.0,66.0,10.0,8.0,22.0,6.0,3.0,13.0,8.0,0.0,4.0,1.0,76.0,2.0,6.0,15.0,19.0,30.0,0.0,0.0,13.0,24.0,15.0,2.0,151.0,4.0
Quantil 9,,4.0,11.0,59.0,7.0,0.0,4.0,13.0,72.0,1.0,0.0,0.0,16.0,45.0,236.0,0.0,11.0,10.0,7.0,13.0,6.0,13.0,7.0,6.0,8.0,12.0,,,,0.0,77.0,0.0,82.0,68.0,0.0,67.0,39.0,0.0,0.0,11.0,9.0,14.0,10.0,3.0,20.0,8.0,0.0,6.0,2.0,11.0,9.0,14.0,10.0,3.0,20.0,8.0,0.0,6.0,2.0,348.0,447.0,27.0,10.0,7.0,13.0,8.0,5.0,15.0,5.0,0.0,5.0,1.0,44.0,2.0,4.0,16.0,18.0,32.0,0.0,0.0,9.0,22.0,20.0,1.0,65.0,1.0
Quantil 10,,1.0,4.0,27.0,0.0,0.0,0.0,6.0,12.0,1.0,0.0,0.0,11.0,65.0,240.0,0.0,4.0,6.0,8.0,5.0,13.0,6.0,9.0,6.0,6.0,13.0,,,,0.0,0.0,0.0,0.0,0.0,0.0,0.0,0.0,0.0,0.0,1.0,5.0,14.0,7.0,8.0,8.0,13.0,0.0,6.0,3.0,1.0,5.0,14.0,7.0,8.0,8.0,13.0,0.0,6.0,3.0,286.0,357.0,23.0,4.0,3.0,16.0,4.0,3.0,9.0,9.0,0.0,3.0,4.0,16.0,1.0,7.0,6.0,15.0,18.0,0.0,0.0,7.0,19.0,31.0,2.0,36.0,3.0
Quantil 11,,0.0,6.0,7.0,2.0,2.0,11.0,4.0,8.0,1.0,0.0,0.0,17.0,62.0,231.0,1412.0,4.0,6.0,7.0,9.0,4.0,7.0,5.0,7.0,8.0,13.0,,,,61.0,0.0,51.0,43.0,0.0,38.0,0.0,0.0,46.0,64.0,5.0,3.0,6.0,3.0,4.0,5.0,9.0,0.0,4.0,3.0,5.0,3.0,6.0,3.0,4.0,5.0,9.0,0.0,4.0,3.0,244.0,337.0,11.0,7.0,6.0,7.0,3.0,6.0,7.0,3.0,0.0,4.0,2.0,7.0,3.0,2.0,4.0,6.0,14.0,0.0,0.0,9.0,15.0,31.0,0.0,12.0,0.0
Quantil 12,,1.0,0.0,5.0,4.0,1.0,1.0,1.0,1.0,4.0,2.0,0.0,10.0,43.0,271.0,0.0,7.0,9.0,2.0,3.0,6.0,6.0,2.0,8.0,6.0,9.0,,,,0.0,59.0,0.0,0.0,44.0,0.0,52.0,18.0,0.0,0.0,6.0,4.0,11.0,5.0,6.0,10.0,1.0,0.0,6.0,2.0,6.0,4.0,11.0,5.0,6.0,10.0,1.0,0.0,6.0,2.0,170.0,257.0,1.0,4.0,2.0,3.0,2.0,4.0,9.0,2.0,0.0,8.0,4.0,7.0,1.0,2.0,2.0,5.0,8.0,0.0,0.0,6.0,12.0,23.0,0.0,2.0,0.0
Quantil 13,,10.0,1.0,1.0,0.0,1.0,1.0,0.0,1.0,0.0,1.0,1.0,10.0,22.0,254.0,1251.0,3.0,2.0,4.0,7.0,5.0,3.0,3.0,6.0,6.0,6.0,,,,0.0,0.0,20.0,12.0,0.0,19.0,0.0,0.0,12.0,0.0,3.0,4.0,5.0,3.0,2.0,4.0,2.0,0.0,4.0,3.0,3.0,4.0,5.0,3.0,2.0,4.0,2.0,0.0,4.0,3.0,148.0,179.0,3.0,1.0,1.0,4.0,2.0,6.0,2.0,1.0,0.0,2.0,2.0,5.0,0.0,3.0,1.0,1.0,8.0,0.0,0.0,4.0,8.0,11.0,0.0,10.0,1.0
Quantil 14,,0.0,7.0,46.0,0.0,8.0,0.0,0.0,32.0,0.0,2.0,0.0,9.0,27.0,265.0,0.0,3.0,3.0,0.0,9.0,5.0,3.0,5.0,9.0,5.0,3.0,,,,38.0,22.0,0.0,0.0,21.0,0.0,14.0,5.0,0.0,50.0,0.0,3.0,2.0,2.0,2.0,4.0,4.0,0.0,2.0,2.0,0.0,3.0,2.0,2.0,2.0,4.0,4.0,0.0,2.0,2.0,106.0,102.0,3.0,2.0,1.0,2.0,2.0,1.0,4.0,2.0,0.0,1.0,3.0,11.0,0.0,0.0,0.0,3.0,1.0,0.0,0.0,0.0,8.0,12.0,0.0,11.0,3.0
Quantil 15,,1.0,8.0,1.0,0.0,9.0,16.0,9.0,6.0,1.0,5.0,1.0,3.0,12.0,281.0,1253.0,4.0,1.0,6.0,2.0,5.0,5.0,6.0,6.0,5.0,8.0,,,,0.0,0.0,4.0,3.0,0.0,5.0,0.0,0.0,14.0,0.0,3.0,2.0,2.0,0.0,3.0,4.0,2.0,0.0,2.0,1.0,3.0,2.0,2.0,0.0,3.0,4.0,2.0,0.0,2.0,1.0,55.0,65.0,2.0,2.0,2.0,3.0,0.0,3.0,3.0,1.0,0.0,3.0,0.0,4.0,1.0,0.0,0.0,4.0,2.0,1.0,0.0,2.0,1.0,7.0,0.0,4.0,0.0
Quantil 16,,0.0,7.0,2.0,0.0,9.0,5.0,7.0,3.0,3.0,1.0,0.0,3.0,6.0,295.0,0.0,2.0,4.0,1.0,4.0,0.0,3.0,2.0,2.0,5.0,2.0,,,,0.0,0.0,0.0,0.0,0.0,0.0,0.0,0.0,0.0,0.0,1.0,0.0,2.0,0.0,1.0,0.0,0.0,0.0,2.0,0.0,1.0,0.0,2.0,0.0,1.0,0.0,0.0,0.0,2.0,0.0,33.0,33.0,0.0,1.0,0.0,0.0,0.0,0.0,3.0,0.0,0.0,1.0,0.0,5.0,1.0,0.0,0.0,2.0,0.0,0.0,0.0,0.0,1.0,2.0,0.0,9.0,0.0
Quantil 17,,9.0,4.0,3.0,3.0,5.0,2.0,2.0,3.0,10.0,2.0,0.0,3.0,4.0,250.0,1196.0,2.0,6.0,2.0,5.0,6.0,1.0,3.0,2.0,5.0,3.0,,,,9.0,12.0,3.0,2.0,6.0,1.0,5.0,2.0,1.0,19.0,0.0,0.0,1.0,1.0,0.0,2.0,1.0,0.0,1.0,0.0,0.0,0.0,1.0,1.0,0.0,2.0,1.0,0.0,1.0,0.0,18.0,14.0,1.0,0.0,1.0,1.0,2.0,3.0,1.0,1.0,0.0,0.0,0.0,3.0,0.0,1.0,0.0,2.0,1.0,0.0,0.0,2.0,3.0,5.0,0.0,2.0,1.0
Quantil 18,,2.0,1.0,1.0,7.0,1.0,0.0,0.0,3.0,8.0,2.0,2.0,0.0,3.0,279.0,0.0,4.0,2.0,3.0,3.0,0.0,0.0,0.0,2.0,3.0,3.0,,,,0.0,0.0,0.0,0.0,0.0,0.0,0.0,0.0,0.0,0.0,0.0,1.0,1.0,0.0,0.0,2.0,0.0,0.0,0.0,0.0,0.0,1.0,1.0,0.0,0.0,2.0,0.0,0.0,0.0,0.0,14.0,4.0,0.0,0.0,1.0,1.0,0.0,0.0,0.0,0.0,0.0,0.0,0.0,4.0,0.0,0.0,0.0,0.0,0.0,0.0,0.0,1.0,1.0,4.0,0.0,1.0,0.0
Quantil 19,,5.0,1.0,4.0,5.0,3.0,1.0,1.0,3.0,4.0,4.0,1.0,3.0,7.0,297.0,148146.0,2.0,4.0,2.0,2.0,2.0,2.0,1.0,4.0,4.0,2.0,,,,1.0,2.0,1.0,1.0,1.0,1.0,2.0,1.0,1.0,3.0,1.0,2.0,1.0,3.0,1.0,1.0,1.0,1.0,2.0,1.0,1.0,2.0,1.0,3.0,1.0,1.0,1.0,1.0,2.0,1.0,9.0,1.0,1.0,1.0,1.0,1.0,1.0,1.0,3.0,1.0,1.0,1.0,1.0,1.0,1.0,1.0,1.0,1.0,1.0,1.0,1.0,1.0,2.0,1.0,1.0,5.0,2.0
