,FF.125,FF.25,FF.5,FF.75,FF1,FF2,FF4
Durchschnitt (m),16.362280376135228,14.782220034893696,15.135625740876556,11.657603995825275,16.600398235618936,5.264135601339951,2.4086627899632065
Maximum (m),42.547958320992485,45.32697558072761,53.392704685470505,56.54485885591182,46.77617075980945,21.00002538894868,7.921413280852633
Minimum (m),0.2108685976498423,0.018373358456632616,0.021453035181757552,0.013108052049616438,0.024276246504499922,0.024588444693822854,0.021501890864873623
Varianz (m),9.26724E+01,96.41019383251924,102.64830509407044,72.18012432731882,60.57487763864556,7.9293191272596895,1.9894391329762335
Simulationszeit (ms),1.073E+04,1.1134E+04,1.1218E+04,1.8922E+04,1.9468E+04,5.6947E+04,9.9912E+04
Sendemasten Erstellzeit (ms),9.45105E-01,4.53270E-05,2.699183E+00,3.795465E+00,5.196407E+00,1.4544823E+01,4.2168166E+01
Keine Station \%,9.41604202104791E-01,7.9847574895515E-01,2.49667893877861E-01,0E+00,0E+00,0E+00,0E+00
Abbruch \%,0E+00,1.75604959084045E-05,1.89774926936653E-05,6.31778456354638E-04,5.53826174970876E-04,4.29358598992526E-02,7.6058378300076E-01
Abbruch Punkt gefunden \%,7.47705E-05,1.40484E-04,6.83190E-04,8.88000E-03,6.81779E-03,3.26338E-01,2.35342E-01
Punkt gefunden \%,5.83210E-02,2.01366E-01,7.49630E-01,9.90488E-01,9.92628E-01,6.30726E-01,4.07417E-03
AVG Punkt gefunden,9.994878361075545,9.995119825708061,9.995801401219111,9.956116320724897,9.967382581113617,8.137303336626891,2.115489335955226