,R5,R10,R20,R60,R100,R200,R400
Durchschnitt (m),1.3203720489919843,2.735651394022551,5.634945720424091,16.64764703208963,27.05800289763793,4.918E+01,102.50375086663433
Maximum (m),4.519376335128696,8.362632584682125,18.043244578283822,49.59787009326225,77.58626023965112,165.5809849038092,296.6186325704494
Minimum (m),0.00654960161924418,0.017182295218336942,0.00939803934092146,0.04846704578428687,0.07606836713478966,0.03263711996766475,0.24590959715611388
Varianz (m),0.3924161750607708,1.5644079411690368,6.4649574825263185,61.927964045214075,165.03297531583183,537.9003754986478,2085.9157825678526
Simulationszeit (ms),6.21961E+05,1.52868E+05,4.9209E+04,1.7284E+04,1.4832E+04,1.4387E+04,1.6288E+04
Sendemasten Erstellzeit (ms),3.05216249E+02,8.36263E-06,2.3866462E+01,5.463566E+00,3.222034E+00,1.097546E+00,9.08497E-01
Keine Station \%,2.11778409191183E-04,3.57431758752375E-04,7.5458884340395E-05,0E+00,0E+00,0E+00,0E+00
Abbruch \%,3.03549053174029E-03,2.3139003329759E-03,1.67896017657379E-03,5.64323470213126E-04,1.34179990172733E-03,9.56278927437555E-04,1.25007211954536E-03
Abbruch Punkt gefunden \%,2.58546141220903E-02,2.36845570668021E-02,1.52049651945896E-02,6.65901694851489E-03,8.42877121366746E-03,8.51088245419424E-03,1.5058561070831E-02
Punkt gefunden \%,9.70898116936978E-01,9.7364411084147E-01,9.83040615744496E-01,9.92776659581272E-01,9.90229428884605E-01,9.90532838618368E-01,9.83691366809624E-01
AVG Punkt gefunden,9.87336886276315E+00,9.880977081957937,9.925428981782447,9.96600854491728E+00,9.958461858713548,9.956505092273527,9.927212508665178
