{
  "$schema": "https://docs.renovatebot.com/renovate-schema.json",
  "extends": [
    "config:best-practices"
  ],
  "kubernetes": {
    "fileMatch": [
      "\\.y(a)?ml$"
    ]
  },
  "tekton": {
    "fileMatch": [
      "^tekton-mnma/base/.*\\.y(a)?ml$"
    ]
  },
  "customManagers": [
    {
      "customType": "regex",
      "fileMatch": [
        "^metallb/kustomization\\.yaml$"
      ],
      "matchStrings": [
        ".*\\/_?metallb\\/metallb\\/config\\/native\\?ref=(?<currentValue>v\\d+\\.\\d+\\.\\d+?)$"
      ],
      "datasourceTemplate": "github-tags",
      "depNameTemplate": "metallb/metallb"
    }
  ],
  "packageRules": [
    {
      "matchPackageNames": [
        "photoprism/photoprism"
      ],
      "allowedVersions": "<20200120"
    },
    {
      "matchPackageNames": [
        "metallb/metallb"
      ],
      "matchManagers": [
        "custom.regex"
      ]
    },
    {
      "matchPackageNames": [
        "quay.io/buildah/stable"
      ],
      "pinDigests": false
    },
    {
      "matchPackageNames": [
        "/2tefan/*/"
      ],
      "versioning": "semver",
      "ignoreUnstable": false
    }
  ]
}
