[
  {
      "corpus": "CSJ",
      "variant": "core",
      "lang": "ja-jp",
      "type": "text/trn/form1",
      "path": "/mnt/data/CSJ/CSJ/dvd1/TRN/TRN-UTF8/core/",
      "note": "Form 1 type transcription for CSJ core",
      "encoding": "utf-8",
      "linefeed": "LF"
    }
]